{"text_format":"1","workbook":"xlsx","n_sheets":25,"sheets":["Inscriptions","RefPoule8J","Qualifications","Tours de jeu","Feuilles de match","Phase finale","Classement compétition","Statistiques joueurs","Synthèse tournois","Classement début de saison","Coordonnées joueurs","Feuilles de match ref","Etiquettes poules Ref","RefStatistiques joueurs","QualifsRefPoules8J","Tours de jeu Ref","QualifsRefPoules","QualifsRefDoubleKO","PouleRef 3 Sets","DoubleKORef","8èmesRef3Sets","DemisRef3Sets","QuartsRef3Sets","RefClassement compétition","8èmesFinalRef"],"not_rendered":{"charts":0,"images":1,"macros":1,"external_links":0,"defined_names":33,"comments":3,"pivot_tables":0},"unopened":[],"bounds":{"document_bytes":16777216,"sheet_cells":100000,"rows_first":2000,"rows_last":500,"rows_between":2000,"halvings":0,"cell_chars":16384,"cell_head_chars":4096},"cells_cut":0,"cells_raw":0,"read":"whole","date_system":"1900"}

{"sheet":"Inscriptions","index":0,"n_rows":208,"n_cols":14,"rows_kept":208,"cut":false,"hidden":false,"merged":[[0,8,0,13],[7,9,7,10]]}
["Compétitions 5Q  - v7.1","Paramètres","Poules 3J C","8èmes","Phase Finale","Nombre de joueurs inscrits ",{"$f":"200-COUNTIF(A9:A208,\"\")","v":9},"Epreuve","T3 Qualification CD62 R1"]
["© JC Wallart","Nb de sets gagnants",2,2,2,"Nb J maxi pour 1/2F directement",10,"Date ","2019-01-13"]
["INSCRIPTIONS","Distance",60,60,60,"Nb J maxi pour 1/4F directement",18,"Lieu ","WIMILLE"]
["(maximum 200 joueurs)","Valeur Point de Match",2,"Clst 8è","OUI",{"$f":" \"  Phase 8èmes  si > \" & G3","v":"  Phase 8èmes  si > 18"},null,"N° de tournoi",3]
[null,"Bonus 1er de poule (3J)",1,"RàZ pts","NON"]
[null,"Gestion rencontre directe","FR","1/2F crois.","NON"]
[null,null,null,null,null,null,null,null,null,"Points de tournoi"]
["Nom","Ville ou Club","Clst initial",null,null,"Dispensé(s) de qualifications","Clst init.",null,null,"Classement",null,"Points"]
["MONTADOR Christophe",{"$f":"IF(A9<>\"\",INDEX(Liste_Classement,MATCH(A9,Liste_joueurs,0),1),\"\")","v":"WIMILLE"},{"$f":"IF(A9<>\"\",INDEX(Liste_Classement,MATCH(A9,Liste_joueurs,0),3),\"\")","v":1},null,null,null,{"$f":"IF(F9<>\"\",INDEX(Liste_Classement,MATCH(F9,Liste_joueurs,0),3),\"\")","v":""},null,null,"de","à","attribués",null,"Adresses Mail"]
["MONTADOR Ludovic",{"$f":"IF(A10<>\"\",INDEX(Liste_Classement,MATCH(A10,Liste_joueurs,0),1),\"\")","v":"WIMILLE"},{"$f":"IF(A10<>\"\",INDEX(Liste_Classement,MATCH(A10,Liste_joueurs,0),3),\"\")","v":2},null,null,null,"",null,null,1,1,14]
["MARTEL Bruno",{"$f":"IF(A11<>\"\",INDEX(Liste_Classement,MATCH(A11,Liste_joueurs,0),1),\"\")","v":"CUCQ"},{"$f":"IF(A11<>\"\",INDEX(Liste_Classement,MATCH(A11,Liste_joueurs,0),3),\"\")","v":3},null,null,null,"",null,null,2,2,10]
["CARTIERE André",{"$f":"IF(A12<>\"\",INDEX(Liste_Classement,MATCH(A12,Liste_joueurs,0),1),\"\")","v":"CUCQ"},{"$f":"IF(A12<>\"\",INDEX(Liste_Classement,MATCH(A12,Liste_joueurs,0),3),\"\")","v":4},null,null,null,"",null,null,3,4,8]
["DEPLECHIN Roland",{"$f":"IF(A13<>\"\",INDEX(Liste_Classement,MATCH(A13,Liste_joueurs,0),1),\"\")","v":"CUCQ"},{"$f":"IF(A13<>\"\",INDEX(Liste_Classement,MATCH(A13,Liste_joueurs,0),3),\"\")","v":5},null,null,null,"",null,null,5,8,6]
["FLAHAUT Ghislain",{"$f":"IF(A14<>\"\",INDEX(Liste_Classement,MATCH(A14,Liste_joueurs,0),1),\"\")","v":"CUCQ"},{"$f":"IF(A14<>\"\",INDEX(Liste_Classement,MATCH(A14,Liste_joueurs,0),3),\"\")","v":6},null,null,null,"",null,null,9,16,4]
["RAMET Jacques",{"$f":"IF(A15<>\"\",INDEX(Liste_Classement,MATCH(A15,Liste_joueurs,0),1),\"\")","v":"CUCQ"},{"$f":"IF(A15<>\"\",INDEX(Liste_Classement,MATCH(A15,Liste_joueurs,0),3),\"\")","v":7},null,null,null,"",null,null,17,24,2]
["TIZON Alain",{"$f":"IF(A16<>\"\",INDEX(Liste_Classement,MATCH(A16,Liste_joueurs,0),1),\"\")","v":"CUCQ"},{"$f":"IF(A16<>\"\",INDEX(Liste_Classement,MATCH(A16,Liste_joueurs,0),3),\"\")","v":8},null,null,null,"",null,null,25,32,1]
["SAISON Bertrand",{"$f":"IF(A17<>\"\",INDEX(Liste_Classement,MATCH(A17,Liste_joueurs,0),1),\"\")","v":"CUCQ"},{"$f":"IF(A17<>\"\",INDEX(Liste_Classement,MATCH(A17,Liste_joueurs,0),3),\"\")","v":9},null,null,null,""]
[null,{"$f":"IF(A18<>\"\",INDEX(Liste_Classement,MATCH(A18,Liste_joueurs,0),1),\"\")","v":""},{"$f":"IF(A18<>\"\",INDEX(Liste_Classement,MATCH(A18,Liste_joueurs,0),3),\"\")","v":""},null,null,null,""]
[null,{"$f":"IF(A19<>\"\",INDEX(Liste_Classement,MATCH(A19,Liste_joueurs,0),1),\"\")","v":""},{"$f":"IF(A19<>\"\",INDEX(Liste_Classement,MATCH(A19,Liste_joueurs,0),3),\"\")","v":""},null,null,null,""]
[null,{"$f":"IF(A20<>\"\",INDEX(Liste_Classement,MATCH(A20,Liste_joueurs,0),1),\"\")","v":""},{"$f":"IF(A20<>\"\",INDEX(Liste_Classement,MATCH(A20,Liste_joueurs,0),3),\"\")","v":""},null,null,{"$f":"IF(11-COUNTIF(F9:F19,\"\")=0,\"\",\"Nb dispensés\")","v":""},{"$f":"IF(11-COUNTIF(F9:F19,\"\")=0,\"\",11-COUNTIF(F9:F19,\"\"))","v":""}]
[null,{"$f":"IF(A21<>\"\",INDEX(Liste_Classement,MATCH(A21,Liste_joueurs,0),1),\"\")","v":""},{"$f":"IF(A21<>\"\",INDEX(Liste_Classement,MATCH(A21,Liste_joueurs,0),3),\"\")","v":""}]
[null,{"$f":"IF(A22<>\"\",INDEX(Liste_Classement,MATCH(A22,Liste_joueurs,0),1),\"\")","v":""},{"$f":"IF(A22<>\"\",INDEX(Liste_Classement,MATCH(A22,Liste_joueurs,0),3),\"\")","v":""}]
[null,{"$f":"IF(A23<>\"\",INDEX(Liste_Classement,MATCH(A23,Liste_joueurs,0),1),\"\")","v":""},{"$f":"IF(A23<>\"\",INDEX(Liste_Classement,MATCH(A23,Liste_joueurs,0),3),\"\")","v":""},null,null,"Forfait(s) pour la phase finale"]
[null,{"$f":"IF(A24<>\"\",INDEX(Liste_Classement,MATCH(A24,Liste_joueurs,0),1),\"\")","v":""},{"$f":"IF(A24<>\"\",INDEX(Liste_Classement,MATCH(A24,Liste_joueurs,0),3),\"\")","v":""}]
[null,{"$f":"IF(A25<>\"\",INDEX(Liste_Classement,MATCH(A25,Liste_joueurs,0),1),\"\")","v":""},{"$f":"IF(A25<>\"\",INDEX(Liste_Classement,MATCH(A25,Liste_joueurs,0),3),\"\")","v":""}]
[null,{"$f":"IF(A26<>\"\",INDEX(Liste_Classement,MATCH(A26,Liste_joueurs,0),1),\"\")","v":""},{"$f":"IF(A26<>\"\",INDEX(Liste_Classement,MATCH(A26,Liste_joueurs,0),3),\"\")","v":""}]
[null,{"$f":"IF(A27<>\"\",INDEX(Liste_Classement,MATCH(A27,Liste_joueurs,0),1),\"\")","v":""},{"$f":"IF(A27<>\"\",INDEX(Liste_Classement,MATCH(A27,Liste_joueurs,0),3),\"\")","v":""}]
[null,{"$f":"IF(A28<>\"\",INDEX(Liste_Classement,MATCH(A28,Liste_joueurs,0),1),\"\")","v":""},{"$f":"IF(A28<>\"\",INDEX(Liste_Classement,MATCH(A28,Liste_joueurs,0),3),\"\")","v":""}]
[null,{"$f":"IF(A29<>\"\",INDEX(Liste_Classement,MATCH(A29,Liste_joueurs,0),1),\"\")","v":""},{"$f":"IF(A29<>\"\",INDEX(Liste_Classement,MATCH(A29,Liste_joueurs,0),3),\"\")","v":""}]
[null,{"$f":"IF(A30<>\"\",INDEX(Liste_Classement,MATCH(A30,Liste_joueurs,0),1),\"\")","v":""},{"$f":"IF(A30<>\"\",INDEX(Liste_Classement,MATCH(A30,Liste_joueurs,0),3),\"\")","v":""}]
[null,{"$f":"IF(A31<>\"\",INDEX(Liste_Classement,MATCH(A31,Liste_joueurs,0),1),\"\")","v":""},{"$f":"IF(A31<>\"\",INDEX(Liste_Classement,MATCH(A31,Liste_joueurs,0),3),\"\")","v":""}]
[null,{"$f":"IF(A32<>\"\",INDEX(Liste_Classement,MATCH(A32,Liste_joueurs,0),1),\"\")","v":""},{"$f":"IF(A32<>\"\",INDEX(Liste_Classement,MATCH(A32,Liste_joueurs,0),3),\"\")","v":""}]
[null,{"$f":"IF(A33<>\"\",INDEX(Liste_Classement,MATCH(A33,Liste_joueurs,0),1),\"\")","v":""},{"$f":"IF(A33<>\"\",INDEX(Liste_Classement,MATCH(A33,Liste_joueurs,0),3),\"\")","v":""}]
[null,{"$f":"IF(A34<>\"\",INDEX(Liste_Classement,MATCH(A34,Liste_joueurs,0),1),\"\")","v":""},{"$f":"IF(A34<>\"\",INDEX(Liste_Classement,MATCH(A34,Liste_joueurs,0),3),\"\")","v":""}]
[null,{"$f":"IF(A35<>\"\",INDEX(Liste_Classement,MATCH(A35,Liste_joueurs,0),1),\"\")","v":""},{"$f":"IF(A35<>\"\",INDEX(Liste_Classement,MATCH(A35,Liste_joueurs,0),3),\"\")","v":""},null,null,{"$f":"IF(11-COUNTIF(F24:F34,\"\")=0,\"\",\"Nb forfaits\")","v":""},{"$f":"IF(11-COUNTIF(F24:F34,\"\")=0,\"\",11-COUNTIF(F24:F34,\"\"))","v":""}]
[null,{"$f":"IF(A36<>\"\",INDEX(Liste_Classement,MATCH(A36,Liste_joueurs,0),1),\"\")","v":""},{"$f":"IF(A36<>\"\",INDEX(Liste_Classement,MATCH(A36,Liste_joueurs,0),3),\"\")","v":""}]
[null,{"$f":"IF(A37<>\"\",INDEX(Liste_Classement,MATCH(A37,Liste_joueurs,0),1),\"\")","v":""},{"$f":"IF(A37<>\"\",INDEX(Liste_Classement,MATCH(A37,Liste_joueurs,0),3),\"\")","v":""}]
[null,{"$f":"IF(A38<>\"\",INDEX(Liste_Classement,MATCH(A38,Liste_joueurs,0),1),\"\")","v":""},{"$f":"IF(A38<>\"\",INDEX(Liste_Classement,MATCH(A38,Liste_joueurs,0),3),\"\")","v":""}]
[null,{"$f":"IF(A39<>\"\",INDEX(Liste_Classement,MATCH(A39,Liste_joueurs,0),1),\"\")","v":""},{"$f":"IF(A39<>\"\",INDEX(Liste_Classement,MATCH(A39,Liste_joueurs,0),3),\"\")","v":""}]
[null,{"$f":"IF(A40<>\"\",INDEX(Liste_Classement,MATCH(A40,Liste_joueurs,0),1),\"\")","v":""},{"$f":"IF(A40<>\"\",INDEX(Liste_Classement,MATCH(A40,Liste_joueurs,0),3),\"\")","v":""}]
[null,{"$f":"IF(A41<>\"\",INDEX(Liste_Classement,MATCH(A41,Liste_joueurs,0),1),\"\")","v":""},{"$f":"IF(A41<>\"\",INDEX(Liste_Classement,MATCH(A41,Liste_joueurs,0),3),\"\")","v":""}]
[null,{"$f":"IF(A42<>\"\",INDEX(Liste_Classement,MATCH(A42,Liste_joueurs,0),1),\"\")","v":""},{"$f":"IF(A42<>\"\",INDEX(Liste_Classement,MATCH(A42,Liste_joueurs,0),3),\"\")","v":""}]
[null,{"$f":"IF(A43<>\"\",INDEX(Liste_Classement,MATCH(A43,Liste_joueurs,0),1),\"\")","v":""},{"$f":"IF(A43<>\"\",INDEX(Liste_Classement,MATCH(A43,Liste_joueurs,0),3),\"\")","v":""}]
[null,{"$f":"IF(A44<>\"\",INDEX(Liste_Classement,MATCH(A44,Liste_joueurs,0),1),\"\")","v":""},{"$f":"IF(A44<>\"\",INDEX(Liste_Classement,MATCH(A44,Liste_joueurs,0),3),\"\")","v":""}]
[null,{"$f":"IF(A45<>\"\",INDEX(Liste_Classement,MATCH(A45,Liste_joueurs,0),1),\"\")","v":""},{"$f":"IF(A45<>\"\",INDEX(Liste_Classement,MATCH(A45,Liste_joueurs,0),3),\"\")","v":""}]
[null,{"$f":"IF(A46<>\"\",INDEX(Liste_Classement,MATCH(A46,Liste_joueurs,0),1),\"\")","v":""},{"$f":"IF(A46<>\"\",INDEX(Liste_Classement,MATCH(A46,Liste_joueurs,0),3),\"\")","v":""}]
[null,{"$f":"IF(A47<>\"\",INDEX(Liste_Classement,MATCH(A47,Liste_joueurs,0),1),\"\")","v":""},{"$f":"IF(A47<>\"\",INDEX(Liste_Classement,MATCH(A47,Liste_joueurs,0),3),\"\")","v":""}]
[null,{"$f":"IF(A48<>\"\",INDEX(Liste_Classement,MATCH(A48,Liste_joueurs,0),1),\"\")","v":""},{"$f":"IF(A48<>\"\",INDEX(Liste_Classement,MATCH(A48,Liste_joueurs,0),3),\"\")","v":""}]
[null,{"$f":"IF(A49<>\"\",INDEX(Liste_Classement,MATCH(A49,Liste_joueurs,0),1),\"\")","v":""},{"$f":"IF(A49<>\"\",INDEX(Liste_Classement,MATCH(A49,Liste_joueurs,0),3),\"\")","v":""}]
[null,{"$f":"IF(A50<>\"\",INDEX(Liste_Classement,MATCH(A50,Liste_joueurs,0),1),\"\")","v":""},{"$f":"IF(A50<>\"\",INDEX(Liste_Classement,MATCH(A50,Liste_joueurs,0),3),\"\")","v":""}]
[null,{"$f":"IF(A51<>\"\",INDEX(Liste_Classement,MATCH(A51,Liste_joueurs,0),1),\"\")","v":""},{"$f":"IF(A51<>\"\",INDEX(Liste_Classement,MATCH(A51,Liste_joueurs,0),3),\"\")","v":""}]
[null,{"$f":"IF(A52<>\"\",INDEX(Liste_Classement,MATCH(A52,Liste_joueurs,0),1),\"\")","v":""},{"$f":"IF(A52<>\"\",INDEX(Liste_Classement,MATCH(A52,Liste_joueurs,0),3),\"\")","v":""}]
[null,{"$f":"IF(A53<>\"\",INDEX(Liste_Classement,MATCH(A53,Liste_joueurs,0),1),\"\")","v":""},{"$f":"IF(A53<>\"\",INDEX(Liste_Classement,MATCH(A53,Liste_joueurs,0),3),\"\")","v":""}]
[null,{"$f":"IF(A54<>\"\",INDEX(Liste_Classement,MATCH(A54,Liste_joueurs,0),1),\"\")","v":""},{"$f":"IF(A54<>\"\",INDEX(Liste_Classement,MATCH(A54,Liste_joueurs,0),3),\"\")","v":""}]
[null,{"$f":"IF(A55<>\"\",INDEX(Liste_Classement,MATCH(A55,Liste_joueurs,0),1),\"\")","v":""},{"$f":"IF(A55<>\"\",INDEX(Liste_Classement,MATCH(A55,Liste_joueurs,0),3),\"\")","v":""}]
[null,{"$f":"IF(A56<>\"\",INDEX(Liste_Classement,MATCH(A56,Liste_joueurs,0),1),\"\")","v":""},{"$f":"IF(A56<>\"\",INDEX(Liste_Classement,MATCH(A56,Liste_joueurs,0),3),\"\")","v":""}]
[null,{"$f":"IF(A57<>\"\",INDEX(Liste_Classement,MATCH(A57,Liste_joueurs,0),1),\"\")","v":""},{"$f":"IF(A57<>\"\",INDEX(Liste_Classement,MATCH(A57,Liste_joueurs,0),3),\"\")","v":""}]
[null,{"$f":"IF(A58<>\"\",INDEX(Liste_Classement,MATCH(A58,Liste_joueurs,0),1),\"\")","v":""},{"$f":"IF(A58<>\"\",INDEX(Liste_Classement,MATCH(A58,Liste_joueurs,0),3),\"\")","v":""}]
[null,{"$f":"IF(A59<>\"\",INDEX(Liste_Classement,MATCH(A59,Liste_joueurs,0),1),\"\")","v":""},{"$f":"IF(A59<>\"\",INDEX(Liste_Classement,MATCH(A59,Liste_joueurs,0),3),\"\")","v":""}]
[null,{"$f":"IF(A60<>\"\",INDEX(Liste_Classement,MATCH(A60,Liste_joueurs,0),1),\"\")","v":""},{"$f":"IF(A60<>\"\",INDEX(Liste_Classement,MATCH(A60,Liste_joueurs,0),3),\"\")","v":""}]
[null,{"$f":"IF(A61<>\"\",INDEX(Liste_Classement,MATCH(A61,Liste_joueurs,0),1),\"\")","v":""},{"$f":"IF(A61<>\"\",INDEX(Liste_Classement,MATCH(A61,Liste_joueurs,0),3),\"\")","v":""}]
[null,{"$f":"IF(A62<>\"\",INDEX(Liste_Classement,MATCH(A62,Liste_joueurs,0),1),\"\")","v":""},{"$f":"IF(A62<>\"\",INDEX(Liste_Classement,MATCH(A62,Liste_joueurs,0),3),\"\")","v":""}]
[null,{"$f":"IF(A63<>\"\",INDEX(Liste_Classement,MATCH(A63,Liste_joueurs,0),1),\"\")","v":""},{"$f":"IF(A63<>\"\",INDEX(Liste_Classement,MATCH(A63,Liste_joueurs,0),3),\"\")","v":""}]
[null,{"$f":"IF(A64<>\"\",INDEX(Liste_Classement,MATCH(A64,Liste_joueurs,0),1),\"\")","v":""},{"$f":"IF(A64<>\"\",INDEX(Liste_Classement,MATCH(A64,Liste_joueurs,0),3),\"\")","v":""}]
[null,{"$f":"IF(A65<>\"\",INDEX(Liste_Classement,MATCH(A65,Liste_joueurs,0),1),\"\")","v":""},{"$f":"IF(A65<>\"\",INDEX(Liste_Classement,MATCH(A65,Liste_joueurs,0),3),\"\")","v":""}]
[null,{"$f":"IF(A66<>\"\",INDEX(Liste_Classement,MATCH(A66,Liste_joueurs,0),1),\"\")","v":""},{"$f":"IF(A66<>\"\",INDEX(Liste_Classement,MATCH(A66,Liste_joueurs,0),3),\"\")","v":""}]
[null,{"$f":"IF(A67<>\"\",INDEX(Liste_Classement,MATCH(A67,Liste_joueurs,0),1),\"\")","v":""},{"$f":"IF(A67<>\"\",INDEX(Liste_Classement,MATCH(A67,Liste_joueurs,0),3),\"\")","v":""}]
[null,{"$f":"IF(A68<>\"\",INDEX(Liste_Classement,MATCH(A68,Liste_joueurs,0),1),\"\")","v":""},{"$f":"IF(A68<>\"\",INDEX(Liste_Classement,MATCH(A68,Liste_joueurs,0),3),\"\")","v":""}]
[null,{"$f":"IF(A69<>\"\",INDEX(Liste_Classement,MATCH(A69,Liste_joueurs,0),1),\"\")","v":""},{"$f":"IF(A69<>\"\",INDEX(Liste_Classement,MATCH(A69,Liste_joueurs,0),3),\"\")","v":""}]
[null,{"$f":"IF(A70<>\"\",INDEX(Liste_Classement,MATCH(A70,Liste_joueurs,0),1),\"\")","v":""},{"$f":"IF(A70<>\"\",INDEX(Liste_Classement,MATCH(A70,Liste_joueurs,0),3),\"\")","v":""}]
[null,{"$f":"IF(A71<>\"\",INDEX(Liste_Classement,MATCH(A71,Liste_joueurs,0),1),\"\")","v":""},{"$f":"IF(A71<>\"\",INDEX(Liste_Classement,MATCH(A71,Liste_joueurs,0),3),\"\")","v":""}]
[null,{"$f":"IF(A72<>\"\",INDEX(Liste_Classement,MATCH(A72,Liste_joueurs,0),1),\"\")","v":""},{"$f":"IF(A72<>\"\",INDEX(Liste_Classement,MATCH(A72,Liste_joueurs,0),3),\"\")","v":""}]
[null,{"$f":"IF(A73<>\"\",INDEX(Liste_Classement,MATCH(A73,Liste_joueurs,0),1),\"\")","v":""},{"$f":"IF(A73<>\"\",INDEX(Liste_Classement,MATCH(A73,Liste_joueurs,0),3),\"\")","v":""}]
[null,{"$f":"IF(A74<>\"\",INDEX(Liste_Classement,MATCH(A74,Liste_joueurs,0),1),\"\")","v":""},{"$f":"IF(A74<>\"\",INDEX(Liste_Classement,MATCH(A74,Liste_joueurs,0),3),\"\")","v":""}]
[null,{"$f":"IF(A75<>\"\",INDEX(Liste_Classement,MATCH(A75,Liste_joueurs,0),1),\"\")","v":""},{"$f":"IF(A75<>\"\",INDEX(Liste_Classement,MATCH(A75,Liste_joueurs,0),3),\"\")","v":""}]
[null,{"$f":"IF(A76<>\"\",INDEX(Liste_Classement,MATCH(A76,Liste_joueurs,0),1),\"\")","v":""},{"$f":"IF(A76<>\"\",INDEX(Liste_Classement,MATCH(A76,Liste_joueurs,0),3),\"\")","v":""}]
[null,{"$f":"IF(A77<>\"\",INDEX(Liste_Classement,MATCH(A77,Liste_joueurs,0),1),\"\")","v":""},{"$f":"IF(A77<>\"\",INDEX(Liste_Classement,MATCH(A77,Liste_joueurs,0),3),\"\")","v":""}]
[null,{"$f":"IF(A78<>\"\",INDEX(Liste_Classement,MATCH(A78,Liste_joueurs,0),1),\"\")","v":""},{"$f":"IF(A78<>\"\",INDEX(Liste_Classement,MATCH(A78,Liste_joueurs,0),3),\"\")","v":""}]
[null,{"$f":"IF(A79<>\"\",INDEX(Liste_Classement,MATCH(A79,Liste_joueurs,0),1),\"\")","v":""},{"$f":"IF(A79<>\"\",INDEX(Liste_Classement,MATCH(A79,Liste_joueurs,0),3),\"\")","v":""}]
[null,{"$f":"IF(A80<>\"\",INDEX(Liste_Classement,MATCH(A80,Liste_joueurs,0),1),\"\")","v":""},{"$f":"IF(A80<>\"\",INDEX(Liste_Classement,MATCH(A80,Liste_joueurs,0),3),\"\")","v":""}]
[null,{"$f":"IF(A81<>\"\",INDEX(Liste_Classement,MATCH(A81,Liste_joueurs,0),1),\"\")","v":""},{"$f":"IF(A81<>\"\",INDEX(Liste_Classement,MATCH(A81,Liste_joueurs,0),3),\"\")","v":""}]
[null,{"$f":"IF(A82<>\"\",INDEX(Liste_Classement,MATCH(A82,Liste_joueurs,0),1),\"\")","v":""},{"$f":"IF(A82<>\"\",INDEX(Liste_Classement,MATCH(A82,Liste_joueurs,0),3),\"\")","v":""}]
[null,{"$f":"IF(A83<>\"\",INDEX(Liste_Classement,MATCH(A83,Liste_joueurs,0),1),\"\")","v":""},{"$f":"IF(A83<>\"\",INDEX(Liste_Classement,MATCH(A83,Liste_joueurs,0),3),\"\")","v":""}]
[null,{"$f":"IF(A84<>\"\",INDEX(Liste_Classement,MATCH(A84,Liste_joueurs,0),1),\"\")","v":""},{"$f":"IF(A84<>\"\",INDEX(Liste_Classement,MATCH(A84,Liste_joueurs,0),3),\"\")","v":""}]
[null,{"$f":"IF(A85<>\"\",INDEX(Liste_Classement,MATCH(A85,Liste_joueurs,0),1),\"\")","v":""},{"$f":"IF(A85<>\"\",INDEX(Liste_Classement,MATCH(A85,Liste_joueurs,0),3),\"\")","v":""}]
[null,{"$f":"IF(A86<>\"\",INDEX(Liste_Classement,MATCH(A86,Liste_joueurs,0),1),\"\")","v":""},{"$f":"IF(A86<>\"\",INDEX(Liste_Classement,MATCH(A86,Liste_joueurs,0),3),\"\")","v":""}]
[null,{"$f":"IF(A87<>\"\",INDEX(Liste_Classement,MATCH(A87,Liste_joueurs,0),1),\"\")","v":""},{"$f":"IF(A87<>\"\",INDEX(Liste_Classement,MATCH(A87,Liste_joueurs,0),3),\"\")","v":""}]
[null,{"$f":"IF(A88<>\"\",INDEX(Liste_Classement,MATCH(A88,Liste_joueurs,0),1),\"\")","v":""},{"$f":"IF(A88<>\"\",INDEX(Liste_Classement,MATCH(A88,Liste_joueurs,0),3),\"\")","v":""}]
[null,{"$f":"IF(A89<>\"\",INDEX(Liste_Classement,MATCH(A89,Liste_joueurs,0),1),\"\")","v":""},{"$f":"IF(A89<>\"\",INDEX(Liste_Classement,MATCH(A89,Liste_joueurs,0),3),\"\")","v":""}]
[null,{"$f":"IF(A90<>\"\",INDEX(Liste_Classement,MATCH(A90,Liste_joueurs,0),1),\"\")","v":""},{"$f":"IF(A90<>\"\",INDEX(Liste_Classement,MATCH(A90,Liste_joueurs,0),3),\"\")","v":""}]
[null,{"$f":"IF(A91<>\"\",INDEX(Liste_Classement,MATCH(A91,Liste_joueurs,0),1),\"\")","v":""},{"$f":"IF(A91<>\"\",INDEX(Liste_Classement,MATCH(A91,Liste_joueurs,0),3),\"\")","v":""}]
[null,{"$f":"IF(A92<>\"\",INDEX(Liste_Classement,MATCH(A92,Liste_joueurs,0),1),\"\")","v":""},{"$f":"IF(A92<>\"\",INDEX(Liste_Classement,MATCH(A92,Liste_joueurs,0),3),\"\")","v":""}]
[null,{"$f":"IF(A93<>\"\",INDEX(Liste_Classement,MATCH(A93,Liste_joueurs,0),1),\"\")","v":""},{"$f":"IF(A93<>\"\",INDEX(Liste_Classement,MATCH(A93,Liste_joueurs,0),3),\"\")","v":""}]
[null,{"$f":"IF(A94<>\"\",INDEX(Liste_Classement,MATCH(A94,Liste_joueurs,0),1),\"\")","v":""},{"$f":"IF(A94<>\"\",INDEX(Liste_Classement,MATCH(A94,Liste_joueurs,0),3),\"\")","v":""}]
[null,{"$f":"IF(A95<>\"\",INDEX(Liste_Classement,MATCH(A95,Liste_joueurs,0),1),\"\")","v":""},{"$f":"IF(A95<>\"\",INDEX(Liste_Classement,MATCH(A95,Liste_joueurs,0),3),\"\")","v":""}]
[null,{"$f":"IF(A96<>\"\",INDEX(Liste_Classement,MATCH(A96,Liste_joueurs,0),1),\"\")","v":""},{"$f":"IF(A96<>\"\",INDEX(Liste_Classement,MATCH(A96,Liste_joueurs,0),3),\"\")","v":""}]
[null,{"$f":"IF(A97<>\"\",INDEX(Liste_Classement,MATCH(A97,Liste_joueurs,0),1),\"\")","v":""},{"$f":"IF(A97<>\"\",INDEX(Liste_Classement,MATCH(A97,Liste_joueurs,0),3),\"\")","v":""}]
[null,{"$f":"IF(A98<>\"\",INDEX(Liste_Classement,MATCH(A98,Liste_joueurs,0),1),\"\")","v":""},{"$f":"IF(A98<>\"\",INDEX(Liste_Classement,MATCH(A98,Liste_joueurs,0),3),\"\")","v":""}]
[null,{"$f":"IF(A99<>\"\",INDEX(Liste_Classement,MATCH(A99,Liste_joueurs,0),1),\"\")","v":""},{"$f":"IF(A99<>\"\",INDEX(Liste_Classement,MATCH(A99,Liste_joueurs,0),3),\"\")","v":""}]
[null,{"$f":"IF(A100<>\"\",INDEX(Liste_Classement,MATCH(A100,Liste_joueurs,0),1),\"\")","v":""},{"$f":"IF(A100<>\"\",INDEX(Liste_Classement,MATCH(A100,Liste_joueurs,0),3),\"\")","v":""}]
[null,{"$f":"IF(A101<>\"\",INDEX(Liste_Classement,MATCH(A101,Liste_joueurs,0),1),\"\")","v":""},{"$f":"IF(A101<>\"\",INDEX(Liste_Classement,MATCH(A101,Liste_joueurs,0),3),\"\")","v":""}]
[null,{"$f":"IF(A102<>\"\",INDEX(Liste_Classement,MATCH(A102,Liste_joueurs,0),1),\"\")","v":""},{"$f":"IF(A102<>\"\",INDEX(Liste_Classement,MATCH(A102,Liste_joueurs,0),3),\"\")","v":""}]
[null,{"$f":"IF(A103<>\"\",INDEX(Liste_Classement,MATCH(A103,Liste_joueurs,0),1),\"\")","v":""},{"$f":"IF(A103<>\"\",INDEX(Liste_Classement,MATCH(A103,Liste_joueurs,0),3),\"\")","v":""}]
[null,{"$f":"IF(A104<>\"\",INDEX(Liste_Classement,MATCH(A104,Liste_joueurs,0),1),\"\")","v":""},{"$f":"IF(A104<>\"\",INDEX(Liste_Classement,MATCH(A104,Liste_joueurs,0),3),\"\")","v":""}]
[null,{"$f":"IF(A105<>\"\",INDEX(Liste_Classement,MATCH(A105,Liste_joueurs,0),1),\"\")","v":""},{"$f":"IF(A105<>\"\",INDEX(Liste_Classement,MATCH(A105,Liste_joueurs,0),3),\"\")","v":""}]
[null,{"$f":"IF(A106<>\"\",INDEX(Liste_Classement,MATCH(A106,Liste_joueurs,0),1),\"\")","v":""},{"$f":"IF(A106<>\"\",INDEX(Liste_Classement,MATCH(A106,Liste_joueurs,0),3),\"\")","v":""}]
[null,{"$f":"IF(A107<>\"\",INDEX(Liste_Classement,MATCH(A107,Liste_joueurs,0),1),\"\")","v":""},{"$f":"IF(A107<>\"\",INDEX(Liste_Classement,MATCH(A107,Liste_joueurs,0),3),\"\")","v":""}]
[null,{"$f":"IF(A108<>\"\",INDEX(Liste_Classement,MATCH(A108,Liste_joueurs,0),1),\"\")","v":""},{"$f":"IF(A108<>\"\",INDEX(Liste_Classement,MATCH(A108,Liste_joueurs,0),3),\"\")","v":""}]
[null,{"$f":"IF(A109<>\"\",INDEX(Liste_Classement,MATCH(A109,Liste_joueurs,0),1),\"\")","v":""},{"$f":"IF(A109<>\"\",INDEX(Liste_Classement,MATCH(A109,Liste_joueurs,0),3),\"\")","v":""}]
[null,{"$f":"IF(A110<>\"\",INDEX(Liste_Classement,MATCH(A110,Liste_joueurs,0),1),\"\")","v":""},{"$f":"IF(A110<>\"\",INDEX(Liste_Classement,MATCH(A110,Liste_joueurs,0),3),\"\")","v":""}]
[null,{"$f":"IF(A111<>\"\",INDEX(Liste_Classement,MATCH(A111,Liste_joueurs,0),1),\"\")","v":""},{"$f":"IF(A111<>\"\",INDEX(Liste_Classement,MATCH(A111,Liste_joueurs,0),3),\"\")","v":""}]
[null,{"$f":"IF(A112<>\"\",INDEX(Liste_Classement,MATCH(A112,Liste_joueurs,0),1),\"\")","v":""},{"$f":"IF(A112<>\"\",INDEX(Liste_Classement,MATCH(A112,Liste_joueurs,0),3),\"\")","v":""}]
[null,{"$f":"IF(A113<>\"\",INDEX(Liste_Classement,MATCH(A113,Liste_joueurs,0),1),\"\")","v":""},{"$f":"IF(A113<>\"\",INDEX(Liste_Classement,MATCH(A113,Liste_joueurs,0),3),\"\")","v":""}]
[null,{"$f":"IF(A114<>\"\",INDEX(Liste_Classement,MATCH(A114,Liste_joueurs,0),1),\"\")","v":""},{"$f":"IF(A114<>\"\",INDEX(Liste_Classement,MATCH(A114,Liste_joueurs,0),3),\"\")","v":""}]
[null,{"$f":"IF(A115<>\"\",INDEX(Liste_Classement,MATCH(A115,Liste_joueurs,0),1),\"\")","v":""},{"$f":"IF(A115<>\"\",INDEX(Liste_Classement,MATCH(A115,Liste_joueurs,0),3),\"\")","v":""}]
[null,{"$f":"IF(A116<>\"\",INDEX(Liste_Classement,MATCH(A116,Liste_joueurs,0),1),\"\")","v":""},{"$f":"IF(A116<>\"\",INDEX(Liste_Classement,MATCH(A116,Liste_joueurs,0),3),\"\")","v":""}]
[null,{"$f":"IF(A117<>\"\",INDEX(Liste_Classement,MATCH(A117,Liste_joueurs,0),1),\"\")","v":""},{"$f":"IF(A117<>\"\",INDEX(Liste_Classement,MATCH(A117,Liste_joueurs,0),3),\"\")","v":""}]
[null,{"$f":"IF(A118<>\"\",INDEX(Liste_Classement,MATCH(A118,Liste_joueurs,0),1),\"\")","v":""},{"$f":"IF(A118<>\"\",INDEX(Liste_Classement,MATCH(A118,Liste_joueurs,0),3),\"\")","v":""}]
[null,{"$f":"IF(A119<>\"\",INDEX(Liste_Classement,MATCH(A119,Liste_joueurs,0),1),\"\")","v":""},{"$f":"IF(A119<>\"\",INDEX(Liste_Classement,MATCH(A119,Liste_joueurs,0),3),\"\")","v":""}]
[null,{"$f":"IF(A120<>\"\",INDEX(Liste_Classement,MATCH(A120,Liste_joueurs,0),1),\"\")","v":""},{"$f":"IF(A120<>\"\",INDEX(Liste_Classement,MATCH(A120,Liste_joueurs,0),3),\"\")","v":""}]
[null,{"$f":"IF(A121<>\"\",INDEX(Liste_Classement,MATCH(A121,Liste_joueurs,0),1),\"\")","v":""},{"$f":"IF(A121<>\"\",INDEX(Liste_Classement,MATCH(A121,Liste_joueurs,0),3),\"\")","v":""}]
[null,{"$f":"IF(A122<>\"\",INDEX(Liste_Classement,MATCH(A122,Liste_joueurs,0),1),\"\")","v":""},{"$f":"IF(A122<>\"\",INDEX(Liste_Classement,MATCH(A122,Liste_joueurs,0),3),\"\")","v":""}]
[null,{"$f":"IF(A123<>\"\",INDEX(Liste_Classement,MATCH(A123,Liste_joueurs,0),1),\"\")","v":""},{"$f":"IF(A123<>\"\",INDEX(Liste_Classement,MATCH(A123,Liste_joueurs,0),3),\"\")","v":""}]
[null,{"$f":"IF(A124<>\"\",INDEX(Liste_Classement,MATCH(A124,Liste_joueurs,0),1),\"\")","v":""},{"$f":"IF(A124<>\"\",INDEX(Liste_Classement,MATCH(A124,Liste_joueurs,0),3),\"\")","v":""}]
[null,{"$f":"IF(A125<>\"\",INDEX(Liste_Classement,MATCH(A125,Liste_joueurs,0),1),\"\")","v":""},{"$f":"IF(A125<>\"\",INDEX(Liste_Classement,MATCH(A125,Liste_joueurs,0),3),\"\")","v":""}]
[null,{"$f":"IF(A126<>\"\",INDEX(Liste_Classement,MATCH(A126,Liste_joueurs,0),1),\"\")","v":""},{"$f":"IF(A126<>\"\",INDEX(Liste_Classement,MATCH(A126,Liste_joueurs,0),3),\"\")","v":""}]
[null,{"$f":"IF(A127<>\"\",INDEX(Liste_Classement,MATCH(A127,Liste_joueurs,0),1),\"\")","v":""},{"$f":"IF(A127<>\"\",INDEX(Liste_Classement,MATCH(A127,Liste_joueurs,0),3),\"\")","v":""}]
[null,{"$f":"IF(A128<>\"\",INDEX(Liste_Classement,MATCH(A128,Liste_joueurs,0),1),\"\")","v":""},{"$f":"IF(A128<>\"\",INDEX(Liste_Classement,MATCH(A128,Liste_joueurs,0),3),\"\")","v":""}]
[null,{"$f":"IF(A129<>\"\",INDEX(Liste_Classement,MATCH(A129,Liste_joueurs,0),1),\"\")","v":""},{"$f":"IF(A129<>\"\",INDEX(Liste_Classement,MATCH(A129,Liste_joueurs,0),3),\"\")","v":""}]
[null,{"$f":"IF(A130<>\"\",INDEX(Liste_Classement,MATCH(A130,Liste_joueurs,0),1),\"\")","v":""},{"$f":"IF(A130<>\"\",INDEX(Liste_Classement,MATCH(A130,Liste_joueurs,0),3),\"\")","v":""}]
[null,{"$f":"IF(A131<>\"\",INDEX(Liste_Classement,MATCH(A131,Liste_joueurs,0),1),\"\")","v":""},{"$f":"IF(A131<>\"\",INDEX(Liste_Classement,MATCH(A131,Liste_joueurs,0),3),\"\")","v":""}]
[null,{"$f":"IF(A132<>\"\",INDEX(Liste_Classement,MATCH(A132,Liste_joueurs,0),1),\"\")","v":""},{"$f":"IF(A132<>\"\",INDEX(Liste_Classement,MATCH(A132,Liste_joueurs,0),3),\"\")","v":""}]
[null,{"$f":"IF(A133<>\"\",INDEX(Liste_Classement,MATCH(A133,Liste_joueurs,0),1),\"\")","v":""},{"$f":"IF(A133<>\"\",INDEX(Liste_Classement,MATCH(A133,Liste_joueurs,0),3),\"\")","v":""}]
[null,{"$f":"IF(A134<>\"\",INDEX(Liste_Classement,MATCH(A134,Liste_joueurs,0),1),\"\")","v":""},{"$f":"IF(A134<>\"\",INDEX(Liste_Classement,MATCH(A134,Liste_joueurs,0),3),\"\")","v":""}]
[null,{"$f":"IF(A135<>\"\",INDEX(Liste_Classement,MATCH(A135,Liste_joueurs,0),1),\"\")","v":""},{"$f":"IF(A135<>\"\",INDEX(Liste_Classement,MATCH(A135,Liste_joueurs,0),3),\"\")","v":""}]
[null,{"$f":"IF(A136<>\"\",INDEX(Liste_Classement,MATCH(A136,Liste_joueurs,0),1),\"\")","v":""},{"$f":"IF(A136<>\"\",INDEX(Liste_Classement,MATCH(A136,Liste_joueurs,0),3),\"\")","v":""}]
[null,{"$f":"IF(A137<>\"\",INDEX(Liste_Classement,MATCH(A137,Liste_joueurs,0),1),\"\")","v":""},{"$f":"IF(A137<>\"\",INDEX(Liste_Classement,MATCH(A137,Liste_joueurs,0),3),\"\")","v":""}]
[null,{"$f":"IF(A138<>\"\",INDEX(Liste_Classement,MATCH(A138,Liste_joueurs,0),1),\"\")","v":""},{"$f":"IF(A138<>\"\",INDEX(Liste_Classement,MATCH(A138,Liste_joueurs,0),3),\"\")","v":""}]
[null,{"$f":"IF(A139<>\"\",INDEX(Liste_Classement,MATCH(A139,Liste_joueurs,0),1),\"\")","v":""},{"$f":"IF(A139<>\"\",INDEX(Liste_Classement,MATCH(A139,Liste_joueurs,0),3),\"\")","v":""}]
[null,{"$f":"IF(A140<>\"\",INDEX(Liste_Classement,MATCH(A140,Liste_joueurs,0),1),\"\")","v":""},{"$f":"IF(A140<>\"\",INDEX(Liste_Classement,MATCH(A140,Liste_joueurs,0),3),\"\")","v":""}]
[null,{"$f":"IF(A141<>\"\",INDEX(Liste_Classement,MATCH(A141,Liste_joueurs,0),1),\"\")","v":""},{"$f":"IF(A141<>\"\",INDEX(Liste_Classement,MATCH(A141,Liste_joueurs,0),3),\"\")","v":""}]
[null,{"$f":"IF(A142<>\"\",INDEX(Liste_Classement,MATCH(A142,Liste_joueurs,0),1),\"\")","v":""},{"$f":"IF(A142<>\"\",INDEX(Liste_Classement,MATCH(A142,Liste_joueurs,0),3),\"\")","v":""}]
[null,{"$f":"IF(A143<>\"\",INDEX(Liste_Classement,MATCH(A143,Liste_joueurs,0),1),\"\")","v":""},{"$f":"IF(A143<>\"\",INDEX(Liste_Classement,MATCH(A143,Liste_joueurs,0),3),\"\")","v":""}]
[null,{"$f":"IF(A144<>\"\",INDEX(Liste_Classement,MATCH(A144,Liste_joueurs,0),1),\"\")","v":""},{"$f":"IF(A144<>\"\",INDEX(Liste_Classement,MATCH(A144,Liste_joueurs,0),3),\"\")","v":""}]
[null,{"$f":"IF(A145<>\"\",INDEX(Liste_Classement,MATCH(A145,Liste_joueurs,0),1),\"\")","v":""},{"$f":"IF(A145<>\"\",INDEX(Liste_Classement,MATCH(A145,Liste_joueurs,0),3),\"\")","v":""}]
[null,{"$f":"IF(A146<>\"\",INDEX(Liste_Classement,MATCH(A146,Liste_joueurs,0),1),\"\")","v":""},{"$f":"IF(A146<>\"\",INDEX(Liste_Classement,MATCH(A146,Liste_joueurs,0),3),\"\")","v":""}]
[null,{"$f":"IF(A147<>\"\",INDEX(Liste_Classement,MATCH(A147,Liste_joueurs,0),1),\"\")","v":""},{"$f":"IF(A147<>\"\",INDEX(Liste_Classement,MATCH(A147,Liste_joueurs,0),3),\"\")","v":""}]
[null,{"$f":"IF(A148<>\"\",INDEX(Liste_Classement,MATCH(A148,Liste_joueurs,0),1),\"\")","v":""},{"$f":"IF(A148<>\"\",INDEX(Liste_Classement,MATCH(A148,Liste_joueurs,0),3),\"\")","v":""}]
[null,{"$f":"IF(A149<>\"\",INDEX(Liste_Classement,MATCH(A149,Liste_joueurs,0),1),\"\")","v":""},{"$f":"IF(A149<>\"\",INDEX(Liste_Classement,MATCH(A149,Liste_joueurs,0),3),\"\")","v":""}]
[null,{"$f":"IF(A150<>\"\",INDEX(Liste_Classement,MATCH(A150,Liste_joueurs,0),1),\"\")","v":""},{"$f":"IF(A150<>\"\",INDEX(Liste_Classement,MATCH(A150,Liste_joueurs,0),3),\"\")","v":""}]
[null,{"$f":"IF(A151<>\"\",INDEX(Liste_Classement,MATCH(A151,Liste_joueurs,0),1),\"\")","v":""},{"$f":"IF(A151<>\"\",INDEX(Liste_Classement,MATCH(A151,Liste_joueurs,0),3),\"\")","v":""}]
[null,{"$f":"IF(A152<>\"\",INDEX(Liste_Classement,MATCH(A152,Liste_joueurs,0),1),\"\")","v":""},{"$f":"IF(A152<>\"\",INDEX(Liste_Classement,MATCH(A152,Liste_joueurs,0),3),\"\")","v":""}]
[null,{"$f":"IF(A153<>\"\",INDEX(Liste_Classement,MATCH(A153,Liste_joueurs,0),1),\"\")","v":""},{"$f":"IF(A153<>\"\",INDEX(Liste_Classement,MATCH(A153,Liste_joueurs,0),3),\"\")","v":""}]
[null,{"$f":"IF(A154<>\"\",INDEX(Liste_Classement,MATCH(A154,Liste_joueurs,0),1),\"\")","v":""},{"$f":"IF(A154<>\"\",INDEX(Liste_Classement,MATCH(A154,Liste_joueurs,0),3),\"\")","v":""}]
[null,{"$f":"IF(A155<>\"\",INDEX(Liste_Classement,MATCH(A155,Liste_joueurs,0),1),\"\")","v":""},{"$f":"IF(A155<>\"\",INDEX(Liste_Classement,MATCH(A155,Liste_joueurs,0),3),\"\")","v":""}]
[null,{"$f":"IF(A156<>\"\",INDEX(Liste_Classement,MATCH(A156,Liste_joueurs,0),1),\"\")","v":""},{"$f":"IF(A156<>\"\",INDEX(Liste_Classement,MATCH(A156,Liste_joueurs,0),3),\"\")","v":""}]
[null,{"$f":"IF(A157<>\"\",INDEX(Liste_Classement,MATCH(A157,Liste_joueurs,0),1),\"\")","v":""},{"$f":"IF(A157<>\"\",INDEX(Liste_Classement,MATCH(A157,Liste_joueurs,0),3),\"\")","v":""}]
[null,{"$f":"IF(A158<>\"\",INDEX(Liste_Classement,MATCH(A158,Liste_joueurs,0),1),\"\")","v":""},{"$f":"IF(A158<>\"\",INDEX(Liste_Classement,MATCH(A158,Liste_joueurs,0),3),\"\")","v":""}]
[null,{"$f":"IF(A159<>\"\",INDEX(Liste_Classement,MATCH(A159,Liste_joueurs,0),1),\"\")","v":""},{"$f":"IF(A159<>\"\",INDEX(Liste_Classement,MATCH(A159,Liste_joueurs,0),3),\"\")","v":""}]
[null,{"$f":"IF(A160<>\"\",INDEX(Liste_Classement,MATCH(A160,Liste_joueurs,0),1),\"\")","v":""},{"$f":"IF(A160<>\"\",INDEX(Liste_Classement,MATCH(A160,Liste_joueurs,0),3),\"\")","v":""}]
[null,{"$f":"IF(A161<>\"\",INDEX(Liste_Classement,MATCH(A161,Liste_joueurs,0),1),\"\")","v":""},{"$f":"IF(A161<>\"\",INDEX(Liste_Classement,MATCH(A161,Liste_joueurs,0),3),\"\")","v":""}]
[null,{"$f":"IF(A162<>\"\",INDEX(Liste_Classement,MATCH(A162,Liste_joueurs,0),1),\"\")","v":""},{"$f":"IF(A162<>\"\",INDEX(Liste_Classement,MATCH(A162,Liste_joueurs,0),3),\"\")","v":""}]
[null,{"$f":"IF(A163<>\"\",INDEX(Liste_Classement,MATCH(A163,Liste_joueurs,0),1),\"\")","v":""},{"$f":"IF(A163<>\"\",INDEX(Liste_Classement,MATCH(A163,Liste_joueurs,0),3),\"\")","v":""}]
[null,{"$f":"IF(A164<>\"\",INDEX(Liste_Classement,MATCH(A164,Liste_joueurs,0),1),\"\")","v":""},{"$f":"IF(A164<>\"\",INDEX(Liste_Classement,MATCH(A164,Liste_joueurs,0),3),\"\")","v":""}]
[null,{"$f":"IF(A165<>\"\",INDEX(Liste_Classement,MATCH(A165,Liste_joueurs,0),1),\"\")","v":""},{"$f":"IF(A165<>\"\",INDEX(Liste_Classement,MATCH(A165,Liste_joueurs,0),3),\"\")","v":""}]
[null,{"$f":"IF(A166<>\"\",INDEX(Liste_Classement,MATCH(A166,Liste_joueurs,0),1),\"\")","v":""},{"$f":"IF(A166<>\"\",INDEX(Liste_Classement,MATCH(A166,Liste_joueurs,0),3),\"\")","v":""}]
[null,{"$f":"IF(A167<>\"\",INDEX(Liste_Classement,MATCH(A167,Liste_joueurs,0),1),\"\")","v":""},{"$f":"IF(A167<>\"\",INDEX(Liste_Classement,MATCH(A167,Liste_joueurs,0),3),\"\")","v":""}]
[null,{"$f":"IF(A168<>\"\",INDEX(Liste_Classement,MATCH(A168,Liste_joueurs,0),1),\"\")","v":""},{"$f":"IF(A168<>\"\",INDEX(Liste_Classement,MATCH(A168,Liste_joueurs,0),3),\"\")","v":""}]
[null,{"$f":"IF(A169<>\"\",INDEX(Liste_Classement,MATCH(A169,Liste_joueurs,0),1),\"\")","v":""},{"$f":"IF(A169<>\"\",INDEX(Liste_Classement,MATCH(A169,Liste_joueurs,0),3),\"\")","v":""}]
[null,{"$f":"IF(A170<>\"\",INDEX(Liste_Classement,MATCH(A170,Liste_joueurs,0),1),\"\")","v":""},{"$f":"IF(A170<>\"\",INDEX(Liste_Classement,MATCH(A170,Liste_joueurs,0),3),\"\")","v":""}]
[null,{"$f":"IF(A171<>\"\",INDEX(Liste_Classement,MATCH(A171,Liste_joueurs,0),1),\"\")","v":""},{"$f":"IF(A171<>\"\",INDEX(Liste_Classement,MATCH(A171,Liste_joueurs,0),3),\"\")","v":""}]
[null,{"$f":"IF(A172<>\"\",INDEX(Liste_Classement,MATCH(A172,Liste_joueurs,0),1),\"\")","v":""},{"$f":"IF(A172<>\"\",INDEX(Liste_Classement,MATCH(A172,Liste_joueurs,0),3),\"\")","v":""}]
[null,{"$f":"IF(A173<>\"\",INDEX(Liste_Classement,MATCH(A173,Liste_joueurs,0),1),\"\")","v":""},{"$f":"IF(A173<>\"\",INDEX(Liste_Classement,MATCH(A173,Liste_joueurs,0),3),\"\")","v":""}]
[null,{"$f":"IF(A174<>\"\",INDEX(Liste_Classement,MATCH(A174,Liste_joueurs,0),1),\"\")","v":""},{"$f":"IF(A174<>\"\",INDEX(Liste_Classement,MATCH(A174,Liste_joueurs,0),3),\"\")","v":""}]
[null,{"$f":"IF(A175<>\"\",INDEX(Liste_Classement,MATCH(A175,Liste_joueurs,0),1),\"\")","v":""},{"$f":"IF(A175<>\"\",INDEX(Liste_Classement,MATCH(A175,Liste_joueurs,0),3),\"\")","v":""}]
[null,{"$f":"IF(A176<>\"\",INDEX(Liste_Classement,MATCH(A176,Liste_joueurs,0),1),\"\")","v":""},{"$f":"IF(A176<>\"\",INDEX(Liste_Classement,MATCH(A176,Liste_joueurs,0),3),\"\")","v":""}]
[null,{"$f":"IF(A177<>\"\",INDEX(Liste_Classement,MATCH(A177,Liste_joueurs,0),1),\"\")","v":""},{"$f":"IF(A177<>\"\",INDEX(Liste_Classement,MATCH(A177,Liste_joueurs,0),3),\"\")","v":""}]
[null,{"$f":"IF(A178<>\"\",INDEX(Liste_Classement,MATCH(A178,Liste_joueurs,0),1),\"\")","v":""},{"$f":"IF(A178<>\"\",INDEX(Liste_Classement,MATCH(A178,Liste_joueurs,0),3),\"\")","v":""}]
[null,{"$f":"IF(A179<>\"\",INDEX(Liste_Classement,MATCH(A179,Liste_joueurs,0),1),\"\")","v":""},{"$f":"IF(A179<>\"\",INDEX(Liste_Classement,MATCH(A179,Liste_joueurs,0),3),\"\")","v":""}]
[null,{"$f":"IF(A180<>\"\",INDEX(Liste_Classement,MATCH(A180,Liste_joueurs,0),1),\"\")","v":""},{"$f":"IF(A180<>\"\",INDEX(Liste_Classement,MATCH(A180,Liste_joueurs,0),3),\"\")","v":""}]
[null,{"$f":"IF(A181<>\"\",INDEX(Liste_Classement,MATCH(A181,Liste_joueurs,0),1),\"\")","v":""},{"$f":"IF(A181<>\"\",INDEX(Liste_Classement,MATCH(A181,Liste_joueurs,0),3),\"\")","v":""}]
[null,{"$f":"IF(A182<>\"\",INDEX(Liste_Classement,MATCH(A182,Liste_joueurs,0),1),\"\")","v":""},{"$f":"IF(A182<>\"\",INDEX(Liste_Classement,MATCH(A182,Liste_joueurs,0),3),\"\")","v":""}]
[null,{"$f":"IF(A183<>\"\",INDEX(Liste_Classement,MATCH(A183,Liste_joueurs,0),1),\"\")","v":""},{"$f":"IF(A183<>\"\",INDEX(Liste_Classement,MATCH(A183,Liste_joueurs,0),3),\"\")","v":""}]
[null,{"$f":"IF(A184<>\"\",INDEX(Liste_Classement,MATCH(A184,Liste_joueurs,0),1),\"\")","v":""},{"$f":"IF(A184<>\"\",INDEX(Liste_Classement,MATCH(A184,Liste_joueurs,0),3),\"\")","v":""}]
[null,{"$f":"IF(A185<>\"\",INDEX(Liste_Classement,MATCH(A185,Liste_joueurs,0),1),\"\")","v":""},{"$f":"IF(A185<>\"\",INDEX(Liste_Classement,MATCH(A185,Liste_joueurs,0),3),\"\")","v":""}]
[null,{"$f":"IF(A186<>\"\",INDEX(Liste_Classement,MATCH(A186,Liste_joueurs,0),1),\"\")","v":""},{"$f":"IF(A186<>\"\",INDEX(Liste_Classement,MATCH(A186,Liste_joueurs,0),3),\"\")","v":""}]
[null,{"$f":"IF(A187<>\"\",INDEX(Liste_Classement,MATCH(A187,Liste_joueurs,0),1),\"\")","v":""},{"$f":"IF(A187<>\"\",INDEX(Liste_Classement,MATCH(A187,Liste_joueurs,0),3),\"\")","v":""}]
[null,{"$f":"IF(A188<>\"\",INDEX(Liste_Classement,MATCH(A188,Liste_joueurs,0),1),\"\")","v":""},{"$f":"IF(A188<>\"\",INDEX(Liste_Classement,MATCH(A188,Liste_joueurs,0),3),\"\")","v":""}]
[null,{"$f":"IF(A189<>\"\",INDEX(Liste_Classement,MATCH(A189,Liste_joueurs,0),1),\"\")","v":""},{"$f":"IF(A189<>\"\",INDEX(Liste_Classement,MATCH(A189,Liste_joueurs,0),3),\"\")","v":""}]
[null,{"$f":"IF(A190<>\"\",INDEX(Liste_Classement,MATCH(A190,Liste_joueurs,0),1),\"\")","v":""},{"$f":"IF(A190<>\"\",INDEX(Liste_Classement,MATCH(A190,Liste_joueurs,0),3),\"\")","v":""}]
[null,{"$f":"IF(A191<>\"\",INDEX(Liste_Classement,MATCH(A191,Liste_joueurs,0),1),\"\")","v":""},{"$f":"IF(A191<>\"\",INDEX(Liste_Classement,MATCH(A191,Liste_joueurs,0),3),\"\")","v":""}]
[null,{"$f":"IF(A192<>\"\",INDEX(Liste_Classement,MATCH(A192,Liste_joueurs,0),1),\"\")","v":""},{"$f":"IF(A192<>\"\",INDEX(Liste_Classement,MATCH(A192,Liste_joueurs,0),3),\"\")","v":""}]
[null,{"$f":"IF(A193<>\"\",INDEX(Liste_Classement,MATCH(A193,Liste_joueurs,0),1),\"\")","v":""},{"$f":"IF(A193<>\"\",INDEX(Liste_Classement,MATCH(A193,Liste_joueurs,0),3),\"\")","v":""}]
[null,{"$f":"IF(A194<>\"\",INDEX(Liste_Classement,MATCH(A194,Liste_joueurs,0),1),\"\")","v":""},{"$f":"IF(A194<>\"\",INDEX(Liste_Classement,MATCH(A194,Liste_joueurs,0),3),\"\")","v":""}]
[null,{"$f":"IF(A195<>\"\",INDEX(Liste_Classement,MATCH(A195,Liste_joueurs,0),1),\"\")","v":""},{"$f":"IF(A195<>\"\",INDEX(Liste_Classement,MATCH(A195,Liste_joueurs,0),3),\"\")","v":""}]
[null,{"$f":"IF(A196<>\"\",INDEX(Liste_Classement,MATCH(A196,Liste_joueurs,0),1),\"\")","v":""},{"$f":"IF(A196<>\"\",INDEX(Liste_Classement,MATCH(A196,Liste_joueurs,0),3),\"\")","v":""}]
[null,{"$f":"IF(A197<>\"\",INDEX(Liste_Classement,MATCH(A197,Liste_joueurs,0),1),\"\")","v":""},{"$f":"IF(A197<>\"\",INDEX(Liste_Classement,MATCH(A197,Liste_joueurs,0),3),\"\")","v":""}]
[null,{"$f":"IF(A198<>\"\",INDEX(Liste_Classement,MATCH(A198,Liste_joueurs,0),1),\"\")","v":""},{"$f":"IF(A198<>\"\",INDEX(Liste_Classement,MATCH(A198,Liste_joueurs,0),3),\"\")","v":""}]
[null,{"$f":"IF(A199<>\"\",INDEX(Liste_Classement,MATCH(A199,Liste_joueurs,0),1),\"\")","v":""},{"$f":"IF(A199<>\"\",INDEX(Liste_Classement,MATCH(A199,Liste_joueurs,0),3),\"\")","v":""}]
[null,{"$f":"IF(A200<>\"\",INDEX(Liste_Classement,MATCH(A200,Liste_joueurs,0),1),\"\")","v":""},{"$f":"IF(A200<>\"\",INDEX(Liste_Classement,MATCH(A200,Liste_joueurs,0),3),\"\")","v":""}]
[null,{"$f":"IF(A201<>\"\",INDEX(Liste_Classement,MATCH(A201,Liste_joueurs,0),1),\"\")","v":""},{"$f":"IF(A201<>\"\",INDEX(Liste_Classement,MATCH(A201,Liste_joueurs,0),3),\"\")","v":""}]
[null,{"$f":"IF(A202<>\"\",INDEX(Liste_Classement,MATCH(A202,Liste_joueurs,0),1),\"\")","v":""},{"$f":"IF(A202<>\"\",INDEX(Liste_Classement,MATCH(A202,Liste_joueurs,0),3),\"\")","v":""}]
[null,{"$f":"IF(A203<>\"\",INDEX(Liste_Classement,MATCH(A203,Liste_joueurs,0),1),\"\")","v":""},{"$f":"IF(A203<>\"\",INDEX(Liste_Classement,MATCH(A203,Liste_joueurs,0),3),\"\")","v":""}]
[null,{"$f":"IF(A204<>\"\",INDEX(Liste_Classement,MATCH(A204,Liste_joueurs,0),1),\"\")","v":""},{"$f":"IF(A204<>\"\",INDEX(Liste_Classement,MATCH(A204,Liste_joueurs,0),3),\"\")","v":""}]
[null,{"$f":"IF(A205<>\"\",INDEX(Liste_Classement,MATCH(A205,Liste_joueurs,0),1),\"\")","v":""},{"$f":"IF(A205<>\"\",INDEX(Liste_Classement,MATCH(A205,Liste_joueurs,0),3),\"\")","v":""}]
[null,{"$f":"IF(A206<>\"\",INDEX(Liste_Classement,MATCH(A206,Liste_joueurs,0),1),\"\")","v":""},{"$f":"IF(A206<>\"\",INDEX(Liste_Classement,MATCH(A206,Liste_joueurs,0),3),\"\")","v":""}]
[null,{"$f":"IF(A207<>\"\",INDEX(Liste_Classement,MATCH(A207,Liste_joueurs,0),1),\"\")","v":""},{"$f":"IF(A207<>\"\",INDEX(Liste_Classement,MATCH(A207,Liste_joueurs,0),3),\"\")","v":""}]
[null,{"$f":"IF(A208<>\"\",INDEX(Liste_Classement,MATCH(A208,Liste_joueurs,0),1),\"\")","v":""},{"$f":"IF(A208<>\"\",INDEX(Liste_Classement,MATCH(A208,Liste_joueurs,0),3),\"\")","v":""}]

{"sheet":"RefPoule8J","index":1,"n_rows":150,"n_cols":60,"rows_kept":150,"cut":false,"hidden":true,"merged":[[146,57,149,57],[138,59,141,59],[142,59,145,59],[146,59,149,59],[138,57,141,57],[142,52,145,52],[142,54,145,54],[142,55,145,55],[142,56,145,56],[142,57,145,57],[146,51,149,51],[146,53,149,53],[138,52,141,52],[138,54,141,54],[138,55,141,55],[138,56,141,56],[146,52,149,52],[146,54,149,54],[146,55,149,55],[146,56,149,56],[138,51,141,51],[138,53,141,53],[142,51,145,51],[142,53,145,53],[127,57,130,57],[127,59,130,59],[131,51,134,51],[131,52,134,52],[131,53,134,53],[131,54,134,54],[131,55,134,55],[131,56,134,56],[131,57,134,57],[131,59,134,59],[127,51,130,51],[127,52,130,52],[127,53,130,53],[127,54,130,54],[127,55,130,55],[127,56,130,56],[119,57,122,57],[119,59,122,59],[123,51,126,51],[123,52,126,52],[123,53,126,53],[123,54,126,54],[123,55,126,55],[123,56,126,56],[123,57,126,57],[123,59,126,59],[119,51,122,51],[119,52,122,52],[119,53,122,53],[119,54,122,54],[119,55,122,55],[119,56,122,56],[108,57,111,57],[108,59,111,59],[112,51,115,51],[112,52,115,52],[112,53,115,53],[112,54,115,54],[112,55,115,55],[112,56,115,56],[112,57,115,57],[112,59,115,59],[108,51,111,51],[108,52,111,52],[108,53,111,53],[108,54,111,54],[108,55,111,55],[108,56,111,56],[100,57,103,57],[100,59,103,59],[104,51,107,51],[104,52,107,52],[104,53,107,53],[104,54,107,54],[104,55,107,55],[104,56,107,56],[104,57,107,57],[104,59,107,59],[100,51,103,51],[100,52,103,52],[100,53,103,53],[100,54,103,54],[100,55,103,55],[100,56,103,56],[89,57,92,57],[89,59,92,59],[96,51,99,51],[96,52,99,52],[96,53,99,53],[96,54,99,54],[96,55,99,55],[96,56,99,56],[96,57,99,57],[96,59,99,59],[89,51,92,51],[89,52,92,52],[89,53,92,53],[89,54,92,54],[89,55,92,55],[89,56,92,56],[81,57,84,57],[81,59,84,59],[85,51,88,51],[85,52,88,52],[85,53,88,53],[85,54,88,54],[85,55,88,55],[85,56,88,56],[85,57,88,57],[85,59,88,59],[81,51,84,51],[81,52,84,52],[81,53,84,53],[81,54,84,54],[81,55,84,55],[81,56,84,56],[73,57,76,57],[73,59,76,59],[77,51,80,51],[77,52,80,52],[77,53,80,53],[77,54,80,54],[77,55,80,55],[77,56,80,56],[77,57,80,57],[77,59,80,59],[73,51,76,51],[73,52,76,52],[73,53,76,53],[73,54,76,54],[73,55,76,55],[73,56,76,56],[62,57,65,57],[62,59,65,59],[69,51,72,51],[69,52,72,52],[69,53,72,53],[69,54,72,54],[69,55,72,55],[69,56,72,56],[69,57,72,57],[69,59,72,59],[62,51,65,51],[62,52,65,52],[62,53,65,53],[62,54,65,54],[62,55,65,55],[62,56,65,56],[54,57,57,57],[54,59,57,59],[58,51,61,51],[58,52,61,52],[58,53,61,53],[58,54,61,54],[58,55,61,55],[58,56,61,56],[58,57,61,57],[58,59,61,59],[54,51,57,51],[54,52,57,52],[54,53,57,53],[54,54,57,54],[54,55,57,55],[54,56,57,56],[46,57,49,57],[46,59,49,59],[50,51,53,51],[50,52,53,52],[50,53,53,53],[50,54,53,54],[50,55,53,55],[50,56,53,56],[50,57,53,57],[50,59,53,59],[46,51,49,51],[46,52,49,52],[46,53,49,53],[46,54,49,54],[46,55,49,55],[46,56,49,56],[38,57,41,57],[38,59,41,59],[42,51,45,51],[42,52,45,52],[42,53,45,53],[42,54,45,54],[42,55,45,55],[42,56,45,56],[42,57,45,57],[42,59,45,59],[38,51,41,51],[38,52,41,52],[38,53,41,53],[38,54,41,54],[38,55,41,55],[38,56,41,56],[27,57,30,57],[27,59,30,59],[31,51,34,51],[31,52,34,52],[31,53,34,53],[31,54,34,54],[31,55,34,55],[31,56,34,56],[31,57,34,57],[31,59,34,59],[27,51,30,51],[27,52,30,52],[27,53,30,53],[27,54,30,54],[27,55,30,55],[27,56,30,56],[19,57,22,57],[19,59,22,59],[23,51,26,51],[23,52,26,52],[23,53,26,53],[23,54,26,54],[23,55,26,55],[23,56,26,56],[23,57,26,57],[23,59,26,59],[19,51,22,51],[19,52,22,52],[19,53,22,53],[19,54,22,54],[19,55,22,55],[19,56,22,56],[11,57,14,57],[11,59,14,59],[15,51,18,51],[15,52,18,52],[15,53,18,53],[15,54,18,54],[15,55,18,55],[15,56,18,56],[15,57,18,57],[15,59,18,59],[11,51,14,51],[11,52,14,52],[11,53,14,53],[11,54,14,54],[11,55,14,55],[11,56,14,56],[3,57,6,57],[3,59,6,59],[7,51,10,51],[7,52,10,52],[7,53,10,53],[7,54,10,54],[7,55,10,55],[7,56,10,56],[7,57,10,57],[7,59,10,59],[3,52,6,52],[3,51,6,51],[3,53,6,53],[3,54,6,54],[3,55,6,55],[3,56,6,56]]}
[]
[]
[null,"Poule",{"$f":"\"J\" & RIGHT(B4,1) & \" \" &B5","v":"J1 Nom & Prénom"},null,null,null,null,null,{"$f":"\"J\" & RIGHT(B8,1) & \" \" &B9","v":"J2 Nom & Prénom"},null,null,null,null,null,{"$f":"\"J\" & RIGHT(B12,1) & \" \" &B13","v":"J3 Nom & Prénom"},null,null,null,null,null,{"$f":"\"J\" & RIGHT(B16,1) & \" \" &B17","v":"J4 Nom & Prénom"},null,null,null,null,null,{"$f":"\"J\" & RIGHT(B20,1) & \" \" &B21","v":"J5 Nom & Prénom"},null,null,null,null,null,{"$f":"\"J\" & RIGHT(B24,1) & \" \" &B25","v":"J6 Nom & Prénom"},null,null,null,null,null,{"$f":"\"J\" & RIGHT(B28,1) & \" \" &B29","v":"J7 Nom & Prénom"},null,null,null,null,null,{"$f":"\"J\" & RIGHT(B32,1) & \" \" &B33","v":"J8 Nom & Prénom"},null,null,null,null,null,null,"Clst","Pts Match","Pts Sets","Moy. Gen.","Moy. Part.","Pts marq.","Pts subis",null,"Calcul 1er"]
[null,"Joueur 1","Sets",null,null,null,null,"Match","set 1","set 2","set 3","set 4","set 5","J1-J2","set 1","set 2","set 3","set 4","set 5","J1-J3","set 1","set 2","set 3","set 4","set 5","J1-J4","set 1","set 2","set 3","set 4","set 5","J1-J5","set 1","set 2","set 3","set 4","set 5","J1-J6","set 1","set 2","set 3","set 4","set 5","J1-J7","set 1","set 2","set 3","set 4","set 5","J1-J8",null,{"$f":"IF(BH4<>\"\",RANK(BH4,BH4:BH35),\"\")","v":""},{"$f":"COUNTIF(N5:AX5,\"G\")*VAL_PT_MATCH","v":0},{"$f":"SUM(AX6,AR6,AL6,AF6,Z6,T6,N6)","v":0},{"$f":"IF(BF4<>0,ROUNDDOWN(BE4/BF4,3),\"\")","v":""},{"$f":"MAX(N7,T7,Z7,AF7,AL7,AR7,AX7)","v":0},{"$f":"SUM(I5:M5,O5:S5,U5:Y5,AA5:AE5,AG5:AK5,AM5:AQ5,AS5:AW5)","v":0},{"$f":"SUM(C9:G9,C13:G13,C17:G17,C21:G21,C25:G25,C29:G29,C33:G33)","v":0},null,{"$f":"IF(BC4<>\"\",(BA4*10000000)+(BB4*100000)+(BC4*10000)+BD4,\"\")","v":""}]
[null,"Nom & Prénom","Pts",null,null,null,null,"G/P",null,null,null,null,null,{"$f":"IF(COUNTIF(I5:M5,DISTANCE_Q)=NB_SETS_G_Q,\"G\",IF(COUNTIF(C9:G9,DISTANCE_Q)=NB_SETS_G_Q,\"P\",\"\"))","v":""},null,null,null,null,null,{"$f":"IF(COUNTIF(O5:S5,DISTANCE_Q)=NB_SETS_G_Q,\"G\",IF(COUNTIF(C13:G13,DISTANCE_Q)=NB_SETS_G_Q,\"P\",\"\"))","v":""},null,null,null,null,null,{"$f":"IF(COUNTIF(U5:Y5,DISTANCE_Q)=NB_SETS_G_Q,\"G\",IF(COUNTIF(C17:G17,DISTANCE_Q)=NB_SETS_G_Q,\"P\",\"\"))","v":""},null,null,null,null,null,{"$f":"IF(COUNTIF(AA5:AE5,DISTANCE_Q)=NB_SETS_G_Q,\"G\",IF(COUNTIF(C21:G21,DISTANCE_Q)=NB_SETS_G_Q,\"P\",\"\"))","v":""},null,null,null,null,null,{"$f":"IF(COUNTIF(AG5:AK5,DISTANCE_Q)=NB_SETS_G_Q,\"G\",IF(COUNTIF(C25:G25,DISTANCE_Q)=NB_SETS_G_Q,\"P\",\"\"))","v":""},null,null,null,null,null,{"$f":"IF(COUNTIF(AM5:AQ5,DISTANCE_Q)=NB_SETS_G_Q,\"G\",IF(COUNTIF(C29:G29,DISTANCE_Q)=NB_SETS_G_Q,\"P\",\"\"))","v":""},null,null,null,null,null,{"$f":"IF(COUNTIF(AS5:AW5,DISTANCE_Q)=NB_SETS_G_Q,\"G\",IF(COUNTIF(C33:G33,DISTANCE_Q)=NB_SETS_G_Q,\"P\",\"\"))","v":""}]
[null,"Ville ou Club",null,null,null,null,null,"Pts de Sets",{"$f":"IF(OR(COUNTIF(I5:M5,\"\")<>COUNTIF(C9:G9,\"\"),AND(N5=\"\",SUM(I5:M5)<>0)),\"!...\",IF(OR(AND(N5<>\"\",I5=\"\",I5<>C9),AND(N5<>\"\",I5<>\"\",I5=C9),AND(N5<>\"\",I5<>\"\",I5<>DISTANCE_Q,C9<>DISTANCE_Q)),\"ERR!\",\"\"))","v":""},{"$f":"IF(I6=\"!...\",I6,IF(OR(AND(N5<>\"\",J5=\"\",J5<>D9),AND(N5<>\"\",J5<>\"\",J5=D9),AND(N5<>\"\",J5<>\"\",J5<>DISTANCE_Q,D9<>DISTANCE_Q)),\"ERR!\",\"\"))","v":""},{"$f":"IF(J6=\"!...\",J6,IF(OR(AND(N5<>\"\",K5=\"\",K5<>E9),AND(N5<>\"\",K5<>\"\",K5=E9),AND(N5<>\"\",K5<>\"\",K5<>DISTANCE_Q,E9<>DISTANCE_Q)),\"ERR!\",\"\"))","v":""},{"$f":"IF(K6=\"!...\",K6,IF(OR(AND(N5<>\"\",L5=\"\",L5<>F9),AND(N5<>\"\",L5<>\"\",L5=F9),AND(N5<>\"\",L5<>\"\",L5<>DISTANCE_Q,F9<>DISTANCE_Q)),\"ERR!\",\"\"))","v":""},{"$f":"IF(L6=\"!...\",L6,IF(OR(AND(N5<>\"\",M5=\"\",M5<>G9),AND(N5<>\"\",M5<>\"\",M5=G9),AND(N5<>\"\",M5<>\"\",M5<>DISTANCE_Q,G9<>DISTANCE_Q)),\"ERR!\",\"\"))","v":""},{"$f":"IF(N5=\"\",\"\",IF(N5=\"G\",(NB_SETS_G_Q*2)-1-COUNTIF(C9:G9,DISTANCE_Q),COUNTIF(I5:M5,DISTANCE_Q)))","v":""},{"$f":"IF(OR(COUNTIF(O5:S5,\"\")<>COUNTIF(C13:G13,\"\"),AND(T5=\"\",SUM(O5:S5)<>0)),\"!...\",IF(OR(AND(T5<>\"\",O5=\"\",O5<>C13),AND(T5<>\"\",O5<>\"\",O5=C13),AND(T5<>\"\",O5<>\"\",O5<>DISTANCE_Q,C13<>DISTANCE_Q)),\"ERR!\",\"\"))","v":""},{"$f":"IF(O6=\"!...\",O6,IF(OR(AND(T5<>\"\",P5=\"\",P5<>D13),AND(T5<>\"\",P5<>\"\",P5=D13),AND(T5<>\"\",P5<>\"\",P5<>DISTANCE_Q,D13<>DISTANCE_Q)),\"ERR!\",\"\"))","v":""},{"$f":"IF(P6=\"!...\",P6,IF(OR(AND(T5<>\"\",Q5=\"\",Q5<>E13),AND(T5<>\"\",Q5<>\"\",Q5=E13),AND(T5<>\"\",Q5<>\"\",Q5<>DISTANCE_Q,E13<>DISTANCE_Q)),\"ERR!\",\"\"))","v":""},{"$f":"IF(Q6=\"!...\",Q6,IF(OR(AND(T5<>\"\",R5=\"\",R5<>F13),AND(T5<>\"\",R5<>\"\",R5=F13),AND(T5<>\"\",R5<>\"\",R5<>DISTANCE_Q,F13<>DISTANCE_Q)),\"ERR!\",\"\"))","v":""},{"$f":"IF(R6=\"!...\",R6,IF(OR(AND(T5<>\"\",S5=\"\",S5<>G13),AND(T5<>\"\",S5<>\"\",S5=G13),AND(T5<>\"\",S5<>\"\",S5<>DISTANCE_Q,G13<>DISTANCE_Q)),\"ERR!\",\"\"))","v":""},{"$f":"IF(T5=\"\",\"\",IF(T5=\"G\",(NB_SETS_G_Q*2)-1-COUNTIF(C13:G13,DISTANCE_Q),COUNTIF(O5:S5,DISTANCE_Q)))","v":""},{"$f":"IF(OR(COUNTIF(U5:Y5,\"\")<>COUNTIF(C17:G17,\"\"),AND(Z5=\"\",SUM(U5:Y5)<>0)),\"!...\",IF(OR(AND(Z5<>\"\",U5=\"\",U5<>C17),AND(Z5<>\"\",U5<>\"\",U5=C17),AND(Z5<>\"\",U5<>\"\",U5<>DISTANCE_Q,C17<>DISTANCE_Q)),\"ERR!\",\"\"))","v":""},{"$f":"IF(U6=\"!...\",U6,IF(OR(AND(Z5<>\"\",V5=\"\",V5<>D17),AND(Z5<>\"\",V5<>\"\",V5=D17),AND(Z5<>\"\",V5<>\"\",V5<>DISTANCE_Q,D17<>DISTANCE_Q)),\"ERR!\",\"\"))","v":""},{"$f":"IF(V6=\"!...\",V6,IF(OR(AND(Z5<>\"\",W5=\"\",W5<>E17),AND(Z5<>\"\",W5<>\"\",W5=E17),AND(Z5<>\"\",W5<>\"\",W5<>DISTANCE_Q,E17<>DISTANCE_Q)),\"ERR!\",\"\"))","v":""},{"$f":"IF(W6=\"!...\",W6,IF(OR(AND(Z5<>\"\",X5=\"\",X5<>F17),AND(Z5<>\"\",X5<>\"\",X5=F17),AND(Z5<>\"\",X5<>\"\",X5<>DISTANCE_Q,F17<>DISTANCE_Q)),\"ERR!\",\"\"))","v":""},{"$f":"IF(X6=\"!...\",X6,IF(OR(AND(Z5<>\"\",Y5=\"\",Y5<>G17),AND(Z5<>\"\",Y5<>\"\",Y5=G17),AND(Z5<>\"\",Y5<>\"\",Y5<>DISTANCE_Q,G17<>DISTANCE_Q)),\"ERR!\",\"\"))","v":""},{"$f":"IF(Z5=\"\",\"\",IF(Z5=\"G\",(NB_SETS_G_Q*2)-1-COUNTIF(C17:G17,DISTANCE_Q),COUNTIF(U5:Y5,DISTANCE_Q)))","v":""},{"$f":"IF(OR(COUNTIF(AA5:AE5,\"\")<>COUNTIF(C21:G21,\"\"),AND(AF5=\"\",SUM(AA5:AE5)<>0)),\"!...\",IF(OR(AND(AF5<>\"\",AA5=\"\",AA5<>C21),AND(AF5<>\"\",AA5<>\"\",AA5=C21),AND(AF5<>\"\",AA5<>\"\",AA5<>DISTANCE_Q,C21<>DISTANCE_Q)),\"ERR!\",\"\"))","v":""},{"$f":"IF(AA6=\"!...\",AA6,IF(OR(AND(AF5<>\"\",AB5=\"\",AB5<>D21),AND(AF5<>\"\",AB5<>\"\",AB5=D21),AND(AF5<>\"\",AB5<>\"\",AB5<>DISTANCE_Q,D21<>DISTANCE_Q)),\"ERR!\",\"\"))","v":""},{"$f":"IF(AB6=\"!...\",AB6,IF(OR(AND(AF5<>\"\",AC5=\"\",AC5<>E21),AND(AF5<>\"\",AC5<>\"\",AC5=E21),AND(AF5<>\"\",AC5<>\"\",AC5<>DISTANCE_Q,E21<>DISTANCE_Q)),\"ERR!\",\"\"))","v":""},{"$f":"IF(AC6=\"!...\",AC6,IF(OR(AND(AF5<>\"\",AD5=\"\",AD5<>F21),AND(AF5<>\"\",AD5<>\"\",AD5=F21),AND(AF5<>\"\",AD5<>\"\",AD5<>DISTANCE_Q,F21<>DISTANCE_Q)),\"ERR!\",\"\"))","v":""},{"$f":"IF(AD6=\"!...\",AD6,IF(OR(AND(AF5<>\"\",AE5=\"\",AE5<>G21),AND(AF5<>\"\",AE5<>\"\",AE5=G21),AND(AF5<>\"\",AE5<>\"\",AE5<>DISTANCE_Q,G21<>DISTANCE_Q)),\"ERR!\",\"\"))","v":""},{"$f":"IF(AF5=\"\",\"\",IF(AF5=\"G\",(NB_SETS_G_Q*2)-1-COUNTIF(C21:G21,DISTANCE_Q),COUNTIF(AA5:AE5,DISTANCE_Q)))","v":""},{"$f":"IF(OR(COUNTIF(AG5:AK5,\"\")<>COUNTIF(C25:G25,\"\"),AND(AL5=\"\",SUM(AG5:AK5)<>0)),\"!...\",IF(OR(AND(AL5<>\"\",AG5=\"\",AG5<>C25),AND(AL5<>\"\",AG5<>\"\",AG5=C25),AND(AL5<>\"\",AG5<>\"\",AG5<>DISTANCE_Q,C25<>DISTANCE_Q)),\"ERR!\",\"\"))","v":""},{"$f":"IF(AG6=\"!...\",AG6,IF(OR(AND(AL5<>\"\",AH5=\"\",AH5<>D25),AND(AL5<>\"\",AH5<>\"\",AH5=D25),AND(AL5<>\"\",AH5<>\"\",AH5<>DISTANCE_Q,D25<>DISTANCE_Q)),\"ERR!\",\"\"))","v":""},{"$f":"IF(AH6=\"!...\",AH6,IF(OR(AND(AL5<>\"\",AI5=\"\",AI5<>E25),AND(AL5<>\"\",AI5<>\"\",AI5=E25),AND(AL5<>\"\",AI5<>\"\",AI5<>DISTANCE_Q,E25<>DISTANCE_Q)),\"ERR!\",\"\"))","v":""},{"$f":"IF(AI6=\"!...\",AI6,IF(OR(AND(AL5<>\"\",AJ5=\"\",AJ5<>F25),AND(AL5<>\"\",AJ5<>\"\",AJ5=F25),AND(AL5<>\"\",AJ5<>\"\",AJ5<>DISTANCE_Q,F25<>DISTANCE_Q)),\"ERR!\",\"\"))","v":""},{"$f":"IF(AJ6=\"!...\",AJ6,IF(OR(AND(AL5<>\"\",AK5=\"\",AK5<>G25),AND(AL5<>\"\",AK5<>\"\",AK5=G25),AND(AL5<>\"\",AK5<>\"\",AK5<>DISTANCE_Q,G25<>DISTANCE_Q)),\"ERR!\",\"\"))","v":""},{"$f":"IF(AL5=\"\",\"\",IF(AL5=\"G\",(NB_SETS_G_Q*2)-1-COUNTIF(C25:G25,DISTANCE_Q),COUNTIF(AG5:AK5,DISTANCE_Q)))","v":""},{"$f":"IF(OR(COUNTIF(AM5:AQ5,\"\")<>COUNTIF(C29:G29,\"\"),AND(AR5=\"\",SUM(AM5:AQ5)<>0)),\"!...\",IF(OR(AND(AR5<>\"\",AM5=\"\",AM5<>C29),AND(AR5<>\"\",AM5<>\"\",AM5=C29),AND(AR5<>\"\",AM5<>\"\",AM5<>DISTANCE_Q,C29<>DISTANCE_Q)),\"ERR!\",\"\"))","v":""},{"$f":"IF(AM6=\"!...\",AM6,IF(OR(AND(AR5<>\"\",AN5=\"\",AN5<>D29),AND(AR5<>\"\",AN5<>\"\",AN5=D29),AND(AR5<>\"\",AN5<>\"\",AN5<>DISTANCE_Q,D29<>DISTANCE_Q)),\"ERR!\",\"\"))","v":""},{"$f":"IF(AN6=\"!...\",AN6,IF(OR(AND(AR5<>\"\",AO5=\"\",AO5<>E29),AND(AR5<>\"\",AO5<>\"\",AO5=E29),AND(AR5<>\"\",AO5<>\"\",AO5<>DISTANCE_Q,E29<>DISTANCE_Q)),\"ERR!\",\"\"))","v":""},{"$f":"IF(AO6=\"!...\",AO6,IF(OR(AND(AR5<>\"\",AP5=\"\",AP5<>F29),AND(AR5<>\"\",AP5<>\"\",AP5=F29),AND(AR5<>\"\",AP5<>\"\",AP5<>DISTANCE_Q,F29<>DISTANCE_Q)),\"ERR!\",\"\"))","v":""},{"$f":"IF(AP6=\"!...\",AP6,IF(OR(AND(AR5<>\"\",AQ5=\"\",AQ5<>G29),AND(AR5<>\"\",AQ5<>\"\",AQ5=G29),AND(AR5<>\"\",AQ5<>\"\",AQ5<>DISTANCE_Q,G29<>DISTANCE_Q)),\"ERR!\",\"\"))","v":""},{"$f":"IF(AR5=\"\",\"\",IF(AR5=\"G\",(NB_SETS_G_Q*2)-1-COUNTIF(C29:G29,DISTANCE_Q),COUNTIF(AM5:AQ5,DISTANCE_Q)))","v":""},{"$f":"IF(OR(COUNTIF(AS5:AW5,\"\")<>COUNTIF(C33:G33,\"\"),AND(AX5=\"\",SUM(AS5:AW5)<>0)),\"!...\",IF(OR(AND(AX5<>\"\",AS5=\"\",AS5<>C33),AND(AX5<>\"\",AS5<>\"\",AS5=C33),AND(AX5<>\"\",AS5<>\"\",AS5<>DISTANCE_Q,C33<>DISTANCE_Q)),\"ERR!\",\"\"))","v":""},{"$f":"IF(AS6=\"!...\",AS6,IF(OR(AND(AX5<>\"\",AT5=\"\",AT5<>D33),AND(AX5<>\"\",AT5<>\"\",AT5=D33),AND(AX5<>\"\",AT5<>\"\",AT5<>DISTANCE_Q,D33<>DISTANCE_Q)),\"ERR!\",\"\"))","v":""},{"$f":"IF(AT6=\"!...\",AT6,IF(OR(AND(AX5<>\"\",AU5=\"\",AU5<>E33),AND(AX5<>\"\",AU5<>\"\",AU5=E33),AND(AX5<>\"\",AU5<>\"\",AU5<>DISTANCE_Q,E33<>DISTANCE_Q)),\"ERR!\",\"\"))","v":""},{"$f":"IF(AU6=\"!...\",AU6,IF(OR(AND(AX5<>\"\",AV5=\"\",AV5<>F33),AND(AX5<>\"\",AV5<>\"\",AV5=F33),AND(AX5<>\"\",AV5<>\"\",AV5<>DISTANCE_Q,F33<>DISTANCE_Q)),\"ERR!\",\"\"))","v":""},{"$f":"IF(AV6=\"!...\",AV6,IF(OR(AND(AX5<>\"\",AW5=\"\",AW5<>G33),AND(AX5<>\"\",AW5<>\"\",AW5=G33),AND(AX5<>\"\",AW5<>\"\",AW5<>DISTANCE_Q,G33<>DISTANCE_Q)),\"ERR!\",\"\"))","v":""},{"$f":"IF(AX5=\"\",\"\",IF(AX5=\"G\",(NB_SETS_G_Q*2)-1-COUNTIF(C33:G33,DISTANCE_Q),COUNTIF(AS5:AW5,DISTANCE_Q)))","v":""}]
[null,"Licence",null,null,null,null,null,"Moyenne",null,null,null,null,null,{"$f":"IF(N5=\"\",\"\",IF(SUM(C9:G9)<>0,ROUNDDOWN(SUM(I5:M5)/SUM(C9:G9),3),\"\"))","v":""},null,null,null,null,null,{"$f":"IF(T5=\"\",\"\",IF(SUM(C13:G13)<>0,ROUNDDOWN(SUM(O5:S5)/SUM(C13:G13),3),\"\"))","v":""},null,null,null,null,null,{"$f":"IF(Z5=\"\",\"\",IF(SUM(C17:G17)<>0,ROUNDDOWN(SUM(U5:Y5)/SUM(C17:G17),3),\"\"))","v":""},null,null,null,null,null,{"$f":"IF(AF5=\"\",\"\",IF(SUM(C21:G21)<>0,ROUNDDOWN(SUM(AA5:AE5)/SUM(C21:G21),3),\"\"))","v":""},null,null,null,null,null,{"$f":"IF(AL5=\"\",\"\",IF(SUM(C25:G25)<>0,ROUNDDOWN(SUM(AG5:AK5)/SUM(C25:G25),3),\"\"))","v":""},null,null,null,null,null,{"$f":"IF(AR5=\"\",\"\",IF(SUM(C29:G29)<>0,ROUNDDOWN(SUM(AM5:AQ5)/SUM(C29:G29),3),\"\"))","v":""},null,null,null,null,null,{"$f":"IF(AX5=\"\",\"\",IF(SUM(C33:G33)<>0,ROUNDDOWN(SUM(AS5:AW5)/SUM(C33:G33),3),\"\"))","v":""}]
[null,"Joueur 2","set 1","set 2","set 3","set 4","set 5","J1-J2",null,null,null,null,null,null,"set 1","set 2","set 3","set 4","set 5","J2-J3","set 1","set 2","set 3","set 4","set 5","J2-J4","set 1","set 2","set 3","set 4","set 5","J2-J5","set 1","set 2","set 3","set 4","set 5","J2-J6","set 1","set 2","set 3","set 4","set 5","J2-J7","set 1","set 2","set 3","set 4","set 5","J2-J8",null,{"$f":"IF(BH8<>\"\",RANK(BH8,BH4:BH35),\"\")","v":""},{"$f":"COUNTIF(H9:AX9,\"G\")*VAL_PT_MATCH","v":0},{"$f":"SUM(AX10,AR10,AL10,AF10,Z10,T10,H10)","v":0},{"$f":"IF(BF8<>0,ROUNDDOWN(BE8/BF8,3),\"\")","v":""},{"$f":"MAX(H11,T11,Z11,AF11,AL11,AR11,AX11)","v":0},{"$f":"SUM(C9:G9,O9:S9,U9:Y9,AA9:AE9,AG9:AK9,AM9:AQ9,AS9:AW9)","v":0},{"$f":"SUM(I13:M13,I17:M17,I21:M21,I25:M25,I29:M29,I33:M33,I5:M5)","v":0},null,{"$f":"IF(BC8<>\"\",(BA8*10000000)+(BB8*100000)+(BC8*10000)+BD8,\"\")","v":""}]
[null,"Nom & Prénom",null,null,null,null,null,{"$f":"IF(COUNTIF(C9:G9,DISTANCE_Q)=NB_SETS_G_Q,\"G\",IF(COUNTIF(I5:M5,DISTANCE_Q)=NB_SETS_G_Q,\"P\",\"\"))","v":""},null,null,null,null,null,null,null,null,null,null,null,{"$f":"IF(COUNTIF(O9:S9,DISTANCE_Q)=NB_SETS_G_Q,\"G\",IF(COUNTIF(I13:M13,DISTANCE_Q)=NB_SETS_G_Q,\"P\",\"\"))","v":""},null,null,null,null,null,{"$f":"IF(COUNTIF(U9:Y9,DISTANCE_Q)=NB_SETS_G_Q,\"G\",IF(COUNTIF(I17:M17,DISTANCE_Q)=NB_SETS_G_Q,\"P\",\"\"))","v":""},null,null,null,null,null,{"$f":"IF(COUNTIF(AA9:AE9,DISTANCE_Q)=NB_SETS_G_Q,\"G\",IF(COUNTIF(I21:M21,DISTANCE_Q)=NB_SETS_G_Q,\"P\",\"\"))","v":""},null,null,null,null,null,{"$f":"IF(COUNTIF(AG9:AK9,DISTANCE_Q)=NB_SETS_G_Q,\"G\",IF(COUNTIF(I25:M25,DISTANCE_Q)=NB_SETS_G_Q,\"P\",\"\"))","v":""},null,null,null,null,null,{"$f":"IF(COUNTIF(AM9:AQ9,DISTANCE_Q)=NB_SETS_G_Q,\"G\",IF(COUNTIF(I29:M29,DISTANCE_Q)=NB_SETS_G_Q,\"P\",\"\"))","v":""},null,null,null,null,null,{"$f":"IF(COUNTIF(AS9:AW9,DISTANCE_Q)=NB_SETS_G_Q,\"G\",IF(COUNTIF(I33:M33,DISTANCE_Q)=NB_SETS_G_Q,\"P\",\"\"))","v":""}]
[null,"Ville ou Club",{"$f":"IF(OR(COUNTIF(C9:G9,\"\")<>COUNTIF(I5:M5,\"\"),AND(H9=\"\",SUM(C9:G9)<>0)),\"!...\",IF(OR(AND(H9<>\"\",C9=\"\",C9<>I5),AND(H9<>\"\",C9<>\"\",C9=I5),AND(H9<>\"\",C9<>\"\",C9<>DISTANCE_Q,I5<>DISTANCE_Q)),\"ERR!\",\"\"))","v":""},{"$f":"IF(C10=\"!...\",C10,IF(OR(AND(H9<>\"\",D9=\"\",D9<>J5),AND(H9<>\"\",D9<>\"\",D9=J5),AND(H9<>\"\",D9<>\"\",D9<>DISTANCE_Q,J5<>DISTANCE_Q)),\"ERR!\",\"\"))","v":""},{"$f":"IF(D10=\"!...\",D10,IF(OR(AND(H9<>\"\",E9=\"\",E9<>K5),AND(H9<>\"\",E9<>\"\",E9=K5),AND(H9<>\"\",E9<>\"\",E9<>DISTANCE_Q,K5<>DISTANCE_Q)),\"ERR!\",\"\"))","v":""},{"$f":"IF(E10=\"!...\",E10,IF(OR(AND(H9<>\"\",F9=\"\",F9<>L5),AND(H9<>\"\",F9<>\"\",F9=L5),AND(H9<>\"\",F9<>\"\",F9<>DISTANCE_Q,L5<>DISTANCE_Q)),\"ERR!\",\"\"))","v":""},{"$f":"IF(F10=\"!...\",F10,IF(OR(AND(H9<>\"\",G9=\"\",G9<>M5),AND(H9<>\"\",G9<>\"\",G9=M5),AND(H9<>\"\",G9<>\"\",G9<>DISTANCE_Q,M5<>DISTANCE_Q)),\"ERR!\",\"\"))","v":""},{"$f":"IF(H9=\"\",\"\",IF(H9=\"G\",(NB_SETS_G_Q*2)-1-COUNTIF(I5:M5,DISTANCE_Q),COUNTIF(C9:G9,DISTANCE_Q)))","v":""},null,null,null,null,null,null,{"$f":"IF(OR(COUNTIF(O9:S9,\"\")<>COUNTIF(I13:M13,\"\"),AND(T9=\"\",SUM(O9:S9)<>0)),\"!...\",IF(OR(AND(T9<>\"\",O9=\"\",O9<>I13),AND(T9<>\"\",O9<>\"\",O9=I13),AND(T9<>\"\",O9<>\"\",O9<>DISTANCE_Q,I13<>DISTANCE_Q)),\"ERR!\",\"\"))","v":""},{"$f":"IF(O10=\"!...\",O10,IF(OR(AND(T9<>\"\",P9=\"\",P9<>J13),AND(T9<>\"\",P9<>\"\",P9=J13),AND(T9<>\"\",P9<>\"\",P9<>DISTANCE_Q,J13<>DISTANCE_Q)),\"ERR!\",\"\"))","v":""},{"$f":"IF(P10=\"!...\",P10,IF(OR(AND(T9<>\"\",Q9=\"\",Q9<>K13),AND(T9<>\"\",Q9<>\"\",Q9=K13),AND(T9<>\"\",Q9<>\"\",Q9<>DISTANCE_Q,K13<>DISTANCE_Q)),\"ERR!\",\"\"))","v":""},{"$f":"IF(Q10=\"!...\",Q10,IF(OR(AND(T9<>\"\",R9=\"\",R9<>L13),AND(T9<>\"\",R9<>\"\",R9=L13),AND(T9<>\"\",R9<>\"\",R9<>DISTANCE_Q,L13<>DISTANCE_Q)),\"ERR!\",\"\"))","v":""},{"$f":"IF(R10=\"!...\",R10,IF(OR(AND(T9<>\"\",S9=\"\",S9<>M13),AND(T9<>\"\",S9<>\"\",S9=M13),AND(T9<>\"\",S9<>\"\",S9<>DISTANCE_Q,M13<>DISTANCE_Q)),\"ERR!\",\"\"))","v":""},{"$f":"IF(T9=\"\",\"\",IF(T9=\"G\",(NB_SETS_G_Q*2)-1-COUNTIF(I13:M13,DISTANCE_Q),COUNTIF(O9:S9,DISTANCE_Q)))","v":""},{"$f":"IF(OR(COUNTIF(U9:Y9,\"\")<>COUNTIF(I17:M17,\"\"),AND(Z9=\"\",SUM(U9:Y9)<>0)),\"!...\",IF(OR(AND(Z9<>\"\",U9=\"\",U9<>I17),AND(Z9<>\"\",U9<>\"\",U9=I17),AND(Z9<>\"\",U9<>\"\",U9<>DISTANCE_Q,I17<>DISTANCE_Q)),\"ERR!\",\"\"))","v":""},{"$f":"IF(U10=\"!...\",U10,IF(OR(AND(Z9<>\"\",V9=\"\",V9<>J17),AND(Z9<>\"\",V9<>\"\",V9=J17),AND(Z9<>\"\",V9<>\"\",V9<>DISTANCE_Q,J17<>DISTANCE_Q)),\"ERR!\",\"\"))","v":""},{"$f":"IF(V10=\"!...\",V10,IF(OR(AND(Z9<>\"\",W9=\"\",W9<>K17),AND(Z9<>\"\",W9<>\"\",W9=K17),AND(Z9<>\"\",W9<>\"\",W9<>DISTANCE_Q,K17<>DISTANCE_Q)),\"ERR!\",\"\"))","v":""},{"$f":"IF(W10=\"!...\",W10,IF(OR(AND(Z9<>\"\",X9=\"\",X9<>L17),AND(Z9<>\"\",X9<>\"\",X9=L17),AND(Z9<>\"\",X9<>\"\",X9<>DISTANCE_Q,L17<>DISTANCE_Q)),\"ERR!\",\"\"))","v":""},{"$f":"IF(X10=\"!...\",X10,IF(OR(AND(Z9<>\"\",Y9=\"\",Y9<>M17),AND(Z9<>\"\",Y9<>\"\",Y9=M17),AND(Z9<>\"\",Y9<>\"\",Y9<>DISTANCE_Q,M17<>DISTANCE_Q)),\"ERR!\",\"\"))","v":""},{"$f":"IF(Z9=\"\",\"\",IF(Z9=\"G\",(NB_SETS_G_Q*2)-1-COUNTIF(I17:M17,DISTANCE_Q),COUNTIF(U9:Y9,DISTANCE_Q)))","v":""},{"$f":"IF(OR(COUNTIF(AA9:AE9,\"\")<>COUNTIF(I21:M21,\"\"),AND(AF9=\"\",SUM(AA9:AE9)<>0)),\"!...\",IF(OR(AND(AF9<>\"\",AA9=\"\",AA9<>I21),AND(AF9<>\"\",AA9<>\"\",AA9=I21),AND(AF9<>\"\",AA9<>\"\",AA9<>DISTANCE_Q,I21<>DISTANCE_Q)),\"ERR!\",\"\"))","v":""},{"$f":"IF(AA10=\"!...\",AA10,IF(OR(AND(AF9<>\"\",AB9=\"\",AB9<>J21),AND(AF9<>\"\",AB9<>\"\",AB9=J21),AND(AF9<>\"\",AB9<>\"\",AB9<>DISTANCE_Q,J21<>DISTANCE_Q)),\"ERR!\",\"\"))","v":""},{"$f":"IF(AB10=\"!...\",AB10,IF(OR(AND(AF9<>\"\",AC9=\"\",AC9<>K21),AND(AF9<>\"\",AC9<>\"\",AC9=K21),AND(AF9<>\"\",AC9<>\"\",AC9<>DISTANCE_Q,K21<>DISTANCE_Q)),\"ERR!\",\"\"))","v":""},{"$f":"IF(AC10=\"!...\",AC10,IF(OR(AND(AF9<>\"\",AD9=\"\",AD9<>L21),AND(AF9<>\"\",AD9<>\"\",AD9=L21),AND(AF9<>\"\",AD9<>\"\",AD9<>DISTANCE_Q,L21<>DISTANCE_Q)),\"ERR!\",\"\"))","v":""},{"$f":"IF(AD10=\"!...\",AD10,IF(OR(AND(AF9<>\"\",AE9=\"\",AE9<>M21),AND(AF9<>\"\",AE9<>\"\",AE9=M21),AND(AF9<>\"\",AE9<>\"\",AE9<>DISTANCE_Q,M21<>DISTANCE_Q)),\"ERR!\",\"\"))","v":""},{"$f":"IF(AF9=\"\",\"\",IF(AF9=\"G\",(NB_SETS_G_Q*2)-1-COUNTIF(I21:M21,DISTANCE_Q),COUNTIF(AA9:AE9,DISTANCE_Q)))","v":""},{"$f":"IF(OR(COUNTIF(AG9:AK9,\"\")<>COUNTIF(I25:M25,\"\"),AND(AL9=\"\",SUM(AG9:AK9)<>0)),\"!...\",IF(OR(AND(AL9<>\"\",AG9=\"\",AG9<>I25),AND(AL9<>\"\",AG9<>\"\",AG9=I25),AND(AL9<>\"\",AG9<>\"\",AG9<>DISTANCE_Q,I25<>DISTANCE_Q)),\"ERR!\",\"\"))","v":""},{"$f":"IF(AG10=\"!...\",AG10,IF(OR(AND(AL9<>\"\",AH9=\"\",AH9<>J25),AND(AL9<>\"\",AH9<>\"\",AH9=J25),AND(AL9<>\"\",AH9<>\"\",AH9<>DISTANCE_Q,J25<>DISTANCE_Q)),\"ERR!\",\"\"))","v":""},{"$f":"IF(AH10=\"!...\",AH10,IF(OR(AND(AL9<>\"\",AI9=\"\",AI9<>K25),AND(AL9<>\"\",AI9<>\"\",AI9=K25),AND(AL9<>\"\",AI9<>\"\",AI9<>DISTANCE_Q,K25<>DISTANCE_Q)),\"ERR!\",\"\"))","v":""},{"$f":"IF(AI10=\"!...\",AI10,IF(OR(AND(AL9<>\"\",AJ9=\"\",AJ9<>L25),AND(AL9<>\"\",AJ9<>\"\",AJ9=L25),AND(AL9<>\"\",AJ9<>\"\",AJ9<>DISTANCE_Q,L25<>DISTANCE_Q)),\"ERR!\",\"\"))","v":""},{"$f":"IF(AJ10=\"!...\",AJ10,IF(OR(AND(AL9<>\"\",AK9=\"\",AK9<>M25),AND(AL9<>\"\",AK9<>\"\",AK9=M25),AND(AL9<>\"\",AK9<>\"\",AK9<>DISTANCE_Q,M25<>DISTANCE_Q)),\"ERR!\",\"\"))","v":""},{"$f":"IF(AL9=\"\",\"\",IF(AL9=\"G\",(NB_SETS_G_Q*2)-1-COUNTIF(I25:M25,DISTANCE_Q),COUNTIF(AG9:AK9,DISTANCE_Q)))","v":""},{"$f":"IF(OR(COUNTIF(AM9:AQ9,\"\")<>COUNTIF(I29:M29,\"\"),AND(AR9=\"\",SUM(AM9:AQ9)<>0)),\"!...\",IF(OR(AND(AR9<>\"\",AM9=\"\",AM9<>I29),AND(AR9<>\"\",AM9<>\"\",AM9=I29),AND(AR9<>\"\",AM9<>\"\",AM9<>DISTANCE_Q,I29<>DISTANCE_Q)),\"ERR!\",\"\"))","v":""},{"$f":"IF(AM10=\"!...\",AM10,IF(OR(AND(AR9<>\"\",AN9=\"\",AN9<>J29),AND(AR9<>\"\",AN9<>\"\",AN9=J29),AND(AR9<>\"\",AN9<>\"\",AN9<>DISTANCE_Q,J29<>DISTANCE_Q)),\"ERR!\",\"\"))","v":""},{"$f":"IF(AN10=\"!...\",AN10,IF(OR(AND(AR9<>\"\",AO9=\"\",AO9<>K29),AND(AR9<>\"\",AO9<>\"\",AO9=K29),AND(AR9<>\"\",AO9<>\"\",AO9<>DISTANCE_Q,K29<>DISTANCE_Q)),\"ERR!\",\"\"))","v":""},{"$f":"IF(AO10=\"!...\",AO10,IF(OR(AND(AR9<>\"\",AP9=\"\",AP9<>L29),AND(AR9<>\"\",AP9<>\"\",AP9=L29),AND(AR9<>\"\",AP9<>\"\",AP9<>DISTANCE_Q,L29<>DISTANCE_Q)),\"ERR!\",\"\"))","v":""},{"$f":"IF(AP10=\"!...\",AP10,IF(OR(AND(AR9<>\"\",AQ9=\"\",AQ9<>M29),AND(AR9<>\"\",AQ9<>\"\",AQ9=M29),AND(AR9<>\"\",AQ9<>\"\",AQ9<>DISTANCE_Q,M29<>DISTANCE_Q)),\"ERR!\",\"\"))","v":""},{"$f":"IF(AR9=\"\",\"\",IF(AR9=\"G\",(NB_SETS_G_Q*2)-1-COUNTIF(I29:M29,DISTANCE_Q),COUNTIF(AM9:AQ9,DISTANCE_Q)))","v":""},{"$f":"IF(OR(COUNTIF(AS9:AW9,\"\")<>COUNTIF(I33:M33,\"\"),AND(AX9=\"\",SUM(AS9:AW9)<>0)),\"!...\",IF(OR(AND(AX9<>\"\",AS9=\"\",AS9<>I33),AND(AX9<>\"\",AS9<>\"\",AS9=I33),AND(AX9<>\"\",AS9<>\"\",AS9<>DISTANCE_Q,I33<>DISTANCE_Q)),\"ERR!\",\"\"))","v":""},{"$f":"IF(AS10=\"!...\",AS10,IF(OR(AND(AX9<>\"\",AT9=\"\",AT9<>J33),AND(AX9<>\"\",AT9<>\"\",AT9=J33),AND(AX9<>\"\",AT9<>\"\",AT9<>DISTANCE_Q,J33<>DISTANCE_Q)),\"ERR!\",\"\"))","v":""},{"$f":"IF(AT10=\"!...\",AT10,IF(OR(AND(AX9<>\"\",AU9=\"\",AU9<>K33),AND(AX9<>\"\",AU9<>\"\",AU9=K33),AND(AX9<>\"\",AU9<>\"\",AU9<>DISTANCE_Q,K33<>DISTANCE_Q)),\"ERR!\",\"\"))","v":""},{"$f":"IF(AU10=\"!...\",AU10,IF(OR(AND(AX9<>\"\",AV9=\"\",AV9<>L33),AND(AX9<>\"\",AV9<>\"\",AV9=L33),AND(AX9<>\"\",AV9<>\"\",AV9<>DISTANCE_Q,L33<>DISTANCE_Q)),\"ERR!\",\"\"))","v":""},{"$f":"IF(AV10=\"!...\",AV10,IF(OR(AND(AX9<>\"\",AW9=\"\",AW9<>M33),AND(AX9<>\"\",AW9<>\"\",AW9=M33),AND(AX9<>\"\",AW9<>\"\",AW9<>DISTANCE_Q,M33<>DISTANCE_Q)),\"ERR!\",\"\"))","v":""},{"$f":"IF(AX9=\"\",\"\",IF(AX9=\"G\",(NB_SETS_G_Q*2)-1-COUNTIF(I33:M33,DISTANCE_Q),COUNTIF(AS9:AW9,DISTANCE_Q)))","v":""}]
[null,"Licence",null,null,null,null,null,{"$f":"IF(H9=\"\",\"\",IF(SUM(I5:M5)<>0,ROUNDDOWN(SUM(C9:G9)/SUM(I5:M5),3),\"\"))","v":""},null,null,null,null,null,null,null,null,null,null,null,{"$f":"IF(T9=\"\",\"\",IF(SUM(I13:M13)<>0,ROUNDDOWN(SUM(O9:S9)/SUM(I13:M13),3),\"\"))","v":""},null,null,null,null,null,{"$f":"IF(Z9=\"\",\"\",IF(SUM(I17:M17)<>0,ROUNDDOWN(SUM(U9:Y9)/SUM(I17:M17),3),\"\"))","v":""},null,null,null,null,null,{"$f":"IF(AF9=\"\",\"\",IF(SUM(I21:M21)<>0,ROUNDDOWN(SUM(AA9:AE9)/SUM(I21:M21),3),\"\"))","v":""},null,null,null,null,null,{"$f":"IF(AL9=\"\",\"\",IF(SUM(I25:M25)<>0,ROUNDDOWN(SUM(AG9:AK9)/SUM(I25:M25),3),\"\"))","v":""},null,null,null,null,null,{"$f":"IF(AR9=\"\",\"\",IF(SUM(I29:M29)<>0,ROUNDDOWN(SUM(AM9:AQ9)/SUM(I29:M29),3),\"\"))","v":""},null,null,null,null,null,{"$f":"IF(AX9=\"\",\"\",IF(SUM(I33:M33)<>0,ROUNDDOWN(SUM(AS9:AW9)/SUM(I33:M33),3),\"\"))","v":""}]
[null,"Joueur 3","set 1","set 2","set 3","set 4","set 5","J1-J3","set 1","set 2","set 3","set 4","set 5","J2-J3",null,null,null,null,null,null,"set 1","set 2","set 3","set 4","set 5","J3-J4","set 1","set 2","set 3","set 4","set 5","J3-J5","set 1","set 2","set 3","set 4","set 5","J3-J6","set 1","set 2","set 3","set 4","set 5","J3-J7","set 1","set 2","set 3","set 4","set 5","J3-J8",null,{"$f":"IF(BH12<>\"\",RANK(BH12,BH4:BH35),\"\")","v":""},{"$f":"COUNTIF(H13:AX13,\"G\")*VAL_PT_MATCH","v":0},{"$f":"SUM(AX14,AR14,AL14,AF14,Z14,H14,N14)","v":0},{"$f":"IF(BF12<>0,ROUNDDOWN(BE12/BF12,3),\"\")","v":""},{"$f":"MAX(N15,H15,Z15,AF15,AL15,AR15,AX15)","v":0},{"$f":"SUM(I13:M13,C13:G13,U13:Y13,AA13:AE13,AG13:AK13,AM13:AQ13,AS13:AW13)","v":0},{"$f":"SUM(O17:S17,O21:S21,O25:S25,O29:S29,O33:S33,O9:S9,O5:S5)","v":0},null,{"$f":"IF(BC12<>\"\",(BA12*10000000)+(BB12*100000)+(BC12*10000)+BD12,\"\")","v":""}]
[null,"Nom & Prénom",null,null,null,null,null,{"$f":"IF(COUNTIF(C13:G13,DISTANCE_Q)=NB_SETS_G_Q,\"G\",IF(COUNTIF(O5:S5,DISTANCE_Q)=NB_SETS_G_Q,\"P\",\"\"))","v":""},null,null,null,null,null,{"$f":"IF(COUNTIF(I13:M13,DISTANCE_Q)=NB_SETS_G_Q,\"G\",IF(COUNTIF(O9:S9,DISTANCE_Q)=NB_SETS_G_Q,\"P\",\"\"))","v":""},null,null,null,null,null,null,null,null,null,null,null,{"$f":"IF(COUNTIF(U13:Y13,DISTANCE_Q)=NB_SETS_G_Q,\"G\",IF(COUNTIF(O17:S17,DISTANCE_Q)=NB_SETS_G_Q,\"P\",\"\"))","v":""},null,null,null,null,null,{"$f":"IF(COUNTIF(AA13:AE13,DISTANCE_Q)=NB_SETS_G_Q,\"G\",IF(COUNTIF(O21:S21,DISTANCE_Q)=NB_SETS_G_Q,\"P\",\"\"))","v":""},null,null,null,null,null,{"$f":"IF(COUNTIF(AG13:AK13,DISTANCE_Q)=NB_SETS_G_Q,\"G\",IF(COUNTIF(O25:S25,DISTANCE_Q)=NB_SETS_G_Q,\"P\",\"\"))","v":""},null,null,null,null,null,{"$f":"IF(COUNTIF(AM13:AQ13,DISTANCE_Q)=NB_SETS_G_Q,\"G\",IF(COUNTIF(O29:S29,DISTANCE_Q)=NB_SETS_G_Q,\"P\",\"\"))","v":""},null,null,null,null,null,{"$f":"IF(COUNTIF(AS13:AW13,DISTANCE_Q)=NB_SETS_G_Q,\"G\",IF(COUNTIF(O33:S33,DISTANCE_Q)=NB_SETS_G_Q,\"P\",\"\"))","v":""}]
[null,"Ville ou Club",{"$f":"IF(OR(COUNTIF(C13:G13,\"\")<>COUNTIF(O5:S5,\"\"),AND(H13=\"\",SUM(C13:G13)<>0)),\"!...\",IF(OR(AND(H13<>\"\",C13=\"\",C13<>O5),AND(H13<>\"\",C13<>\"\",C13=O5),AND(H13<>\"\",C13<>\"\",C13<>DISTANCE_Q,O5<>DISTANCE_Q)),\"ERR!\",\"\"))","v":""},{"$f":"IF(C14=\"!...\",C14,IF(OR(AND(H13<>\"\",D13=\"\",D13<>P5),AND(H13<>\"\",D13<>\"\",D13=P5),AND(H13<>\"\",D13<>\"\",D13<>DISTANCE_Q,P5<>DISTANCE_Q)),\"ERR!\",\"\"))","v":""},{"$f":"IF(D14=\"!...\",D14,IF(OR(AND(H13<>\"\",E13=\"\",E13<>Q5),AND(H13<>\"\",E13<>\"\",E13=Q5),AND(H13<>\"\",E13<>\"\",E13<>DISTANCE_Q,Q5<>DISTANCE_Q)),\"ERR!\",\"\"))","v":""},{"$f":"IF(E14=\"!...\",E14,IF(OR(AND(H13<>\"\",F13=\"\",F13<>R5),AND(H13<>\"\",F13<>\"\",F13=R5),AND(H13<>\"\",F13<>\"\",F13<>DISTANCE_Q,R5<>DISTANCE_Q)),\"ERR!\",\"\"))","v":""},{"$f":"IF(F14=\"!...\",F14,IF(OR(AND(H13<>\"\",G13=\"\",G13<>S5),AND(H13<>\"\",G13<>\"\",G13=S5),AND(H13<>\"\",G13<>\"\",G13<>DISTANCE_Q,S5<>DISTANCE_Q)),\"ERR!\",\"\"))","v":""},{"$f":"IF(H13=\"\",\"\",IF(H13=\"G\",(NB_SETS_G_Q*2)-1-COUNTIF(O5:S5,DISTANCE_Q),COUNTIF(C13:G13,DISTANCE_Q)))","v":""},{"$f":"IF(OR(COUNTIF(I13:M13,\"\")<>COUNTIF(O9:S9,\"\"),AND(N13=\"\",SUM(I13:M13)<>0)),\"!...\",IF(OR(AND(N13<>\"\",I13=\"\",I13<>O9),AND(N13<>\"\",I13<>\"\",I13=O9),AND(N13<>\"\",I13<>\"\",I13<>DISTANCE_Q,O9<>DISTANCE_Q)),\"ERR!\",\"\"))","v":""},{"$f":"IF(I14=\"!...\",I14,IF(OR(AND(N13<>\"\",J13=\"\",J13<>P9),AND(N13<>\"\",J13<>\"\",J13=P9),AND(N13<>\"\",J13<>\"\",J13<>DISTANCE_Q,P9<>DISTANCE_Q)),\"ERR!\",\"\"))","v":""},{"$f":"IF(J14=\"!...\",J14,IF(OR(AND(N13<>\"\",K13=\"\",K13<>Q9),AND(N13<>\"\",K13<>\"\",K13=Q9),AND(N13<>\"\",K13<>\"\",K13<>DISTANCE_Q,Q9<>DISTANCE_Q)),\"ERR!\",\"\"))","v":""},{"$f":"IF(K14=\"!...\",K14,IF(OR(AND(N13<>\"\",L13=\"\",L13<>R9),AND(N13<>\"\",L13<>\"\",L13=R9),AND(N13<>\"\",L13<>\"\",L13<>DISTANCE_Q,R9<>DISTANCE_Q)),\"ERR!\",\"\"))","v":""},{"$f":"IF(L14=\"!...\",L14,IF(OR(AND(N13<>\"\",M13=\"\",M13<>S9),AND(N13<>\"\",M13<>\"\",M13=S9),AND(N13<>\"\",M13<>\"\",M13<>DISTANCE_Q,S9<>DISTANCE_Q)),\"ERR!\",\"\"))","v":""},{"$f":"IF(N13=\"\",\"\",IF(N13=\"G\",(NB_SETS_G_Q*2)-1-COUNTIF(O9:S9,DISTANCE_Q),COUNTIF(I13:M13,DISTANCE_Q)))","v":""},null,null,null,null,null,null,{"$f":"IF(OR(COUNTIF(U13:Y13,\"\")<>COUNTIF(O17:S17,\"\"),AND(Z13=\"\",SUM(U13:Y13)<>0)),\"!...\",IF(OR(AND(Z13<>\"\",U13=\"\",U13<>O17),AND(Z13<>\"\",U13<>\"\",U13=O17),AND(Z13<>\"\",U13<>\"\",U13<>DISTANCE_Q,O17<>DISTANCE_Q)),\"ERR!\",\"\"))","v":""},{"$f":"IF(U14=\"!...\",U14,IF(OR(AND(Z13<>\"\",V13=\"\",V13<>P17),AND(Z13<>\"\",V13<>\"\",V13=P17),AND(Z13<>\"\",V13<>\"\",V13<>DISTANCE_Q,P17<>DISTANCE_Q)),\"ERR!\",\"\"))","v":""},{"$f":"IF(V14=\"!...\",V14,IF(OR(AND(Z13<>\"\",W13=\"\",W13<>Q17),AND(Z13<>\"\",W13<>\"\",W13=Q17),AND(Z13<>\"\",W13<>\"\",W13<>DISTANCE_Q,Q17<>DISTANCE_Q)),\"ERR!\",\"\"))","v":""},{"$f":"IF(W14=\"!...\",W14,IF(OR(AND(Z13<>\"\",X13=\"\",X13<>R17),AND(Z13<>\"\",X13<>\"\",X13=R17),AND(Z13<>\"\",X13<>\"\",X13<>DISTANCE_Q,R17<>DISTANCE_Q)),\"ERR!\",\"\"))","v":""},{"$f":"IF(X14=\"!...\",X14,IF(OR(AND(Z13<>\"\",Y13=\"\",Y13<>S17),AND(Z13<>\"\",Y13<>\"\",Y13=S17),AND(Z13<>\"\",Y13<>\"\",Y13<>DISTANCE_Q,S17<>DISTANCE_Q)),\"ERR!\",\"\"))","v":""},{"$f":"IF(Z13=\"\",\"\",IF(Z13=\"G\",(NB_SETS_G_Q*2)-1-COUNTIF(O17:S17,DISTANCE_Q),COUNTIF(U13:Y13,DISTANCE_Q)))","v":""},{"$f":"IF(OR(COUNTIF(AA13:AE13,\"\")<>COUNTIF(O21:S21,\"\"),AND(AF13=\"\",SUM(AA13:AE13)<>0)),\"!...\",IF(OR(AND(AF13<>\"\",AA13=\"\",AA13<>O21),AND(AF13<>\"\",AA13<>\"\",AA13=O21),AND(AF13<>\"\",AA13<>\"\",AA13<>DISTANCE_Q,O21<>DISTANCE_Q)),\"ERR!\",\"\"))","v":""},{"$f":"IF(AA14=\"!...\",AA14,IF(OR(AND(AF13<>\"\",AB13=\"\",AB13<>P21),AND(AF13<>\"\",AB13<>\"\",AB13=P21),AND(AF13<>\"\",AB13<>\"\",AB13<>DISTANCE_Q,P21<>DISTANCE_Q)),\"ERR!\",\"\"))","v":""},{"$f":"IF(AB14=\"!...\",AB14,IF(OR(AND(AF13<>\"\",AC13=\"\",AC13<>Q21),AND(AF13<>\"\",AC13<>\"\",AC13=Q21),AND(AF13<>\"\",AC13<>\"\",AC13<>DISTANCE_Q,Q21<>DISTANCE_Q)),\"ERR!\",\"\"))","v":""},{"$f":"IF(AC14=\"!...\",AC14,IF(OR(AND(AF13<>\"\",AD13=\"\",AD13<>R21),AND(AF13<>\"\",AD13<>\"\",AD13=R21),AND(AF13<>\"\",AD13<>\"\",AD13<>DISTANCE_Q,R21<>DISTANCE_Q)),\"ERR!\",\"\"))","v":""},{"$f":"IF(AD14=\"!...\",AD14,IF(OR(AND(AF13<>\"\",AE13=\"\",AE13<>S21),AND(AF13<>\"\",AE13<>\"\",AE13=S21),AND(AF13<>\"\",AE13<>\"\",AE13<>DISTANCE_Q,S21<>DISTANCE_Q)),\"ERR!\",\"\"))","v":""},{"$f":"IF(AF13=\"\",\"\",IF(AF13=\"G\",(NB_SETS_G_Q*2)-1-COUNTIF(O21:S21,DISTANCE_Q),COUNTIF(AA13:AE13,DISTANCE_Q)))","v":""},{"$f":"IF(OR(COUNTIF(AG13:AK13,\"\")<>COUNTIF(O25:S25,\"\"),AND(AL13=\"\",SUM(AG13:AK13)<>0)),\"!...\",IF(OR(AND(AL13<>\"\",AG13=\"\",AG13<>O25),AND(AL13<>\"\",AG13<>\"\",AG13=O25),AND(AL13<>\"\",AG13<>\"\",AG13<>DISTANCE_Q,O25<>DISTANCE_Q)),\"ERR!\",\"\"))","v":""},{"$f":"IF(AG14=\"!...\",AG14,IF(OR(AND(AL13<>\"\",AH13=\"\",AH13<>P25),AND(AL13<>\"\",AH13<>\"\",AH13=P25),AND(AL13<>\"\",AH13<>\"\",AH13<>DISTANCE_Q,P25<>DISTANCE_Q)),\"ERR!\",\"\"))","v":""},{"$f":"IF(AH14=\"!...\",AH14,IF(OR(AND(AL13<>\"\",AI13=\"\",AI13<>Q25),AND(AL13<>\"\",AI13<>\"\",AI13=Q25),AND(AL13<>\"\",AI13<>\"\",AI13<>DISTANCE_Q,Q25<>DISTANCE_Q)),\"ERR!\",\"\"))","v":""},{"$f":"IF(AI14=\"!...\",AI14,IF(OR(AND(AL13<>\"\",AJ13=\"\",AJ13<>R25),AND(AL13<>\"\",AJ13<>\"\",AJ13=R25),AND(AL13<>\"\",AJ13<>\"\",AJ13<>DISTANCE_Q,R25<>DISTANCE_Q)),\"ERR!\",\"\"))","v":""},{"$f":"IF(AJ14=\"!...\",AJ14,IF(OR(AND(AL13<>\"\",AK13=\"\",AK13<>S25),AND(AL13<>\"\",AK13<>\"\",AK13=S25),AND(AL13<>\"\",AK13<>\"\",AK13<>DISTANCE_Q,S25<>DISTANCE_Q)),\"ERR!\",\"\"))","v":""},{"$f":"IF(AL13=\"\",\"\",IF(AL13=\"G\",(NB_SETS_G_Q*2)-1-COUNTIF(O25:S25,DISTANCE_Q),COUNTIF(AG13:AK13,DISTANCE_Q)))","v":""},{"$f":"IF(OR(COUNTIF(AM13:AQ13,\"\")<>COUNTIF(O29:S29,\"\"),AND(AR13=\"\",SUM(AM13:AQ13)<>0)),\"!...\",IF(OR(AND(AR13<>\"\",AM13=\"\",AM13<>O29),AND(AR13<>\"\",AM13<>\"\",AM13=O29),AND(AR13<>\"\",AM13<>\"\",AM13<>DISTANCE_Q,O29<>DISTANCE_Q)),\"ERR!\",\"\"))","v":""},{"$f":"IF(AM14=\"!...\",AM14,IF(OR(AND(AR13<>\"\",AN13=\"\",AN13<>P29),AND(AR13<>\"\",AN13<>\"\",AN13=P29),AND(AR13<>\"\",AN13<>\"\",AN13<>DISTANCE_Q,P29<>DISTANCE_Q)),\"ERR!\",\"\"))","v":""},{"$f":"IF(AN14=\"!...\",AN14,IF(OR(AND(AR13<>\"\",AO13=\"\",AO13<>Q29),AND(AR13<>\"\",AO13<>\"\",AO13=Q29),AND(AR13<>\"\",AO13<>\"\",AO13<>DISTANCE_Q,Q29<>DISTANCE_Q)),\"ERR!\",\"\"))","v":""},{"$f":"IF(AO14=\"!...\",AO14,IF(OR(AND(AR13<>\"\",AP13=\"\",AP13<>R29),AND(AR13<>\"\",AP13<>\"\",AP13=R29),AND(AR13<>\"\",AP13<>\"\",AP13<>DISTANCE_Q,R29<>DISTANCE_Q)),\"ERR!\",\"\"))","v":""},{"$f":"IF(AP14=\"!...\",AP14,IF(OR(AND(AR13<>\"\",AQ13=\"\",AQ13<>S29),AND(AR13<>\"\",AQ13<>\"\",AQ13=S29),AND(AR13<>\"\",AQ13<>\"\",AQ13<>DISTANCE_Q,S29<>DISTANCE_Q)),\"ERR!\",\"\"))","v":""},{"$f":"IF(AR13=\"\",\"\",IF(AR13=\"G\",(NB_SETS_G_Q*2)-1-COUNTIF(O29:S29,DISTANCE_Q),COUNTIF(AM13:AQ13,DISTANCE_Q)))","v":""},{"$f":"IF(OR(COUNTIF(AS13:AW13,\"\")<>COUNTIF(O33:S33,\"\"),AND(AX13=\"\",SUM(AS13:AW13)<>0)),\"!...\",IF(OR(AND(AX13<>\"\",AS13=\"\",AS13<>O33),AND(AX13<>\"\",AS13<>\"\",AS13=O33),AND(AX13<>\"\",AS13<>\"\",AS13<>DISTANCE_Q,O33<>DISTANCE_Q)),\"ERR!\",\"\"))","v":""},{"$f":"IF(AS14=\"!...\",AS14,IF(OR(AND(AX13<>\"\",AT13=\"\",AT13<>P33),AND(AX13<>\"\",AT13<>\"\",AT13=P33),AND(AX13<>\"\",AT13<>\"\",AT13<>DISTANCE_Q,P33<>DISTANCE_Q)),\"ERR!\",\"\"))","v":""},{"$f":"IF(AT14=\"!...\",AT14,IF(OR(AND(AX13<>\"\",AU13=\"\",AU13<>Q33),AND(AX13<>\"\",AU13<>\"\",AU13=Q33),AND(AX13<>\"\",AU13<>\"\",AU13<>DISTANCE_Q,Q33<>DISTANCE_Q)),\"ERR!\",\"\"))","v":""},{"$f":"IF(AU14=\"!...\",AU14,IF(OR(AND(AX13<>\"\",AV13=\"\",AV13<>R33),AND(AX13<>\"\",AV13<>\"\",AV13=R33),AND(AX13<>\"\",AV13<>\"\",AV13<>DISTANCE_Q,R33<>DISTANCE_Q)),\"ERR!\",\"\"))","v":""},{"$f":"IF(AV14=\"!...\",AV14,IF(OR(AND(AX13<>\"\",AW13=\"\",AW13<>S33),AND(AX13<>\"\",AW13<>\"\",AW13=S33),AND(AX13<>\"\",AW13<>\"\",AW13<>DISTANCE_Q,S33<>DISTANCE_Q)),\"ERR!\",\"\"))","v":""},{"$f":"IF(AX13=\"\",\"\",IF(AX13=\"G\",(NB_SETS_G_Q*2)-1-COUNTIF(O33:S33,DISTANCE_Q),COUNTIF(AS13:AW13,DISTANCE_Q)))","v":""}]
[null,"Licence",null,null,null,null,null,{"$f":"IF(H13=\"\",\"\",IF(SUM(O5:S5)<>0,ROUNDDOWN(SUM(C13:G13)/SUM(O5:S5),3),\"\"))","v":""},null,null,null,null,null,{"$f":"IF(N13=\"\",\"\",IF(SUM(O9:S9)<>0,ROUNDDOWN(SUM(I13:M13)/SUM(O9:S9),3),\"\"))","v":""},null,null,null,null,null,null,null,null,null,null,null,{"$f":"IF(Z13=\"\",\"\",IF(SUM(O17:S17)<>0,ROUNDDOWN(SUM(U13:Y13)/SUM(O17:S17),3),\"\"))","v":""},null,null,null,null,null,{"$f":"IF(AF13=\"\",\"\",IF(SUM(O21:S21)<>0,ROUNDDOWN(SUM(AA13:AE13)/SUM(O21:S21),3),\"\"))","v":""},null,null,null,null,null,{"$f":"IF(AL13=\"\",\"\",IF(SUM(O25:S25)<>0,ROUNDDOWN(SUM(AG13:AK13)/SUM(O25:S25),3),\"\"))","v":""},null,null,null,null,null,{"$f":"IF(AR13=\"\",\"\",IF(SUM(O29:S29)<>0,ROUNDDOWN(SUM(AM13:AQ13)/SUM(O29:S29),3),\"\"))","v":""},null,null,null,null,null,{"$f":"IF(AX13=\"\",\"\",IF(SUM(O33:S33)<>0,ROUNDDOWN(SUM(AS13:AW13)/SUM(O33:S33),3),\"\"))","v":""}]
[null,"Joueur 4","set 1","set 2","set 3","set 4","set 5","J1-J4","set 1","set 2","set 3","set 4","set 5","J2-J4","set 1","set 2","set 3","set 4","set 5","J3-J4",null,null,null,null,null,null,"set 1","set 2","set 3","set 4","set 5","J4-J5","set 1","set 2","set 3","set 4","set 5","J4-J6","set 1","set 2","set 3","set 4","set 5","J4-J7","set 1","set 2","set 3","set 4","set 5","J4-J8",null,{"$f":"IF(BH16<>\"\",RANK(BH16,BH4:BH35),\"\")","v":""},{"$f":"COUNTIF(H17:AX17,\"G\")*VAL_PT_MATCH","v":0},{"$f":"SUM(AX18,AR18,AL18,AF18,H18,T18,N18)","v":0},{"$f":"IF(BF16<>0,ROUNDDOWN(BE16/BF16,3),\"\")","v":""},{"$f":"MAX(N19,T19,H19,AF19,AL19,AR19,AX19)","v":0},{"$f":"SUM(I17:M17,O17:S17,C17:G17,AA17:AE17,AG17:AK17,AM17:AQ17,AS17:AW17)","v":0},{"$f":"SUM(U21:Y21,U25:Y25,U29:Y29,U33:Y33,U13:Y13,U9:Y9,U5:Y5)","v":0},null,{"$f":"IF(BC16<>\"\",(BA16*10000000)+(BB16*100000)+(BC16*10000)+BD16,\"\")","v":""}]
[null,"Nom & Prénom",null,null,null,null,null,{"$f":"IF(COUNTIF(C17:G17,DISTANCE_Q)=NB_SETS_G_Q,\"G\",IF(COUNTIF(U5:Y5,DISTANCE_Q)=NB_SETS_G_Q,\"P\",\"\"))","v":""},null,null,null,null,null,{"$f":"IF(COUNTIF(I17:M17,DISTANCE_Q)=NB_SETS_G_Q,\"G\",IF(COUNTIF(U9:Y9,DISTANCE_Q)=NB_SETS_G_Q,\"P\",\"\"))","v":""},null,null,null,null,null,{"$f":"IF(COUNTIF(O17:S17,DISTANCE_Q)=NB_SETS_G_Q,\"G\",IF(COUNTIF(U13:Y13,DISTANCE_Q)=NB_SETS_G_Q,\"P\",\"\"))","v":""},null,null,null,null,null,null,null,null,null,null,null,{"$f":"IF(COUNTIF(AA17:AE17,DISTANCE_Q)=NB_SETS_G_Q,\"G\",IF(COUNTIF(U21:Y21,DISTANCE_Q)=NB_SETS_G_Q,\"P\",\"\"))","v":""},null,null,null,null,null,{"$f":"IF(COUNTIF(AG17:AK17,DISTANCE_Q)=NB_SETS_G_Q,\"G\",IF(COUNTIF(U25:Y25,DISTANCE_Q)=NB_SETS_G_Q,\"P\",\"\"))","v":""},null,null,null,null,null,{"$f":"IF(COUNTIF(AM17:AQ17,DISTANCE_Q)=NB_SETS_G_Q,\"G\",IF(COUNTIF(U29:Y29,DISTANCE_Q)=NB_SETS_G_Q,\"P\",\"\"))","v":""},null,null,null,null,null,{"$f":"IF(COUNTIF(AS17:AW17,DISTANCE_Q)=NB_SETS_G_Q,\"G\",IF(COUNTIF(U33:Y33,DISTANCE_Q)=NB_SETS_G_Q,\"P\",\"\"))","v":""}]
[null,"Ville ou Club",{"$f":"IF(OR(COUNTIF(C17:G17,\"\")<>COUNTIF(U5:Y5,\"\"),AND(H17=\"\",SUM(C17:G17)<>0)),\"!...\",IF(OR(AND(H17<>\"\",C17=\"\",C17<>U5),AND(H17<>\"\",C17<>\"\",C17=U5),AND(H17<>\"\",C17<>\"\",C17<>DISTANCE_Q,U5<>DISTANCE_Q)),\"ERR!\",\"\"))","v":""},{"$f":"IF(C18=\"!...\",C18,IF(OR(AND(H17<>\"\",D17=\"\",D17<>V5),AND(H17<>\"\",D17<>\"\",D17=V5),AND(H17<>\"\",D17<>\"\",D17<>DISTANCE_Q,V5<>DISTANCE_Q)),\"ERR!\",\"\"))","v":""},{"$f":"IF(D18=\"!...\",D18,IF(OR(AND(H17<>\"\",E17=\"\",E17<>W5),AND(H17<>\"\",E17<>\"\",E17=W5),AND(H17<>\"\",E17<>\"\",E17<>DISTANCE_Q,W5<>DISTANCE_Q)),\"ERR!\",\"\"))","v":""},{"$f":"IF(E18=\"!...\",E18,IF(OR(AND(H17<>\"\",F17=\"\",F17<>X5),AND(H17<>\"\",F17<>\"\",F17=X5),AND(H17<>\"\",F17<>\"\",F17<>DISTANCE_Q,X5<>DISTANCE_Q)),\"ERR!\",\"\"))","v":""},{"$f":"IF(F18=\"!...\",F18,IF(OR(AND(H17<>\"\",G17=\"\",G17<>Y5),AND(H17<>\"\",G17<>\"\",G17=Y5),AND(H17<>\"\",G17<>\"\",G17<>DISTANCE_Q,Y5<>DISTANCE_Q)),\"ERR!\",\"\"))","v":""},{"$f":"IF(H17=\"\",\"\",IF(H17=\"G\",(NB_SETS_G_Q*2)-1-COUNTIF(U5:Y5,DISTANCE_Q),COUNTIF(C17:G17,DISTANCE_Q)))","v":""},{"$f":"IF(OR(COUNTIF(I17:M17,\"\")<>COUNTIF(U9:Y9,\"\"),AND(N17=\"\",SUM(I17:M17)<>0)),\"!...\",IF(OR(AND(N17<>\"\",I17=\"\",I17<>U9),AND(N17<>\"\",I17<>\"\",I17=U9),AND(N17<>\"\",I17<>\"\",I17<>DISTANCE_Q,U9<>DISTANCE_Q)),\"ERR!\",\"\"))","v":""},{"$f":"IF(I18=\"!...\",I18,IF(OR(AND(N17<>\"\",J17=\"\",J17<>V9),AND(N17<>\"\",J17<>\"\",J17=V9),AND(N17<>\"\",J17<>\"\",J17<>DISTANCE_Q,V9<>DISTANCE_Q)),\"ERR!\",\"\"))","v":""},{"$f":"IF(J18=\"!...\",J18,IF(OR(AND(N17<>\"\",K17=\"\",K17<>W9),AND(N17<>\"\",K17<>\"\",K17=W9),AND(N17<>\"\",K17<>\"\",K17<>DISTANCE_Q,W9<>DISTANCE_Q)),\"ERR!\",\"\"))","v":""},{"$f":"IF(K18=\"!...\",K18,IF(OR(AND(N17<>\"\",L17=\"\",L17<>X9),AND(N17<>\"\",L17<>\"\",L17=X9),AND(N17<>\"\",L17<>\"\",L17<>DISTANCE_Q,X9<>DISTANCE_Q)),\"ERR!\",\"\"))","v":""},{"$f":"IF(L18=\"!...\",L18,IF(OR(AND(N17<>\"\",M17=\"\",M17<>Y9),AND(N17<>\"\",M17<>\"\",M17=Y9),AND(N17<>\"\",M17<>\"\",M17<>DISTANCE_Q,Y9<>DISTANCE_Q)),\"ERR!\",\"\"))","v":""},{"$f":"IF(N17=\"\",\"\",IF(N17=\"G\",(NB_SETS_G_Q*2)-1-COUNTIF(U9:Y9,DISTANCE_Q),COUNTIF(I17:M17,DISTANCE_Q)))","v":""},{"$f":"IF(OR(COUNTIF(O17:S17,\"\")<>COUNTIF(U13:Y13,\"\"),AND(T17=\"\",SUM(O17:S17)<>0)),\"!...\",IF(OR(AND(T17<>\"\",O17=\"\",O17<>U13),AND(T17<>\"\",O17<>\"\",O17=U13),AND(T17<>\"\",O17<>\"\",O17<>DISTANCE_Q,U13<>DISTANCE_Q)),\"ERR!\",\"\"))","v":""},{"$f":"IF(O18=\"!...\",O18,IF(OR(AND(T17<>\"\",P17=\"\",P17<>V13),AND(T17<>\"\",P17<>\"\",P17=V13),AND(T17<>\"\",P17<>\"\",P17<>DISTANCE_Q,V13<>DISTANCE_Q)),\"ERR!\",\"\"))","v":""},{"$f":"IF(P18=\"!...\",P18,IF(OR(AND(T17<>\"\",Q17=\"\",Q17<>W13),AND(T17<>\"\",Q17<>\"\",Q17=W13),AND(T17<>\"\",Q17<>\"\",Q17<>DISTANCE_Q,W13<>DISTANCE_Q)),\"ERR!\",\"\"))","v":""},{"$f":"IF(Q18=\"!...\",Q18,IF(OR(AND(T17<>\"\",R17=\"\",R17<>X13),AND(T17<>\"\",R17<>\"\",R17=X13),AND(T17<>\"\",R17<>\"\",R17<>DISTANCE_Q,X13<>DISTANCE_Q)),\"ERR!\",\"\"))","v":""},{"$f":"IF(R18=\"!...\",R18,IF(OR(AND(T17<>\"\",S17=\"\",S17<>Y13),AND(T17<>\"\",S17<>\"\",S17=Y13),AND(T17<>\"\",S17<>\"\",S17<>DISTANCE_Q,Y13<>DISTANCE_Q)),\"ERR!\",\"\"))","v":""},{"$f":"IF(T17=\"\",\"\",IF(T17=\"G\",(NB_SETS_G_Q*2)-1-COUNTIF(U13:Y13,DISTANCE_Q),COUNTIF(O17:S17,DISTANCE_Q)))","v":""},null,null,null,null,null,null,{"$f":"IF(OR(COUNTIF(AA17:AE17,\"\")<>COUNTIF(U21:Y21,\"\"),AND(AF17=\"\",SUM(AA17:AE17)<>0)),\"!...\",IF(OR(AND(AF17<>\"\",AA17=\"\",AA17<>U21),AND(AF17<>\"\",AA17<>\"\",AA17=U21),AND(AF17<>\"\",AA17<>\"\",AA17<>DISTANCE_Q,U21<>DISTANCE_Q)),\"ERR!\",\"\"))","v":""},{"$f":"IF(AA18=\"!...\",AA18,IF(OR(AND(AF17<>\"\",AB17=\"\",AB17<>V21),AND(AF17<>\"\",AB17<>\"\",AB17=V21),AND(AF17<>\"\",AB17<>\"\",AB17<>DISTANCE_Q,V21<>DISTANCE_Q)),\"ERR!\",\"\"))","v":""},{"$f":"IF(AB18=\"!...\",AB18,IF(OR(AND(AF17<>\"\",AC17=\"\",AC17<>W21),AND(AF17<>\"\",AC17<>\"\",AC17=W21),AND(AF17<>\"\",AC17<>\"\",AC17<>DISTANCE_Q,W21<>DISTANCE_Q)),\"ERR!\",\"\"))","v":""},{"$f":"IF(AC18=\"!...\",AC18,IF(OR(AND(AF17<>\"\",AD17=\"\",AD17<>X21),AND(AF17<>\"\",AD17<>\"\",AD17=X21),AND(AF17<>\"\",AD17<>\"\",AD17<>DISTANCE_Q,X21<>DISTANCE_Q)),\"ERR!\",\"\"))","v":""},{"$f":"IF(AD18=\"!...\",AD18,IF(OR(AND(AF17<>\"\",AE17=\"\",AE17<>Y21),AND(AF17<>\"\",AE17<>\"\",AE17=Y21),AND(AF17<>\"\",AE17<>\"\",AE17<>DISTANCE_Q,Y21<>DISTANCE_Q)),\"ERR!\",\"\"))","v":""},{"$f":"IF(AF17=\"\",\"\",IF(AF17=\"G\",(NB_SETS_G_Q*2)-1-COUNTIF(U21:Y21,DISTANCE_Q),COUNTIF(AA17:AE17,DISTANCE_Q)))","v":""},{"$f":"IF(OR(COUNTIF(AG17:AK17,\"\")<>COUNTIF(U25:Y25,\"\"),AND(AL17=\"\",SUM(AG17:AK17)<>0)),\"!...\",IF(OR(AND(AL17<>\"\",AG17=\"\",AG17<>U25),AND(AL17<>\"\",AG17<>\"\",AG17=U25),AND(AL17<>\"\",AG17<>\"\",AG17<>DISTANCE_Q,U25<>DISTANCE_Q)),\"ERR!\",\"\"))","v":""},{"$f":"IF(AG18=\"!...\",AG18,IF(OR(AND(AL17<>\"\",AH17=\"\",AH17<>V25),AND(AL17<>\"\",AH17<>\"\",AH17=V25),AND(AL17<>\"\",AH17<>\"\",AH17<>DISTANCE_Q,V25<>DISTANCE_Q)),\"ERR!\",\"\"))","v":""},{"$f":"IF(AH18=\"!...\",AH18,IF(OR(AND(AL17<>\"\",AI17=\"\",AI17<>W25),AND(AL17<>\"\",AI17<>\"\",AI17=W25),AND(AL17<>\"\",AI17<>\"\",AI17<>DISTANCE_Q,W25<>DISTANCE_Q)),\"ERR!\",\"\"))","v":""},{"$f":"IF(AI18=\"!...\",AI18,IF(OR(AND(AL17<>\"\",AJ17=\"\",AJ17<>X25),AND(AL17<>\"\",AJ17<>\"\",AJ17=X25),AND(AL17<>\"\",AJ17<>\"\",AJ17<>DISTANCE_Q,X25<>DISTANCE_Q)),\"ERR!\",\"\"))","v":""},{"$f":"IF(AJ18=\"!...\",AJ18,IF(OR(AND(AL17<>\"\",AK17=\"\",AK17<>Y25),AND(AL17<>\"\",AK17<>\"\",AK17=Y25),AND(AL17<>\"\",AK17<>\"\",AK17<>DISTANCE_Q,Y25<>DISTANCE_Q)),\"ERR!\",\"\"))","v":""},{"$f":"IF(AL17=\"\",\"\",IF(AL17=\"G\",(NB_SETS_G_Q*2)-1-COUNTIF(U25:Y25,DISTANCE_Q),COUNTIF(AG17:AK17,DISTANCE_Q)))","v":""},{"$f":"IF(OR(COUNTIF(AM17:AQ17,\"\")<>COUNTIF(U29:Y29,\"\"),AND(AR17=\"\",SUM(AM17:AQ17)<>0)),\"!...\",IF(OR(AND(AR17<>\"\",AM17=\"\",AM17<>U29),AND(AR17<>\"\",AM17<>\"\",AM17=U29),AND(AR17<>\"\",AM17<>\"\",AM17<>DISTANCE_Q,U29<>DISTANCE_Q)),\"ERR!\",\"\"))","v":""},{"$f":"IF(AM18=\"!...\",AM18,IF(OR(AND(AR17<>\"\",AN17=\"\",AN17<>V29),AND(AR17<>\"\",AN17<>\"\",AN17=V29),AND(AR17<>\"\",AN17<>\"\",AN17<>DISTANCE_Q,V29<>DISTANCE_Q)),\"ERR!\",\"\"))","v":""},{"$f":"IF(AN18=\"!...\",AN18,IF(OR(AND(AR17<>\"\",AO17=\"\",AO17<>W29),AND(AR17<>\"\",AO17<>\"\",AO17=W29),AND(AR17<>\"\",AO17<>\"\",AO17<>DISTANCE_Q,W29<>DISTANCE_Q)),\"ERR!\",\"\"))","v":""},{"$f":"IF(AO18=\"!...\",AO18,IF(OR(AND(AR17<>\"\",AP17=\"\",AP17<>X29),AND(AR17<>\"\",AP17<>\"\",AP17=X29),AND(AR17<>\"\",AP17<>\"\",AP17<>DISTANCE_Q,X29<>DISTANCE_Q)),\"ERR!\",\"\"))","v":""},{"$f":"IF(AP18=\"!...\",AP18,IF(OR(AND(AR17<>\"\",AQ17=\"\",AQ17<>Y29),AND(AR17<>\"\",AQ17<>\"\",AQ17=Y29),AND(AR17<>\"\",AQ17<>\"\",AQ17<>DISTANCE_Q,Y29<>DISTANCE_Q)),\"ERR!\",\"\"))","v":""},{"$f":"IF(AR17=\"\",\"\",IF(AR17=\"G\",(NB_SETS_G_Q*2)-1-COUNTIF(U29:Y29,DISTANCE_Q),COUNTIF(AM17:AQ17,DISTANCE_Q)))","v":""},{"$f":"IF(OR(COUNTIF(AS17:AW17,\"\")<>COUNTIF(U33:Y33,\"\"),AND(AX17=\"\",SUM(AS17:AW17)<>0)),\"!...\",IF(OR(AND(AX17<>\"\",AS17=\"\",AS17<>U33),AND(AX17<>\"\",AS17<>\"\",AS17=U33),AND(AX17<>\"\",AS17<>\"\",AS17<>DISTANCE_Q,U33<>DISTANCE_Q)),\"ERR!\",\"\"))","v":""},{"$f":"IF(AS18=\"!...\",AS18,IF(OR(AND(AX17<>\"\",AT17=\"\",AT17<>V33),AND(AX17<>\"\",AT17<>\"\",AT17=V33),AND(AX17<>\"\",AT17<>\"\",AT17<>DISTANCE_Q,V33<>DISTANCE_Q)),\"ERR!\",\"\"))","v":""},{"$f":"IF(AT18=\"!...\",AT18,IF(OR(AND(AX17<>\"\",AU17=\"\",AU17<>W33),AND(AX17<>\"\",AU17<>\"\",AU17=W33),AND(AX17<>\"\",AU17<>\"\",AU17<>DISTANCE_Q,W33<>DISTANCE_Q)),\"ERR!\",\"\"))","v":""},{"$f":"IF(AU18=\"!...\",AU18,IF(OR(AND(AX17<>\"\",AV17=\"\",AV17<>X33),AND(AX17<>\"\",AV17<>\"\",AV17=X33),AND(AX17<>\"\",AV17<>\"\",AV17<>DISTANCE_Q,X33<>DISTANCE_Q)),\"ERR!\",\"\"))","v":""},{"$f":"IF(AV18=\"!...\",AV18,IF(OR(AND(AX17<>\"\",AW17=\"\",AW17<>Y33),AND(AX17<>\"\",AW17<>\"\",AW17=Y33),AND(AX17<>\"\",AW17<>\"\",AW17<>DISTANCE_Q,Y33<>DISTANCE_Q)),\"ERR!\",\"\"))","v":""},{"$f":"IF(AX17=\"\",\"\",IF(AX17=\"G\",(NB_SETS_G_Q*2)-1-COUNTIF(U33:Y33,DISTANCE_Q),COUNTIF(AS17:AW17,DISTANCE_Q)))","v":""}]
[null,"Licence",null,null,null,null,null,{"$f":"IF(H17=\"\",\"\",IF(SUM(U5:Y5)<>0,ROUNDDOWN(SUM(C17:G17)/SUM(U5:Y5),3),\"\"))","v":""},null,null,null,null,null,{"$f":"IF(N17=\"\",\"\",IF(SUM(U9:Y9)<>0,ROUNDDOWN(SUM(I17:M17)/SUM(U9:Y9),3),\"\"))","v":""},null,null,null,null,null,{"$f":"IF(T17=\"\",\"\",IF(SUM(U13:Y13)<>0,ROUNDDOWN(SUM(O17:S17)/SUM(U13:Y13),3),\"\"))","v":""},null,null,null,null,null,null,null,null,null,null,null,{"$f":"IF(AF17=\"\",\"\",IF(SUM(U21:Y21)<>0,ROUNDDOWN(SUM(AA17:AE17)/SUM(U21:Y21),3),\"\"))","v":""},null,null,null,null,null,{"$f":"IF(AL17=\"\",\"\",IF(SUM(U25:Y25)<>0,ROUNDDOWN(SUM(AG17:AK17)/SUM(U25:Y25),3),\"\"))","v":""},null,null,null,null,null,{"$f":"IF(AR17=\"\",\"\",IF(SUM(U29:Y29)<>0,ROUNDDOWN(SUM(AM17:AQ17)/SUM(U29:Y29),3),\"\"))","v":""},null,null,null,null,null,{"$f":"IF(AX17=\"\",\"\",IF(SUM(U33:Y33)<>0,ROUNDDOWN(SUM(AS17:AW17)/SUM(U33:Y33),3),\"\"))","v":""}]
[null,"Joueur 5","set 1","set 2","set 3","set 4","set 5","J1-J5","set 1","set 2","set 3","set 4","set 5","J2-J5","set 1","set 2","set 3","set 4","set 5","J3-J5","set 1","set 2","set 3","set 4","set 5","J4-J5",null,null,null,null,null,null,"set 1","set 2","set 3","set 4","set 5","J5-J6","set 1","set 2","set 3","set 4","set 5","J5-J7","set 1","set 2","set 3","set 4","set 5","J5-J8",null,{"$f":"IF(BH20<>\"\",RANK(BH20,BH4:BH35),\"\")","v":""},{"$f":"COUNTIF(H21:AX21,\"G\")*VAL_PT_MATCH","v":0},{"$f":"SUM(AX22,AR22,AL22,H22,Z22,T22,N22)","v":0},{"$f":"IF(BF20<>0,ROUNDDOWN(BE20/BF20,3),\"\")","v":""},{"$f":"MAX(N23,T23,Z23,H23,AL23,AR23,AX23)","v":0},{"$f":"SUM(I21:M21,O21:S21,U21:Y21,C21:G21,AG21:AK21,AM21:AQ21,AS21:AW21)","v":0},{"$f":"SUM(AA25:AE25,AA29:AE29,AA33:AE33,AA17:AE17,AA13:AE13,AA9:AE9,AA5:AE5)","v":0},null,{"$f":"IF(BC20<>\"\",(BA20*10000000)+(BB20*100000)+(BC20*10000)+BD20,\"\")","v":""}]
[null,"Nom & Prénom",null,null,null,null,null,{"$f":"IF(COUNTIF(C21:G21,DISTANCE_Q)=NB_SETS_G_Q,\"G\",IF(COUNTIF(AA5:AE5,DISTANCE_Q)=NB_SETS_G_Q,\"P\",\"\"))","v":""},null,null,null,null,null,{"$f":"IF(COUNTIF(I21:M21,DISTANCE_Q)=NB_SETS_G_Q,\"G\",IF(COUNTIF(AA9:AE9,DISTANCE_Q)=NB_SETS_G_Q,\"P\",\"\"))","v":""},null,null,null,null,null,{"$f":"IF(COUNTIF(O21:S21,DISTANCE_Q)=NB_SETS_G_Q,\"G\",IF(COUNTIF(AA13:AE13,DISTANCE_Q)=NB_SETS_G_Q,\"P\",\"\"))","v":""},null,null,null,null,null,{"$f":"IF(COUNTIF(U21:Y21,DISTANCE_Q)=NB_SETS_G_Q,\"G\",IF(COUNTIF(AA17:AE17,DISTANCE_Q)=NB_SETS_G_Q,\"P\",\"\"))","v":""},null,null,null,null,null,null,null,null,null,null,null,{"$f":"IF(COUNTIF(AG21:AK21,DISTANCE_Q)=NB_SETS_G_Q,\"G\",IF(COUNTIF(AA25:AE25,DISTANCE_Q)=NB_SETS_G_Q,\"P\",\"\"))","v":""},null,null,null,null,null,{"$f":"IF(COUNTIF(AM21:AQ21,DISTANCE_Q)=NB_SETS_G_Q,\"G\",IF(COUNTIF(AA29:AE29,DISTANCE_Q)=NB_SETS_G_Q,\"P\",\"\"))","v":""},null,null,null,null,null,{"$f":"IF(COUNTIF(AS21:AW21,DISTANCE_Q)=NB_SETS_G_Q,\"G\",IF(COUNTIF(AA33:AE33,DISTANCE_Q)=NB_SETS_G_Q,\"P\",\"\"))","v":""}]
[null,"Ville ou Club",{"$f":"IF(OR(COUNTIF(C21:G21,\"\")<>COUNTIF(AA5:AE5,\"\"),AND(H21=\"\",SUM(C21:G21)<>0)),\"!...\",IF(OR(AND(H21<>\"\",C21=\"\",C21<>AA5),AND(H21<>\"\",C21<>\"\",C21=AA5),AND(H21<>\"\",C21<>\"\",C21<>DISTANCE_Q,AA5<>DISTANCE_Q)),\"ERR!\",\"\"))","v":""},{"$f":"IF(C22=\"!...\",C22,IF(OR(AND(H21<>\"\",D21=\"\",D21<>AB5),AND(H21<>\"\",D21<>\"\",D21=AB5),AND(H21<>\"\",D21<>\"\",D21<>DISTANCE_Q,AB5<>DISTANCE_Q)),\"ERR!\",\"\"))","v":""},{"$f":"IF(D22=\"!...\",D22,IF(OR(AND(H21<>\"\",E21=\"\",E21<>AC5),AND(H21<>\"\",E21<>\"\",E21=AC5),AND(H21<>\"\",E21<>\"\",E21<>DISTANCE_Q,AC5<>DISTANCE_Q)),\"ERR!\",\"\"))","v":""},{"$f":"IF(E22=\"!...\",E22,IF(OR(AND(H21<>\"\",F21=\"\",F21<>AD5),AND(H21<>\"\",F21<>\"\",F21=AD5),AND(H21<>\"\",F21<>\"\",F21<>DISTANCE_Q,AD5<>DISTANCE_Q)),\"ERR!\",\"\"))","v":""},{"$f":"IF(F22=\"!...\",F22,IF(OR(AND(H21<>\"\",G21=\"\",G21<>AE5),AND(H21<>\"\",G21<>\"\",G21=AE5),AND(H21<>\"\",G21<>\"\",G21<>DISTANCE_Q,AE5<>DISTANCE_Q)),\"ERR!\",\"\"))","v":""},{"$f":"IF(H21=\"\",\"\",IF(H21=\"G\",(NB_SETS_G_Q*2)-1-COUNTIF(AA5:AE5,DISTANCE_Q),COUNTIF(C21:G21,DISTANCE_Q)))","v":""},{"$f":"IF(OR(COUNTIF(I21:M21,\"\")<>COUNTIF(AA9:AE9,\"\"),AND(N21=\"\",SUM(I21:M21)<>0)),\"!...\",IF(OR(AND(N21<>\"\",I21=\"\",I21<>AA9),AND(N21<>\"\",I21<>\"\",I21=AA9),AND(N21<>\"\",I21<>\"\",I21<>DISTANCE_Q,AA9<>DISTANCE_Q)),\"ERR!\",\"\"))","v":""},{"$f":"IF(I22=\"!...\",I22,IF(OR(AND(N21<>\"\",J21=\"\",J21<>AB9),AND(N21<>\"\",J21<>\"\",J21=AB9),AND(N21<>\"\",J21<>\"\",J21<>DISTANCE_Q,AB9<>DISTANCE_Q)),\"ERR!\",\"\"))","v":""},{"$f":"IF(J22=\"!...\",J22,IF(OR(AND(N21<>\"\",K21=\"\",K21<>AC9),AND(N21<>\"\",K21<>\"\",K21=AC9),AND(N21<>\"\",K21<>\"\",K21<>DISTANCE_Q,AC9<>DISTANCE_Q)),\"ERR!\",\"\"))","v":""},{"$f":"IF(K22=\"!...\",K22,IF(OR(AND(N21<>\"\",L21=\"\",L21<>AD9),AND(N21<>\"\",L21<>\"\",L21=AD9),AND(N21<>\"\",L21<>\"\",L21<>DISTANCE_Q,AD9<>DISTANCE_Q)),\"ERR!\",\"\"))","v":""},{"$f":"IF(L22=\"!...\",L22,IF(OR(AND(N21<>\"\",M21=\"\",M21<>AE9),AND(N21<>\"\",M21<>\"\",M21=AE9),AND(N21<>\"\",M21<>\"\",M21<>DISTANCE_Q,AE9<>DISTANCE_Q)),\"ERR!\",\"\"))","v":""},{"$f":"IF(N21=\"\",\"\",IF(N21=\"G\",(NB_SETS_G_Q*2)-1-COUNTIF(AA9:AE9,DISTANCE_Q),COUNTIF(I21:M21,DISTANCE_Q)))","v":""},{"$f":"IF(OR(COUNTIF(O21:S21,\"\")<>COUNTIF(AA13:AE13,\"\"),AND(T21=\"\",SUM(O21:S21)<>0)),\"!...\",IF(OR(AND(T21<>\"\",O21=\"\",O21<>AA13),AND(T21<>\"\",O21<>\"\",O21=AA13),AND(T21<>\"\",O21<>\"\",O21<>DISTANCE_Q,AA13<>DISTANCE_Q)),\"ERR!\",\"\"))","v":""},{"$f":"IF(O22=\"!...\",O22,IF(OR(AND(T21<>\"\",P21=\"\",P21<>AB13),AND(T21<>\"\",P21<>\"\",P21=AB13),AND(T21<>\"\",P21<>\"\",P21<>DISTANCE_Q,AB13<>DISTANCE_Q)),\"ERR!\",\"\"))","v":""},{"$f":"IF(P22=\"!...\",P22,IF(OR(AND(T21<>\"\",Q21=\"\",Q21<>AC13),AND(T21<>\"\",Q21<>\"\",Q21=AC13),AND(T21<>\"\",Q21<>\"\",Q21<>DISTANCE_Q,AC13<>DISTANCE_Q)),\"ERR!\",\"\"))","v":""},{"$f":"IF(Q22=\"!...\",Q22,IF(OR(AND(T21<>\"\",R21=\"\",R21<>AD13),AND(T21<>\"\",R21<>\"\",R21=AD13),AND(T21<>\"\",R21<>\"\",R21<>DISTANCE_Q,AD13<>DISTANCE_Q)),\"ERR!\",\"\"))","v":""},{"$f":"IF(R22=\"!...\",R22,IF(OR(AND(T21<>\"\",S21=\"\",S21<>AE13),AND(T21<>\"\",S21<>\"\",S21=AE13),AND(T21<>\"\",S21<>\"\",S21<>DISTANCE_Q,AE13<>DISTANCE_Q)),\"ERR!\",\"\"))","v":""},{"$f":"IF(T21=\"\",\"\",IF(T21=\"G\",(NB_SETS_G_Q*2)-1-COUNTIF(AA13:AE13,DISTANCE_Q),COUNTIF(O21:S21,DISTANCE_Q)))","v":""},{"$f":"IF(OR(COUNTIF(U21:Y21,\"\")<>COUNTIF(AA17:AE17,\"\"),AND(Z21=\"\",SUM(U21:Y21)<>0)),\"!...\",IF(OR(AND(Z21<>\"\",U21=\"\",U21<>AA17),AND(Z21<>\"\",U21<>\"\",U21=AA17),AND(Z21<>\"\",U21<>\"\",U21<>DISTANCE_Q,AA17<>DISTANCE_Q)),\"ERR!\",\"\"))","v":""},{"$f":"IF(U22=\"!...\",U22,IF(OR(AND(Z21<>\"\",V21=\"\",V21<>AB17),AND(Z21<>\"\",V21<>\"\",V21=AB17),AND(Z21<>\"\",V21<>\"\",V21<>DISTANCE_Q,AB17<>DISTANCE_Q)),\"ERR!\",\"\"))","v":""},{"$f":"IF(V22=\"!...\",V22,IF(OR(AND(Z21<>\"\",W21=\"\",W21<>AC17),AND(Z21<>\"\",W21<>\"\",W21=AC17),AND(Z21<>\"\",W21<>\"\",W21<>DISTANCE_Q,AC17<>DISTANCE_Q)),\"ERR!\",\"\"))","v":""},{"$f":"IF(W22=\"!...\",W22,IF(OR(AND(Z21<>\"\",X21=\"\",X21<>AD17),AND(Z21<>\"\",X21<>\"\",X21=AD17),AND(Z21<>\"\",X21<>\"\",X21<>DISTANCE_Q,AD17<>DISTANCE_Q)),\"ERR!\",\"\"))","v":""},{"$f":"IF(X22=\"!...\",X22,IF(OR(AND(Z21<>\"\",Y21=\"\",Y21<>AE17),AND(Z21<>\"\",Y21<>\"\",Y21=AE17),AND(Z21<>\"\",Y21<>\"\",Y21<>DISTANCE_Q,AE17<>DISTANCE_Q)),\"ERR!\",\"\"))","v":""},{"$f":"IF(Z21=\"\",\"\",IF(Z21=\"G\",(NB_SETS_G_Q*2)-1-COUNTIF(AA17:AE17,DISTANCE_Q),COUNTIF(U21:Y21,DISTANCE_Q)))","v":""},null,null,null,null,null,null,{"$f":"IF(OR(COUNTIF(AG21:AK21,\"\")<>COUNTIF(AA25:AE25,\"\"),AND(AL21=\"\",SUM(AG21:AK21)<>0)),\"!...\",IF(OR(AND(AL21<>\"\",AG21=\"\",AG21<>AA25),AND(AL21<>\"\",AG21<>\"\",AG21=AA25),AND(AL21<>\"\",AG21<>\"\",AG21<>DISTANCE_Q,AA25<>DISTANCE_Q)),\"ERR!\",\"\"))","v":""},{"$f":"IF(AG22=\"!...\",AG22,IF(OR(AND(AL21<>\"\",AH21=\"\",AH21<>AB25),AND(AL21<>\"\",AH21<>\"\",AH21=AB25),AND(AL21<>\"\",AH21<>\"\",AH21<>DISTANCE_Q,AB25<>DISTANCE_Q)),\"ERR!\",\"\"))","v":""},{"$f":"IF(AH22=\"!...\",AH22,IF(OR(AND(AL21<>\"\",AI21=\"\",AI21<>AC25),AND(AL21<>\"\",AI21<>\"\",AI21=AC25),AND(AL21<>\"\",AI21<>\"\",AI21<>DISTANCE_Q,AC25<>DISTANCE_Q)),\"ERR!\",\"\"))","v":""},{"$f":"IF(AI22=\"!...\",AI22,IF(OR(AND(AL21<>\"\",AJ21=\"\",AJ21<>AD25),AND(AL21<>\"\",AJ21<>\"\",AJ21=AD25),AND(AL21<>\"\",AJ21<>\"\",AJ21<>DISTANCE_Q,AD25<>DISTANCE_Q)),\"ERR!\",\"\"))","v":""},{"$f":"IF(AJ22=\"!...\",AJ22,IF(OR(AND(AL21<>\"\",AK21=\"\",AK21<>AE25),AND(AL21<>\"\",AK21<>\"\",AK21=AE25),AND(AL21<>\"\",AK21<>\"\",AK21<>DISTANCE_Q,AE25<>DISTANCE_Q)),\"ERR!\",\"\"))","v":""},{"$f":"IF(AL21=\"\",\"\",IF(AL21=\"G\",(NB_SETS_G_Q*2)-1-COUNTIF(AA25:AE25,DISTANCE_Q),COUNTIF(AG21:AK21,DISTANCE_Q)))","v":""},{"$f":"IF(OR(COUNTIF(AM21:AQ21,\"\")<>COUNTIF(AA29:AE29,\"\"),AND(AR21=\"\",SUM(AM21:AQ21)<>0)),\"!...\",IF(OR(AND(AR21<>\"\",AM21=\"\",AM21<>AA29),AND(AR21<>\"\",AM21<>\"\",AM21=AA29),AND(AR21<>\"\",AM21<>\"\",AM21<>DISTANCE_Q,AA29<>DISTANCE_Q)),\"ERR!\",\"\"))","v":""},{"$f":"IF(AM22=\"!...\",AM22,IF(OR(AND(AR21<>\"\",AN21=\"\",AN21<>AB29),AND(AR21<>\"\",AN21<>\"\",AN21=AB29),AND(AR21<>\"\",AN21<>\"\",AN21<>DISTANCE_Q,AB29<>DISTANCE_Q)),\"ERR!\",\"\"))","v":""},{"$f":"IF(AN22=\"!...\",AN22,IF(OR(AND(AR21<>\"\",AO21=\"\",AO21<>AC29),AND(AR21<>\"\",AO21<>\"\",AO21=AC29),AND(AR21<>\"\",AO21<>\"\",AO21<>DISTANCE_Q,AC29<>DISTANCE_Q)),\"ERR!\",\"\"))","v":""},{"$f":"IF(AO22=\"!...\",AO22,IF(OR(AND(AR21<>\"\",AP21=\"\",AP21<>AD29),AND(AR21<>\"\",AP21<>\"\",AP21=AD29),AND(AR21<>\"\",AP21<>\"\",AP21<>DISTANCE_Q,AD29<>DISTANCE_Q)),\"ERR!\",\"\"))","v":""},{"$f":"IF(AP22=\"!...\",AP22,IF(OR(AND(AR21<>\"\",AQ21=\"\",AQ21<>AE29),AND(AR21<>\"\",AQ21<>\"\",AQ21=AE29),AND(AR21<>\"\",AQ21<>\"\",AQ21<>DISTANCE_Q,AE29<>DISTANCE_Q)),\"ERR!\",\"\"))","v":""},{"$f":"IF(AR21=\"\",\"\",IF(AR21=\"G\",(NB_SETS_G_Q*2)-1-COUNTIF(AA29:AE29,DISTANCE_Q),COUNTIF(AM21:AQ21,DISTANCE_Q)))","v":""},{"$f":"IF(OR(COUNTIF(AS21:AW21,\"\")<>COUNTIF(AA33:AE33,\"\"),AND(AX21=\"\",SUM(AS21:AW21)<>0)),\"!...\",IF(OR(AND(AX21<>\"\",AS21=\"\",AS21<>AA33),AND(AX21<>\"\",AS21<>\"\",AS21=AA33),AND(AX21<>\"\",AS21<>\"\",AS21<>DISTANCE_Q,AA33<>DISTANCE_Q)),\"ERR!\",\"\"))","v":""},{"$f":"IF(AS22=\"!...\",AS22,IF(OR(AND(AX21<>\"\",AT21=\"\",AT21<>AB33),AND(AX21<>\"\",AT21<>\"\",AT21=AB33),AND(AX21<>\"\",AT21<>\"\",AT21<>DISTANCE_Q,AB33<>DISTANCE_Q)),\"ERR!\",\"\"))","v":""},{"$f":"IF(AT22=\"!...\",AT22,IF(OR(AND(AX21<>\"\",AU21=\"\",AU21<>AC33),AND(AX21<>\"\",AU21<>\"\",AU21=AC33),AND(AX21<>\"\",AU21<>\"\",AU21<>DISTANCE_Q,AC33<>DISTANCE_Q)),\"ERR!\",\"\"))","v":""},{"$f":"IF(AU22=\"!...\",AU22,IF(OR(AND(AX21<>\"\",AV21=\"\",AV21<>AD33),AND(AX21<>\"\",AV21<>\"\",AV21=AD33),AND(AX21<>\"\",AV21<>\"\",AV21<>DISTANCE_Q,AD33<>DISTANCE_Q)),\"ERR!\",\"\"))","v":""},{"$f":"IF(AV22=\"!...\",AV22,IF(OR(AND(AX21<>\"\",AW21=\"\",AW21<>AE33),AND(AX21<>\"\",AW21<>\"\",AW21=AE33),AND(AX21<>\"\",AW21<>\"\",AW21<>DISTANCE_Q,AE33<>DISTANCE_Q)),\"ERR!\",\"\"))","v":""},{"$f":"IF(AX21=\"\",\"\",IF(AX21=\"G\",(NB_SETS_G_Q*2)-1-COUNTIF(AA33:AE33,DISTANCE_Q),COUNTIF(AS21:AW21,DISTANCE_Q)))","v":""}]
[null,"Licence",null,null,null,null,null,{"$f":"IF(H21=\"\",\"\",IF(SUM(AA5:AE5)<>0,ROUNDDOWN(SUM(C21:G21)/SUM(AA5:AE5),3),\"\"))","v":""},null,null,null,null,null,{"$f":"IF(N21=\"\",\"\",IF(SUM(AA9:AE9)<>0,ROUNDDOWN(SUM(I21:M21)/SUM(AA9:AE9),3),\"\"))","v":""},null,null,null,null,null,{"$f":"IF(T21=\"\",\"\",IF(SUM(AA13:AE13)<>0,ROUNDDOWN(SUM(O21:S21)/SUM(AA13:AE13),3),\"\"))","v":""},null,null,null,null,null,{"$f":"IF(Z21=\"\",\"\",IF(SUM(AA17:AE17)<>0,ROUNDDOWN(SUM(U21:Y21)/SUM(AA17:AE17),3),\"\"))","v":""},null,null,null,null,null,null,null,null,null,null,null,{"$f":"IF(AL21=\"\",\"\",IF(SUM(AA25:AE25)<>0,ROUNDDOWN(SUM(AG21:AK21)/SUM(AA25:AE25),3),\"\"))","v":""},null,null,null,null,null,{"$f":"IF(AR21=\"\",\"\",IF(SUM(AA29:AE29)<>0,ROUNDDOWN(SUM(AM21:AQ21)/SUM(AA29:AE29),3),\"\"))","v":""},null,null,null,null,null,{"$f":"IF(AX21=\"\",\"\",IF(SUM(AA33:AE33)<>0,ROUNDDOWN(SUM(AS21:AW21)/SUM(AA33:AE33),3),\"\"))","v":""}]
[null,"Joueu 6","set 1","set 2","set 3","set 4","set 5","J1-J6","set 1","set 2","set 3","set 4","set 5","J2-J6","set 1","set 2","set 3","set 4","set 5","J3-J6","set 1","set 2","set 3","set 4","set 5","J4-J6","set 1","set 2","set 3","set 4","set 5","J5-J6",null,null,null,null,null,null,"set 1","set 2","set 3","set 4","set 5","J6-J7","set 1","set 2","set 3","set 4","set 5","J6-J8",null,{"$f":"IF(BH24<>\"\",RANK(BH24,BH4:BH35),\"\")","v":""},{"$f":"COUNTIF(H25:AX25,\"G\")*VAL_PT_MATCH","v":0},{"$f":"SUM(AX26,AR26,H26,AF26,Z26,T26,N26)","v":0},{"$f":"IF(BF24<>0,ROUNDDOWN(BE24/BF24,3),\"\")","v":""},{"$f":"MAX(N27,T27,Z27,AF27,H27,AR27,AX27)","v":0},{"$f":"SUM(I25:M25,O25:S25,U25:Y25,AA25:AE25,C25:G25,AM25:AQ25,AS25:AW25)","v":0},{"$f":"SUM(AG29:AK29,AG33:AK33,AG21:AK21,AG17:AK17,AG13:AK13,AG9:AK9,AG5:AK5)","v":0},null,{"$f":"IF(BC24<>\"\",(BA24*10000000)+(BB24*100000)+(BC24*10000)+BD24,\"\")","v":""}]
[null,"Nom & Prénom",null,null,null,null,null,{"$f":"IF(COUNTIF(C25:G25,DISTANCE_Q)=NB_SETS_G_Q,\"G\",IF(COUNTIF(AG5:AK5,DISTANCE_Q)=NB_SETS_G_Q,\"P\",\"\"))","v":""},null,null,null,null,null,{"$f":"IF(COUNTIF(I25:M25,DISTANCE_Q)=NB_SETS_G_Q,\"G\",IF(COUNTIF(AG9:AK9,DISTANCE_Q)=NB_SETS_G_Q,\"P\",\"\"))","v":""},null,null,null,null,null,{"$f":"IF(COUNTIF(O25:S25,DISTANCE_Q)=NB_SETS_G_Q,\"G\",IF(COUNTIF(AG13:AK13,DISTANCE_Q)=NB_SETS_G_Q,\"P\",\"\"))","v":""},null,null,null,null,null,{"$f":"IF(COUNTIF(U25:Y25,DISTANCE_Q)=NB_SETS_G_Q,\"G\",IF(COUNTIF(AG17:AK17,DISTANCE_Q)=NB_SETS_G_Q,\"P\",\"\"))","v":""},null,null,null,null,null,{"$f":"IF(COUNTIF(AA25:AE25,DISTANCE_Q)=NB_SETS_G_Q,\"G\",IF(COUNTIF(AG21:AK21,DISTANCE_Q)=NB_SETS_G_Q,\"P\",\"\"))","v":""},null,null,null,null,null,null,null,null,null,null,null,{"$f":"IF(COUNTIF(AM25:AQ25,DISTANCE_Q)=NB_SETS_G_Q,\"G\",IF(COUNTIF(AG29:AK29,DISTANCE_Q)=NB_SETS_G_Q,\"P\",\"\"))","v":""},null,null,null,null,null,{"$f":"IF(COUNTIF(AS25:AW25,DISTANCE_Q)=NB_SETS_G_Q,\"G\",IF(COUNTIF(AG33:AK33,DISTANCE_Q)=NB_SETS_G_Q,\"P\",\"\"))","v":""}]
[null,"Ville ou Club",{"$f":"IF(OR(COUNTIF(C25:G25,\"\")<>COUNTIF(AG5:AK5,\"\"),AND(H25=\"\",SUM(C25:G25)<>0)),\"!...\",IF(OR(AND(H25<>\"\",C25=\"\",C25<>AG5),AND(H25<>\"\",C25<>\"\",C25=AG5),AND(H25<>\"\",C25<>\"\",C25<>DISTANCE_Q,AG5<>DISTANCE_Q)),\"ERR!\",\"\"))","v":""},{"$f":"IF(C26=\"!...\",C26,IF(OR(AND(H25<>\"\",D25=\"\",D25<>AH5),AND(H25<>\"\",D25<>\"\",D25=AH5),AND(H25<>\"\",D25<>\"\",D25<>DISTANCE_Q,AH5<>DISTANCE_Q)),\"ERR!\",\"\"))","v":""},{"$f":"IF(D26=\"!...\",D26,IF(OR(AND(H25<>\"\",E25=\"\",E25<>AI5),AND(H25<>\"\",E25<>\"\",E25=AI5),AND(H25<>\"\",E25<>\"\",E25<>DISTANCE_Q,AI5<>DISTANCE_Q)),\"ERR!\",\"\"))","v":""},{"$f":"IF(E26=\"!...\",E26,IF(OR(AND(H25<>\"\",F25=\"\",F25<>AJ5),AND(H25<>\"\",F25<>\"\",F25=AJ5),AND(H25<>\"\",F25<>\"\",F25<>DISTANCE_Q,AJ5<>DISTANCE_Q)),\"ERR!\",\"\"))","v":""},{"$f":"IF(F26=\"!...\",F26,IF(OR(AND(H25<>\"\",G25=\"\",G25<>AK5),AND(H25<>\"\",G25<>\"\",G25=AK5),AND(H25<>\"\",G25<>\"\",G25<>DISTANCE_Q,AK5<>DISTANCE_Q)),\"ERR!\",\"\"))","v":""},{"$f":"IF(H25=\"\",\"\",IF(H25=\"G\",(NB_SETS_G_Q*2)-1-COUNTIF(AG5:AK5,DISTANCE_Q),COUNTIF(C25:G25,DISTANCE_Q)))","v":""},{"$f":"IF(OR(COUNTIF(I25:M25,\"\")<>COUNTIF(AG9:AK9,\"\"),AND(N25=\"\",SUM(I25:M25)<>0)),\"!...\",IF(OR(AND(N25<>\"\",I25=\"\",I25<>AG9),AND(N25<>\"\",I25<>\"\",I25=AG9),AND(N25<>\"\",I25<>\"\",I25<>DISTANCE_Q,AG9<>DISTANCE_Q)),\"ERR!\",\"\"))","v":""},{"$f":"IF(I26=\"!...\",I26,IF(OR(AND(N25<>\"\",J25=\"\",J25<>AH9),AND(N25<>\"\",J25<>\"\",J25=AH9),AND(N25<>\"\",J25<>\"\",J25<>DISTANCE_Q,AH9<>DISTANCE_Q)),\"ERR!\",\"\"))","v":""},{"$f":"IF(J26=\"!...\",J26,IF(OR(AND(N25<>\"\",K25=\"\",K25<>AI9),AND(N25<>\"\",K25<>\"\",K25=AI9),AND(N25<>\"\",K25<>\"\",K25<>DISTANCE_Q,AI9<>DISTANCE_Q)),\"ERR!\",\"\"))","v":""},{"$f":"IF(K26=\"!...\",K26,IF(OR(AND(N25<>\"\",L25=\"\",L25<>AJ9),AND(N25<>\"\",L25<>\"\",L25=AJ9),AND(N25<>\"\",L25<>\"\",L25<>DISTANCE_Q,AJ9<>DISTANCE_Q)),\"ERR!\",\"\"))","v":""},{"$f":"IF(L26=\"!...\",L26,IF(OR(AND(N25<>\"\",M25=\"\",M25<>AK9),AND(N25<>\"\",M25<>\"\",M25=AK9),AND(N25<>\"\",M25<>\"\",M25<>DISTANCE_Q,AK9<>DISTANCE_Q)),\"ERR!\",\"\"))","v":""},{"$f":"IF(N25=\"\",\"\",IF(N25=\"G\",(NB_SETS_G_Q*2)-1-COUNTIF(AG9:AK9,DISTANCE_Q),COUNTIF(I25:M25,DISTANCE_Q)))","v":""},{"$f":"IF(OR(COUNTIF(O25:S25,\"\")<>COUNTIF(AG13:AK13,\"\"),AND(T25=\"\",SUM(O25:S25)<>0)),\"!...\",IF(OR(AND(T25<>\"\",O25=\"\",O25<>AG13),AND(T25<>\"\",O25<>\"\",O25=AG13),AND(T25<>\"\",O25<>\"\",O25<>DISTANCE_Q,AG13<>DISTANCE_Q)),\"ERR!\",\"\"))","v":""},{"$f":"IF(O26=\"!...\",O26,IF(OR(AND(T25<>\"\",P25=\"\",P25<>AH13),AND(T25<>\"\",P25<>\"\",P25=AH13),AND(T25<>\"\",P25<>\"\",P25<>DISTANCE_Q,AH13<>DISTANCE_Q)),\"ERR!\",\"\"))","v":""},{"$f":"IF(P26=\"!...\",P26,IF(OR(AND(T25<>\"\",Q25=\"\",Q25<>AI13),AND(T25<>\"\",Q25<>\"\",Q25=AI13),AND(T25<>\"\",Q25<>\"\",Q25<>DISTANCE_Q,AI13<>DISTANCE_Q)),\"ERR!\",\"\"))","v":""},{"$f":"IF(Q26=\"!...\",Q26,IF(OR(AND(T25<>\"\",R25=\"\",R25<>AJ13),AND(T25<>\"\",R25<>\"\",R25=AJ13),AND(T25<>\"\",R25<>\"\",R25<>DISTANCE_Q,AJ13<>DISTANCE_Q)),\"ERR!\",\"\"))","v":""},{"$f":"IF(R26=\"!...\",R26,IF(OR(AND(T25<>\"\",S25=\"\",S25<>AK13),AND(T25<>\"\",S25<>\"\",S25=AK13),AND(T25<>\"\",S25<>\"\",S25<>DISTANCE_Q,AK13<>DISTANCE_Q)),\"ERR!\",\"\"))","v":""},{"$f":"IF(T25=\"\",\"\",IF(T25=\"G\",(NB_SETS_G_Q*2)-1-COUNTIF(AG13:AK13,DISTANCE_Q),COUNTIF(O25:S25,DISTANCE_Q)))","v":""},{"$f":"IF(OR(COUNTIF(U25:Y25,\"\")<>COUNTIF(AG17:AK17,\"\"),AND(Z25=\"\",SUM(U25:Y25)<>0)),\"!...\",IF(OR(AND(Z25<>\"\",U25=\"\",U25<>AG17),AND(Z25<>\"\",U25<>\"\",U25=AG17),AND(Z25<>\"\",U25<>\"\",U25<>DISTANCE_Q,AG17<>DISTANCE_Q)),\"ERR!\",\"\"))","v":""},{"$f":"IF(U26=\"!...\",U26,IF(OR(AND(Z25<>\"\",V25=\"\",V25<>AH17),AND(Z25<>\"\",V25<>\"\",V25=AH17),AND(Z25<>\"\",V25<>\"\",V25<>DISTANCE_Q,AH17<>DISTANCE_Q)),\"ERR!\",\"\"))","v":""},{"$f":"IF(V26=\"!...\",V26,IF(OR(AND(Z25<>\"\",W25=\"\",W25<>AI17),AND(Z25<>\"\",W25<>\"\",W25=AI17),AND(Z25<>\"\",W25<>\"\",W25<>DISTANCE_Q,AI17<>DISTANCE_Q)),\"ERR!\",\"\"))","v":""},{"$f":"IF(W26=\"!...\",W26,IF(OR(AND(Z25<>\"\",X25=\"\",X25<>AJ17),AND(Z25<>\"\",X25<>\"\",X25=AJ17),AND(Z25<>\"\",X25<>\"\",X25<>DISTANCE_Q,AJ17<>DISTANCE_Q)),\"ERR!\",\"\"))","v":""},{"$f":"IF(X26=\"!...\",X26,IF(OR(AND(Z25<>\"\",Y25=\"\",Y25<>AK17),AND(Z25<>\"\",Y25<>\"\",Y25=AK17),AND(Z25<>\"\",Y25<>\"\",Y25<>DISTANCE_Q,AK17<>DISTANCE_Q)),\"ERR!\",\"\"))","v":""},{"$f":"IF(Z25=\"\",\"\",IF(Z25=\"G\",(NB_SETS_G_Q*2)-1-COUNTIF(AG17:AK17,DISTANCE_Q),COUNTIF(U25:Y25,DISTANCE_Q)))","v":""},{"$f":"IF(OR(COUNTIF(AA25:AE25,\"\")<>COUNTIF(AG21:AK21,\"\"),AND(AF25=\"\",SUM(AA25:AE25)<>0)),\"!...\",IF(OR(AND(AF25<>\"\",AA25=\"\",AA25<>AG21),AND(AF25<>\"\",AA25<>\"\",AA25=AG21),AND(AF25<>\"\",AA25<>\"\",AA25<>DISTANCE_Q,AG21<>DISTANCE_Q)),\"ERR!\",\"\"))","v":""},{"$f":"IF(AA26=\"!...\",AA26,IF(OR(AND(AF25<>\"\",AB25=\"\",AB25<>AH21),AND(AF25<>\"\",AB25<>\"\",AB25=AH21),AND(AF25<>\"\",AB25<>\"\",AB25<>DISTANCE_Q,AH21<>DISTANCE_Q)),\"ERR!\",\"\"))","v":""},{"$f":"IF(AB26=\"!...\",AB26,IF(OR(AND(AF25<>\"\",AC25=\"\",AC25<>AI21),AND(AF25<>\"\",AC25<>\"\",AC25=AI21),AND(AF25<>\"\",AC25<>\"\",AC25<>DISTANCE_Q,AI21<>DISTANCE_Q)),\"ERR!\",\"\"))","v":""},{"$f":"IF(AC26=\"!...\",AC26,IF(OR(AND(AF25<>\"\",AD25=\"\",AD25<>AJ21),AND(AF25<>\"\",AD25<>\"\",AD25=AJ21),AND(AF25<>\"\",AD25<>\"\",AD25<>DISTANCE_Q,AJ21<>DISTANCE_Q)),\"ERR!\",\"\"))","v":""},{"$f":"IF(AD26=\"!...\",AD26,IF(OR(AND(AF25<>\"\",AE25=\"\",AE25<>AK21),AND(AF25<>\"\",AE25<>\"\",AE25=AK21),AND(AF25<>\"\",AE25<>\"\",AE25<>DISTANCE_Q,AK21<>DISTANCE_Q)),\"ERR!\",\"\"))","v":""},{"$f":"IF(AF25=\"\",\"\",IF(AF25=\"G\",(NB_SETS_G_Q*2)-1-COUNTIF(AG21:AK21,DISTANCE_Q),COUNTIF(AA25:AE25,DISTANCE_Q)))","v":""},null,null,null,null,null,null,{"$f":"IF(OR(COUNTIF(AM25:AQ25,\"\")<>COUNTIF(AG29:AK29,\"\"),AND(AR25=\"\",SUM(AM25:AQ25)<>0)),\"!...\",IF(OR(AND(AR25<>\"\",AM25=\"\",AM25<>AG29),AND(AR25<>\"\",AM25<>\"\",AM25=AG29),AND(AR25<>\"\",AM25<>\"\",AM25<>DISTANCE_Q,AG29<>DISTANCE_Q)),\"ERR!\",\"\"))","v":""},{"$f":"IF(AM26=\"!...\",AM26,IF(OR(AND(AR25<>\"\",AN25=\"\",AN25<>AH29),AND(AR25<>\"\",AN25<>\"\",AN25=AH29),AND(AR25<>\"\",AN25<>\"\",AN25<>DISTANCE_Q,AH29<>DISTANCE_Q)),\"ERR!\",\"\"))","v":""},{"$f":"IF(AN26=\"!...\",AN26,IF(OR(AND(AR25<>\"\",AO25=\"\",AO25<>AI29),AND(AR25<>\"\",AO25<>\"\",AO25=AI29),AND(AR25<>\"\",AO25<>\"\",AO25<>DISTANCE_Q,AI29<>DISTANCE_Q)),\"ERR!\",\"\"))","v":""},{"$f":"IF(AO26=\"!...\",AO26,IF(OR(AND(AR25<>\"\",AP25=\"\",AP25<>AJ29),AND(AR25<>\"\",AP25<>\"\",AP25=AJ29),AND(AR25<>\"\",AP25<>\"\",AP25<>DISTANCE_Q,AJ29<>DISTANCE_Q)),\"ERR!\",\"\"))","v":""},{"$f":"IF(AP26=\"!...\",AP26,IF(OR(AND(AR25<>\"\",AQ25=\"\",AQ25<>AK29),AND(AR25<>\"\",AQ25<>\"\",AQ25=AK29),AND(AR25<>\"\",AQ25<>\"\",AQ25<>DISTANCE_Q,AK29<>DISTANCE_Q)),\"ERR!\",\"\"))","v":""},{"$f":"IF(AR25=\"\",\"\",IF(AR25=\"G\",(NB_SETS_G_Q*2)-1-COUNTIF(AG29:AK29,DISTANCE_Q),COUNTIF(AM25:AQ25,DISTANCE_Q)))","v":""},{"$f":"IF(OR(COUNTIF(AS25:AW25,\"\")<>COUNTIF(AG33:AK33,\"\"),AND(AX25=\"\",SUM(AS25:AW25)<>0)),\"!...\",IF(OR(AND(AX25<>\"\",AS25=\"\",AS25<>AG33),AND(AX25<>\"\",AS25<>\"\",AS25=AG33),AND(AX25<>\"\",AS25<>\"\",AS25<>DISTANCE_Q,AG33<>DISTANCE_Q)),\"ERR!\",\"\"))","v":""},{"$f":"IF(AS26=\"!...\",AS26,IF(OR(AND(AX25<>\"\",AT25=\"\",AT25<>AH33),AND(AX25<>\"\",AT25<>\"\",AT25=AH33),AND(AX25<>\"\",AT25<>\"\",AT25<>DISTANCE_Q,AH33<>DISTANCE_Q)),\"ERR!\",\"\"))","v":""},{"$f":"IF(AT26=\"!...\",AT26,IF(OR(AND(AX25<>\"\",AU25=\"\",AU25<>AI33),AND(AX25<>\"\",AU25<>\"\",AU25=AI33),AND(AX25<>\"\",AU25<>\"\",AU25<>DISTANCE_Q,AI33<>DISTANCE_Q)),\"ERR!\",\"\"))","v":""},{"$f":"IF(AU26=\"!...\",AU26,IF(OR(AND(AX25<>\"\",AV25=\"\",AV25<>AJ33),AND(AX25<>\"\",AV25<>\"\",AV25=AJ33),AND(AX25<>\"\",AV25<>\"\",AV25<>DISTANCE_Q,AJ33<>DISTANCE_Q)),\"ERR!\",\"\"))","v":""},{"$f":"IF(AV26=\"!...\",AV26,IF(OR(AND(AX25<>\"\",AW25=\"\",AW25<>AK33),AND(AX25<>\"\",AW25<>\"\",AW25=AK33),AND(AX25<>\"\",AW25<>\"\",AW25<>DISTANCE_Q,AK33<>DISTANCE_Q)),\"ERR!\",\"\"))","v":""},{"$f":"IF(AX25=\"\",\"\",IF(AX25=\"G\",(NB_SETS_G_Q*2)-1-COUNTIF(AG33:AK33,DISTANCE_Q),COUNTIF(AS25:AW25,DISTANCE_Q)))","v":""}]
[null,"Licence",null,null,null,null,null,{"$f":"IF(H25=\"\",\"\",IF(SUM(AG5:AK5)<>0,ROUNDDOWN(SUM(C25:G25)/SUM(AG5:AK5),3),\"\"))","v":""},null,null,null,null,null,{"$f":"IF(N25=\"\",\"\",IF(SUM(AG9:AK9)<>0,ROUNDDOWN(SUM(I25:M25)/SUM(AG9:AK9),3),\"\"))","v":""},null,null,null,null,null,{"$f":"IF(T25=\"\",\"\",IF(SUM(AG13:AK13)<>0,ROUNDDOWN(SUM(O25:S25)/SUM(AG13:AK13),3),\"\"))","v":""},null,null,null,null,null,{"$f":"IF(Z25=\"\",\"\",IF(SUM(AG17:AK17)<>0,ROUNDDOWN(SUM(U25:Y25)/SUM(AG17:AK17),3),\"\"))","v":""},null,null,null,null,null,{"$f":"IF(AF25=\"\",\"\",IF(SUM(AG21:AK21)<>0,ROUNDDOWN(SUM(AA25:AE25)/SUM(AG21:AK21),3),\"\"))","v":""},null,null,null,null,null,null,null,null,null,null,null,{"$f":"IF(AR25=\"\",\"\",IF(SUM(AG29:AK29)<>0,ROUNDDOWN(SUM(AM25:AQ25)/SUM(AG29:AK29),3),\"\"))","v":""},null,null,null,null,null,{"$f":"IF(AX25=\"\",\"\",IF(SUM(AG33:AK33)<>0,ROUNDDOWN(SUM(AS25:AW25)/SUM(AG33:AK33),3),\"\"))","v":""}]
[null,"Joueur 7","set 1","set 2","set 3","set 4","set 5","J1-J7","set 1","set 2","set 3","set 4","set 5","J2-J7","set 1","set 2","set 3","set 4","set 5","J3-J7","set 1","set 2","set 3","set 4","set 5","J4-J7","set 1","set 2","set 3","set 4","set 5","J5-J7","set 1","set 2","set 3","set 4","set 5","J6-J7",null,null,null,null,null,null,"set 1","set 2","set 3","set 4","set 5","J7-J8",null,{"$f":"IF(BH28<>\"\",RANK(BH28,BH4:BH35),\"\")","v":""},{"$f":"COUNTIF(H29:AX29,\"G\")*VAL_PT_MATCH","v":0},{"$f":"SUM(AX30,H30,AL30,AF30,Z30,T30,N30)","v":0},{"$f":"IF(BF28<>0,ROUNDDOWN(BE28/BF28,3),\"\")","v":""},{"$f":"MAX(N31,T31,Z31,AF31,AL31,H31,AX31)","v":0},{"$f":"SUM(I29:M29,O29:S29,U29:Y29,AA29:AE29,AG29:AK29,C29:G29,AS29:AW29)","v":0},{"$f":"SUM(AM25:AQ25,AM33:AQ33,AM21:AQ21,AM17:AQ17,AM13:AQ13,AM9:AQ9,AM5:AQ5)","v":0},null,{"$f":"IF(BC28<>\"\",(BA28*10000000)+(BB28*100000)+(BC28*10000)+BD28,\"\")","v":""}]
[null,"Nom & Prénom",null,null,null,null,null,{"$f":"IF(COUNTIF(C29:G29,DISTANCE_Q)=NB_SETS_G_Q,\"G\",IF(COUNTIF(AM5:AQ5,DISTANCE_Q)=NB_SETS_G_Q,\"P\",\"\"))","v":""},null,null,null,null,null,{"$f":"IF(COUNTIF(I29:M29,DISTANCE_Q)=NB_SETS_G_Q,\"G\",IF(COUNTIF(AM9:AQ9,DISTANCE_Q)=NB_SETS_G_Q,\"P\",\"\"))","v":""},null,null,null,null,null,{"$f":"IF(COUNTIF(O29:S29,DISTANCE_Q)=NB_SETS_G_Q,\"G\",IF(COUNTIF(AM13:AQ13,DISTANCE_Q)=NB_SETS_G_Q,\"P\",\"\"))","v":""},null,null,null,null,null,{"$f":"IF(COUNTIF(U29:Y29,DISTANCE_Q)=NB_SETS_G_Q,\"G\",IF(COUNTIF(AM17:AQ17,DISTANCE_Q)=NB_SETS_G_Q,\"P\",\"\"))","v":""},null,null,null,null,null,{"$f":"IF(COUNTIF(AA29:AE29,DISTANCE_Q)=NB_SETS_G_Q,\"G\",IF(COUNTIF(AM21:AQ21,DISTANCE_Q)=NB_SETS_G_Q,\"P\",\"\"))","v":""},null,null,null,null,null,{"$f":"IF(COUNTIF(AG29:AK29,DISTANCE_Q)=NB_SETS_G_Q,\"G\",IF(COUNTIF(AM25:AQ25,DISTANCE_Q)=NB_SETS_G_Q,\"P\",\"\"))","v":""},null,null,null,null,null,null,null,null,null,null,null,{"$f":"IF(COUNTIF(AS29:AW29,DISTANCE_Q)=NB_SETS_G_Q,\"G\",IF(COUNTIF(AM33:AQ33,DISTANCE_Q)=NB_SETS_G_Q,\"P\",\"\"))","v":""}]
[null,"Ville ou Club",{"$f":"IF(OR(COUNTIF(C29:G29,\"\")<>COUNTIF(AM5:AQ5,\"\"),AND(H29=\"\",SUM(C29:G29)<>0)),\"!...\",IF(OR(AND(H29<>\"\",C29=\"\",C29<>AM5),AND(H29<>\"\",C29<>\"\",C29=AM5),AND(H29<>\"\",C29<>\"\",C29<>DISTANCE_Q,AM5<>DISTANCE_Q)),\"ERR!\",\"\"))","v":""},{"$f":"IF(C30=\"!...\",C30,IF(OR(AND(H29<>\"\",D29=\"\",D29<>AN5),AND(H29<>\"\",D29<>\"\",D29=AN5),AND(H29<>\"\",D29<>\"\",D29<>DISTANCE_Q,AN5<>DISTANCE_Q)),\"ERR!\",\"\"))","v":""},{"$f":"IF(D30=\"!...\",D30,IF(OR(AND(H29<>\"\",E29=\"\",E29<>AO5),AND(H29<>\"\",E29<>\"\",E29=AO5),AND(H29<>\"\",E29<>\"\",E29<>DISTANCE_Q,AO5<>DISTANCE_Q)),\"ERR!\",\"\"))","v":""},{"$f":"IF(E30=\"!...\",E30,IF(OR(AND(H29<>\"\",F29=\"\",F29<>AP5),AND(H29<>\"\",F29<>\"\",F29=AP5),AND(H29<>\"\",F29<>\"\",F29<>DISTANCE_Q,AP5<>DISTANCE_Q)),\"ERR!\",\"\"))","v":""},{"$f":"IF(F30=\"!...\",F30,IF(OR(AND(H29<>\"\",G29=\"\",G29<>AQ5),AND(H29<>\"\",G29<>\"\",G29=AQ5),AND(H29<>\"\",G29<>\"\",G29<>DISTANCE_Q,AQ5<>DISTANCE_Q)),\"ERR!\",\"\"))","v":""},{"$f":"IF(H29=\"\",\"\",IF(H29=\"G\",(NB_SETS_G_Q*2)-1-COUNTIF(AM5:AQ5,DISTANCE_Q),COUNTIF(C29:G29,DISTANCE_Q)))","v":""},{"$f":"IF(OR(COUNTIF(I29:M29,\"\")<>COUNTIF(AM9:AQ9,\"\"),AND(N29=\"\",SUM(I29:M29)<>0)),\"!...\",IF(OR(AND(N29<>\"\",I29=\"\",I29<>AM9),AND(N29<>\"\",I29<>\"\",I29=AM9),AND(N29<>\"\",I29<>\"\",I29<>DISTANCE_Q,AM9<>DISTANCE_Q)),\"ERR!\",\"\"))","v":""},{"$f":"IF(I30=\"!...\",I30,IF(OR(AND(N29<>\"\",J29=\"\",J29<>AN9),AND(N29<>\"\",J29<>\"\",J29=AN9),AND(N29<>\"\",J29<>\"\",J29<>DISTANCE_Q,AN9<>DISTANCE_Q)),\"ERR!\",\"\"))","v":""},{"$f":"IF(J30=\"!...\",J30,IF(OR(AND(N29<>\"\",K29=\"\",K29<>AO9),AND(N29<>\"\",K29<>\"\",K29=AO9),AND(N29<>\"\",K29<>\"\",K29<>DISTANCE_Q,AO9<>DISTANCE_Q)),\"ERR!\",\"\"))","v":""},{"$f":"IF(K30=\"!...\",K30,IF(OR(AND(N29<>\"\",L29=\"\",L29<>AP9),AND(N29<>\"\",L29<>\"\",L29=AP9),AND(N29<>\"\",L29<>\"\",L29<>DISTANCE_Q,AP9<>DISTANCE_Q)),\"ERR!\",\"\"))","v":""},{"$f":"IF(L30=\"!...\",L30,IF(OR(AND(N29<>\"\",M29=\"\",M29<>AQ9),AND(N29<>\"\",M29<>\"\",M29=AQ9),AND(N29<>\"\",M29<>\"\",M29<>DISTANCE_Q,AQ9<>DISTANCE_Q)),\"ERR!\",\"\"))","v":""},{"$f":"IF(N29=\"\",\"\",IF(N29=\"G\",(NB_SETS_G_Q*2)-1-COUNTIF(AM9:AQ9,DISTANCE_Q),COUNTIF(I29:M29,DISTANCE_Q)))","v":""},{"$f":"IF(OR(COUNTIF(O29:S29,\"\")<>COUNTIF(AM13:AQ13,\"\"),AND(T29=\"\",SUM(O29:S29)<>0)),\"!...\",IF(OR(AND(T29<>\"\",O29=\"\",O29<>AM13),AND(T29<>\"\",O29<>\"\",O29=AM13),AND(T29<>\"\",O29<>\"\",O29<>DISTANCE_Q,AM13<>DISTANCE_Q)),\"ERR!\",\"\"))","v":""},{"$f":"IF(O30=\"!...\",O30,IF(OR(AND(T29<>\"\",P29=\"\",P29<>AN13),AND(T29<>\"\",P29<>\"\",P29=AN13),AND(T29<>\"\",P29<>\"\",P29<>DISTANCE_Q,AN13<>DISTANCE_Q)),\"ERR!\",\"\"))","v":""},{"$f":"IF(P30=\"!...\",P30,IF(OR(AND(T29<>\"\",Q29=\"\",Q29<>AO13),AND(T29<>\"\",Q29<>\"\",Q29=AO13),AND(T29<>\"\",Q29<>\"\",Q29<>DISTANCE_Q,AO13<>DISTANCE_Q)),\"ERR!\",\"\"))","v":""},{"$f":"IF(Q30=\"!...\",Q30,IF(OR(AND(T29<>\"\",R29=\"\",R29<>AP13),AND(T29<>\"\",R29<>\"\",R29=AP13),AND(T29<>\"\",R29<>\"\",R29<>DISTANCE_Q,AP13<>DISTANCE_Q)),\"ERR!\",\"\"))","v":""},{"$f":"IF(R30=\"!...\",R30,IF(OR(AND(T29<>\"\",S29=\"\",S29<>AQ13),AND(T29<>\"\",S29<>\"\",S29=AQ13),AND(T29<>\"\",S29<>\"\",S29<>DISTANCE_Q,AQ13<>DISTANCE_Q)),\"ERR!\",\"\"))","v":""},{"$f":"IF(T29=\"\",\"\",IF(T29=\"G\",(NB_SETS_G_Q*2)-1-COUNTIF(AM13:AQ13,DISTANCE_Q),COUNTIF(O29:S29,DISTANCE_Q)))","v":""},{"$f":"IF(OR(COUNTIF(U29:Y29,\"\")<>COUNTIF(AM17:AQ17,\"\"),AND(Z29=\"\",SUM(U29:Y29)<>0)),\"!...\",IF(OR(AND(Z29<>\"\",U29=\"\",U29<>AM17),AND(Z29<>\"\",U29<>\"\",U29=AM17),AND(Z29<>\"\",U29<>\"\",U29<>DISTANCE_Q,AM17<>DISTANCE_Q)),\"ERR!\",\"\"))","v":""},{"$f":"IF(U30=\"!...\",U30,IF(OR(AND(Z29<>\"\",V29=\"\",V29<>AN17),AND(Z29<>\"\",V29<>\"\",V29=AN17),AND(Z29<>\"\",V29<>\"\",V29<>DISTANCE_Q,AN17<>DISTANCE_Q)),\"ERR!\",\"\"))","v":""},{"$f":"IF(V30=\"!...\",V30,IF(OR(AND(Z29<>\"\",W29=\"\",W29<>AO17),AND(Z29<>\"\",W29<>\"\",W29=AO17),AND(Z29<>\"\",W29<>\"\",W29<>DISTANCE_Q,AO17<>DISTANCE_Q)),\"ERR!\",\"\"))","v":""},{"$f":"IF(W30=\"!...\",W30,IF(OR(AND(Z29<>\"\",X29=\"\",X29<>AP17),AND(Z29<>\"\",X29<>\"\",X29=AP17),AND(Z29<>\"\",X29<>\"\",X29<>DISTANCE_Q,AP17<>DISTANCE_Q)),\"ERR!\",\"\"))","v":""},{"$f":"IF(X30=\"!...\",X30,IF(OR(AND(Z29<>\"\",Y29=\"\",Y29<>AQ17),AND(Z29<>\"\",Y29<>\"\",Y29=AQ17),AND(Z29<>\"\",Y29<>\"\",Y29<>DISTANCE_Q,AQ17<>DISTANCE_Q)),\"ERR!\",\"\"))","v":""},{"$f":"IF(Z29=\"\",\"\",IF(Z29=\"G\",(NB_SETS_G_Q*2)-1-COUNTIF(AM17:AQ17,DISTANCE_Q),COUNTIF(U29:Y29,DISTANCE_Q)))","v":""},{"$f":"IF(OR(COUNTIF(AA29:AE29,\"\")<>COUNTIF(AM21:AQ21,\"\"),AND(AF29=\"\",SUM(AA29:AE29)<>0)),\"!...\",IF(OR(AND(AF29<>\"\",AA29=\"\",AA29<>AM21),AND(AF29<>\"\",AA29<>\"\",AA29=AM21),AND(AF29<>\"\",AA29<>\"\",AA29<>DISTANCE_Q,AM21<>DISTANCE_Q)),\"ERR!\",\"\"))","v":""},{"$f":"IF(AA30=\"!...\",AA30,IF(OR(AND(AF29<>\"\",AB29=\"\",AB29<>AN21),AND(AF29<>\"\",AB29<>\"\",AB29=AN21),AND(AF29<>\"\",AB29<>\"\",AB29<>DISTANCE_Q,AN21<>DISTANCE_Q)),\"ERR!\",\"\"))","v":""},{"$f":"IF(AB30=\"!...\",AB30,IF(OR(AND(AF29<>\"\",AC29=\"\",AC29<>AO21),AND(AF29<>\"\",AC29<>\"\",AC29=AO21),AND(AF29<>\"\",AC29<>\"\",AC29<>DISTANCE_Q,AO21<>DISTANCE_Q)),\"ERR!\",\"\"))","v":""},{"$f":"IF(AC30=\"!...\",AC30,IF(OR(AND(AF29<>\"\",AD29=\"\",AD29<>AP21),AND(AF29<>\"\",AD29<>\"\",AD29=AP21),AND(AF29<>\"\",AD29<>\"\",AD29<>DISTANCE_Q,AP21<>DISTANCE_Q)),\"ERR!\",\"\"))","v":""},{"$f":"IF(AD30=\"!...\",AD30,IF(OR(AND(AF29<>\"\",AE29=\"\",AE29<>AQ21),AND(AF29<>\"\",AE29<>\"\",AE29=AQ21),AND(AF29<>\"\",AE29<>\"\",AE29<>DISTANCE_Q,AQ21<>DISTANCE_Q)),\"ERR!\",\"\"))","v":""},{"$f":"IF(AF29=\"\",\"\",IF(AF29=\"G\",(NB_SETS_G_Q*2)-1-COUNTIF(AM21:AQ21,DISTANCE_Q),COUNTIF(AA29:AE29,DISTANCE_Q)))","v":""},{"$f":"IF(OR(COUNTIF(AG29:AK29,\"\")<>COUNTIF(AM25:AQ25,\"\"),AND(AL29=\"\",SUM(AG29:AK29)<>0)),\"!...\",IF(OR(AND(AL29<>\"\",AG29=\"\",AG29<>AM25),AND(AL29<>\"\",AG29<>\"\",AG29=AM25),AND(AL29<>\"\",AG29<>\"\",AG29<>DISTANCE_Q,AM25<>DISTANCE_Q)),\"ERR!\",\"\"))","v":""},{"$f":"IF(AG30=\"!...\",AG30,IF(OR(AND(AL29<>\"\",AH29=\"\",AH29<>AN25),AND(AL29<>\"\",AH29<>\"\",AH29=AN25),AND(AL29<>\"\",AH29<>\"\",AH29<>DISTANCE_Q,AN25<>DISTANCE_Q)),\"ERR!\",\"\"))","v":""},{"$f":"IF(AH30=\"!...\",AH30,IF(OR(AND(AL29<>\"\",AI29=\"\",AI29<>AO25),AND(AL29<>\"\",AI29<>\"\",AI29=AO25),AND(AL29<>\"\",AI29<>\"\",AI29<>DISTANCE_Q,AO25<>DISTANCE_Q)),\"ERR!\",\"\"))","v":""},{"$f":"IF(AI30=\"!...\",AI30,IF(OR(AND(AL29<>\"\",AJ29=\"\",AJ29<>AP25),AND(AL29<>\"\",AJ29<>\"\",AJ29=AP25),AND(AL29<>\"\",AJ29<>\"\",AJ29<>DISTANCE_Q,AP25<>DISTANCE_Q)),\"ERR!\",\"\"))","v":""},{"$f":"IF(AJ30=\"!...\",AJ30,IF(OR(AND(AL29<>\"\",AK29=\"\",AK29<>AQ25),AND(AL29<>\"\",AK29<>\"\",AK29=AQ25),AND(AL29<>\"\",AK29<>\"\",AK29<>DISTANCE_Q,AQ25<>DISTANCE_Q)),\"ERR!\",\"\"))","v":""},{"$f":"IF(AL29=\"\",\"\",IF(AL29=\"G\",(NB_SETS_G_Q*2)-1-COUNTIF(AM25:AQ25,DISTANCE_Q),COUNTIF(AG29:AK29,DISTANCE_Q)))","v":""},null,null,null,null,null,null,{"$f":"IF(OR(COUNTIF(AS29:AW29,\"\")<>COUNTIF(AM33:AQ33,\"\"),AND(AX29=\"\",SUM(AS29:AW29)<>0)),\"!...\",IF(OR(AND(AX29<>\"\",AS29=\"\",AS29<>AM33),AND(AX29<>\"\",AS29<>\"\",AS29=AM33),AND(AX29<>\"\",AS29<>\"\",AS29<>DISTANCE_Q,AM33<>DISTANCE_Q)),\"ERR!\",\"\"))","v":""},{"$f":"IF(AS30=\"!...\",AS30,IF(OR(AND(AX29<>\"\",AT29=\"\",AT29<>AN33),AND(AX29<>\"\",AT29<>\"\",AT29=AN33),AND(AX29<>\"\",AT29<>\"\",AT29<>DISTANCE_Q,AN33<>DISTANCE_Q)),\"ERR!\",\"\"))","v":""},{"$f":"IF(AT30=\"!...\",AT30,IF(OR(AND(AX29<>\"\",AU29=\"\",AU29<>AO33),AND(AX29<>\"\",AU29<>\"\",AU29=AO33),AND(AX29<>\"\",AU29<>\"\",AU29<>DISTANCE_Q,AO33<>DISTANCE_Q)),\"ERR!\",\"\"))","v":""},{"$f":"IF(AU30=\"!...\",AU30,IF(OR(AND(AX29<>\"\",AV29=\"\",AV29<>AP33),AND(AX29<>\"\",AV29<>\"\",AV29=AP33),AND(AX29<>\"\",AV29<>\"\",AV29<>DISTANCE_Q,AP33<>DISTANCE_Q)),\"ERR!\",\"\"))","v":""},{"$f":"IF(AV30=\"!...\",AV30,IF(OR(AND(AX29<>\"\",AW29=\"\",AW29<>AQ33),AND(AX29<>\"\",AW29<>\"\",AW29=AQ33),AND(AX29<>\"\",AW29<>\"\",AW29<>DISTANCE_Q,AQ33<>DISTANCE_Q)),\"ERR!\",\"\"))","v":""},{"$f":"IF(AX29=\"\",\"\",IF(AX29=\"G\",(NB_SETS_G_Q*2)-1-COUNTIF(AM33:AQ33,DISTANCE_Q),COUNTIF(AS29:AW29,DISTANCE_Q)))","v":""}]
[null,"Licence",null,null,null,null,null,{"$f":"IF(H29=\"\",\"\",IF(SUM(AM5:AQ5)<>0,ROUNDDOWN(SUM(C29:G29)/SUM(AM5:AQ5),3),\"\"))","v":""},null,null,null,null,null,{"$f":"IF(N29=\"\",\"\",IF(SUM(AM9:AQ9)<>0,ROUNDDOWN(SUM(I29:M29)/SUM(AM9:AQ9),3),\"\"))","v":""},null,null,null,null,null,{"$f":"IF(T29=\"\",\"\",IF(SUM(AM13:AQ13)<>0,ROUNDDOWN(SUM(O29:S29)/SUM(AM13:AQ13),3),\"\"))","v":""},null,null,null,null,null,{"$f":"IF(Z29=\"\",\"\",IF(SUM(AM17:AQ17)<>0,ROUNDDOWN(SUM(U29:Y29)/SUM(AM17:AQ17),3),\"\"))","v":""},null,null,null,null,null,{"$f":"IF(AF29=\"\",\"\",IF(SUM(AM21:AQ21)<>0,ROUNDDOWN(SUM(AA29:AE29)/SUM(AM21:AQ21),3),\"\"))","v":""},null,null,null,null,null,{"$f":"IF(AL29=\"\",\"\",IF(SUM(AM25:AQ25)<>0,ROUNDDOWN(SUM(AG29:AK29)/SUM(AM25:AQ25),3),\"\"))","v":""},null,null,null,null,null,null,null,null,null,null,null,{"$f":"IF(AX29=\"\",\"\",IF(SUM(AM33:AQ33)<>0,ROUNDDOWN(SUM(AS29:AW29)/SUM(AM33:AQ33),3),\"\"))","v":""}]
[null,"Joueur 8","set 1","set 2","set 3","set 4","set 5","J1-J8","set 1","set 2","set 3","set 4","set 5","J2-J8","set 1","set 2","set 3","set 4","set 5","J3-J8","set 1","set 2","set 3","set 4","set 5","J4-J8","set 1","set 2","set 3","set 4","set 5","J5-J8","set 1","set 2","set 3","set 4","set 5","J6-J8","set 1","set 2","set 3","set 4","set 5","J7-J8",null,null,null,null,null,null,null,{"$f":"IF(BH32<>\"\",RANK(BH32,BH4:BH35),\"\")","v":""},{"$f":"COUNTIF(H33:AX33,\"G\")*VAL_PT_MATCH","v":0},{"$f":"SUM(H34,AR34,AL34,AF34,Z34,T34,N34)","v":0},{"$f":"IF(BF32<>0,ROUNDDOWN(BE32/BF32,3),\"\")","v":""},{"$f":"MAX(N35,T35,Z35,AF35,AL35,AR35,H35)","v":0},{"$f":"SUM(I33:M33,O33:S33,U33:Y33,AA33:AE33,AG33:AK33,AM33:AQ33,C33:G33)","v":0},{"$f":"SUM(AS25:AW25,AS29:AW29,AS21:AW21,AS17:AW17,AS13:AW13,AS9:AW9,AS5:AW5)","v":0},null,{"$f":"IF(BC32<>\"\",(BA32*10000000)+(BB32*100000)+(BC32*10000)+BD32,\"\")","v":""}]
[null,"Nom & Prénom",null,null,null,null,null,{"$f":"IF(COUNTIF(C33:G33,DISTANCE_Q)=NB_SETS_G_Q,\"G\",IF(COUNTIF(AS5:AW5,DISTANCE_Q)=NB_SETS_G_Q,\"P\",\"\"))","v":""},null,null,null,null,null,{"$f":"IF(COUNTIF(I33:M33,DISTANCE_Q)=NB_SETS_G_Q,\"G\",IF(COUNTIF(AS9:AW9,DISTANCE_Q)=NB_SETS_G_Q,\"P\",\"\"))","v":""},null,null,null,null,null,{"$f":"IF(COUNTIF(O33:S33,DISTANCE_Q)=NB_SETS_G_Q,\"G\",IF(COUNTIF(AS13:AW13,DISTANCE_Q)=NB_SETS_G_Q,\"P\",\"\"))","v":""},null,null,null,null,null,{"$f":"IF(COUNTIF(U33:Y33,DISTANCE_Q)=NB_SETS_G_Q,\"G\",IF(COUNTIF(AS17:AW17,DISTANCE_Q)=NB_SETS_G_Q,\"P\",\"\"))","v":""},null,null,null,null,null,{"$f":"IF(COUNTIF(AA33:AE33,DISTANCE_Q)=NB_SETS_G_Q,\"G\",IF(COUNTIF(AS21:AW21,DISTANCE_Q)=NB_SETS_G_Q,\"P\",\"\"))","v":""},null,null,null,null,null,{"$f":"IF(COUNTIF(AG33:AK33,DISTANCE_Q)=NB_SETS_G_Q,\"G\",IF(COUNTIF(AS25:AW25,DISTANCE_Q)=NB_SETS_G_Q,\"P\",\"\"))","v":""},null,null,null,null,null,{"$f":"IF(COUNTIF(AM33:AQ33,DISTANCE_Q)=NB_SETS_G_Q,\"G\",IF(COUNTIF(AS29:AW29,DISTANCE_Q)=NB_SETS_G_Q,\"P\",\"\"))","v":""}]
[null,"Ville ou Club",{"$f":"IF(OR(COUNTIF(C33:G33,\"\")<>COUNTIF(AS5:AW5,\"\"),AND(H33=\"\",SUM(C33:G33)<>0)),\"!...\",IF(OR(AND(H33<>\"\",C33=\"\",C33<>AS5),AND(H33<>\"\",C33<>\"\",C33=AS5),AND(H33<>\"\",C33<>\"\",C33<>DISTANCE_Q,AS5<>DISTANCE_Q)),\"ERR!\",\"\"))","v":""},{"$f":"IF(C34=\"!...\",C34,IF(OR(AND(H33<>\"\",D33=\"\",D33<>AT5),AND(H33<>\"\",D33<>\"\",D33=AT5),AND(H33<>\"\",D33<>\"\",D33<>DISTANCE_Q,AT5<>DISTANCE_Q)),\"ERR!\",\"\"))","v":""},{"$f":"IF(D34=\"!...\",D34,IF(OR(AND(H33<>\"\",E33=\"\",E33<>AU5),AND(H33<>\"\",E33<>\"\",E33=AU5),AND(H33<>\"\",E33<>\"\",E33<>DISTANCE_Q,AU5<>DISTANCE_Q)),\"ERR!\",\"\"))","v":""},{"$f":"IF(E34=\"!...\",E34,IF(OR(AND(H33<>\"\",F33=\"\",F33<>AV5),AND(H33<>\"\",F33<>\"\",F33=AV5),AND(H33<>\"\",F33<>\"\",F33<>DISTANCE_Q,AV5<>DISTANCE_Q)),\"ERR!\",\"\"))","v":""},{"$f":"IF(F34=\"!...\",F34,IF(OR(AND(H33<>\"\",G33=\"\",G33<>AW5),AND(H33<>\"\",G33<>\"\",G33=AW5),AND(H33<>\"\",G33<>\"\",G33<>DISTANCE_Q,AW5<>DISTANCE_Q)),\"ERR!\",\"\"))","v":""},{"$f":"IF(H33=\"\",\"\",IF(H33=\"G\",(NB_SETS_G_Q*2)-1-COUNTIF(AS5:AW5,DISTANCE_Q),COUNTIF(C33:G33,DISTANCE_Q)))","v":""},{"$f":"IF(OR(COUNTIF(I33:M33,\"\")<>COUNTIF(AS9:AW9,\"\"),AND(N33=\"\",SUM(I33:M33)<>0)),\"!...\",IF(OR(AND(N33<>\"\",I33=\"\",I33<>AS9),AND(N33<>\"\",I33<>\"\",I33=AS9),AND(N33<>\"\",I33<>\"\",I33<>DISTANCE_Q,AS9<>DISTANCE_Q)),\"ERR!\",\"\"))","v":""},{"$f":"IF(I34=\"!...\",I34,IF(OR(AND(N33<>\"\",J33=\"\",J33<>AT9),AND(N33<>\"\",J33<>\"\",J33=AT9),AND(N33<>\"\",J33<>\"\",J33<>DISTANCE_Q,AT9<>DISTANCE_Q)),\"ERR!\",\"\"))","v":""},{"$f":"IF(J34=\"!...\",J34,IF(OR(AND(N33<>\"\",K33=\"\",K33<>AU9),AND(N33<>\"\",K33<>\"\",K33=AU9),AND(N33<>\"\",K33<>\"\",K33<>DISTANCE_Q,AU9<>DISTANCE_Q)),\"ERR!\",\"\"))","v":""},{"$f":"IF(K34=\"!...\",K34,IF(OR(AND(N33<>\"\",L33=\"\",L33<>AV9),AND(N33<>\"\",L33<>\"\",L33=AV9),AND(N33<>\"\",L33<>\"\",L33<>DISTANCE_Q,AV9<>DISTANCE_Q)),\"ERR!\",\"\"))","v":""},{"$f":"IF(L34=\"!...\",L34,IF(OR(AND(N33<>\"\",M33=\"\",M33<>AW9),AND(N33<>\"\",M33<>\"\",M33=AW9),AND(N33<>\"\",M33<>\"\",M33<>DISTANCE_Q,AW9<>DISTANCE_Q)),\"ERR!\",\"\"))","v":""},{"$f":"IF(N33=\"\",\"\",IF(N33=\"G\",(NB_SETS_G_Q*2)-1-COUNTIF(AS9:AW9,DISTANCE_Q),COUNTIF(I33:M33,DISTANCE_Q)))","v":""},{"$f":"IF(OR(COUNTIF(O33:S33,\"\")<>COUNTIF(AS13:AW13,\"\"),AND(T33=\"\",SUM(O33:S33)<>0)),\"!...\",IF(OR(AND(T33<>\"\",O33=\"\",O33<>AS13),AND(T33<>\"\",O33<>\"\",O33=AS13),AND(T33<>\"\",O33<>\"\",O33<>DISTANCE_Q,AS13<>DISTANCE_Q)),\"ERR!\",\"\"))","v":""},{"$f":"IF(O34=\"!...\",O34,IF(OR(AND(T33<>\"\",P33=\"\",P33<>AT13),AND(T33<>\"\",P33<>\"\",P33=AT13),AND(T33<>\"\",P33<>\"\",P33<>DISTANCE_Q,AT13<>DISTANCE_Q)),\"ERR!\",\"\"))","v":""},{"$f":"IF(P34=\"!...\",P34,IF(OR(AND(T33<>\"\",Q33=\"\",Q33<>AU13),AND(T33<>\"\",Q33<>\"\",Q33=AU13),AND(T33<>\"\",Q33<>\"\",Q33<>DISTANCE_Q,AU13<>DISTANCE_Q)),\"ERR!\",\"\"))","v":""},{"$f":"IF(Q34=\"!...\",Q34,IF(OR(AND(T33<>\"\",R33=\"\",R33<>AV13),AND(T33<>\"\",R33<>\"\",R33=AV13),AND(T33<>\"\",R33<>\"\",R33<>DISTANCE_Q,AV13<>DISTANCE_Q)),\"ERR!\",\"\"))","v":""},{"$f":"IF(R34=\"!...\",R34,IF(OR(AND(T33<>\"\",S33=\"\",S33<>AW13),AND(T33<>\"\",S33<>\"\",S33=AW13),AND(T33<>\"\",S33<>\"\",S33<>DISTANCE_Q,AW13<>DISTANCE_Q)),\"ERR!\",\"\"))","v":""},{"$f":"IF(T33=\"\",\"\",IF(T33=\"G\",(NB_SETS_G_Q*2)-1-COUNTIF(AS13:AW13,DISTANCE_Q),COUNTIF(O33:S33,DISTANCE_Q)))","v":""},{"$f":"IF(OR(COUNTIF(U33:Y33,\"\")<>COUNTIF(AS17:AW17,\"\"),AND(Z33=\"\",SUM(U33:Y33)<>0)),\"!...\",IF(OR(AND(Z33<>\"\",U33=\"\",U33<>AS17),AND(Z33<>\"\",U33<>\"\",U33=AS17),AND(Z33<>\"\",U33<>\"\",U33<>DISTANCE_Q,AS17<>DISTANCE_Q)),\"ERR!\",\"\"))","v":""},{"$f":"IF(U34=\"!...\",U34,IF(OR(AND(Z33<>\"\",V33=\"\",V33<>AT17),AND(Z33<>\"\",V33<>\"\",V33=AT17),AND(Z33<>\"\",V33<>\"\",V33<>DISTANCE_Q,AT17<>DISTANCE_Q)),\"ERR!\",\"\"))","v":""},{"$f":"IF(V34=\"!...\",V34,IF(OR(AND(Z33<>\"\",W33=\"\",W33<>AU17),AND(Z33<>\"\",W33<>\"\",W33=AU17),AND(Z33<>\"\",W33<>\"\",W33<>DISTANCE_Q,AU17<>DISTANCE_Q)),\"ERR!\",\"\"))","v":""},{"$f":"IF(W34=\"!...\",W34,IF(OR(AND(Z33<>\"\",X33=\"\",X33<>AV17),AND(Z33<>\"\",X33<>\"\",X33=AV17),AND(Z33<>\"\",X33<>\"\",X33<>DISTANCE_Q,AV17<>DISTANCE_Q)),\"ERR!\",\"\"))","v":""},{"$f":"IF(X34=\"!...\",X34,IF(OR(AND(Z33<>\"\",Y33=\"\",Y33<>AW17),AND(Z33<>\"\",Y33<>\"\",Y33=AW17),AND(Z33<>\"\",Y33<>\"\",Y33<>DISTANCE_Q,AW17<>DISTANCE_Q)),\"ERR!\",\"\"))","v":""},{"$f":"IF(Z33=\"\",\"\",IF(Z33=\"G\",(NB_SETS_G_Q*2)-1-COUNTIF(AS17:AW17,DISTANCE_Q),COUNTIF(U33:Y33,DISTANCE_Q)))","v":""},{"$f":"IF(OR(COUNTIF(AA33:AE33,\"\")<>COUNTIF(AS21:AW21,\"\"),AND(AF33=\"\",SUM(AA33:AE33)<>0)),\"!...\",IF(OR(AND(AF33<>\"\",AA33=\"\",AA33<>AS21),AND(AF33<>\"\",AA33<>\"\",AA33=AS21),AND(AF33<>\"\",AA33<>\"\",AA33<>DISTANCE_Q,AS21<>DISTANCE_Q)),\"ERR!\",\"\"))","v":""},{"$f":"IF(AA34=\"!...\",AA34,IF(OR(AND(AF33<>\"\",AB33=\"\",AB33<>AT21),AND(AF33<>\"\",AB33<>\"\",AB33=AT21),AND(AF33<>\"\",AB33<>\"\",AB33<>DISTANCE_Q,AT21<>DISTANCE_Q)),\"ERR!\",\"\"))","v":""},{"$f":"IF(AB34=\"!...\",AB34,IF(OR(AND(AF33<>\"\",AC33=\"\",AC33<>AU21),AND(AF33<>\"\",AC33<>\"\",AC33=AU21),AND(AF33<>\"\",AC33<>\"\",AC33<>DISTANCE_Q,AU21<>DISTANCE_Q)),\"ERR!\",\"\"))","v":""},{"$f":"IF(AC34=\"!...\",AC34,IF(OR(AND(AF33<>\"\",AD33=\"\",AD33<>AV21),AND(AF33<>\"\",AD33<>\"\",AD33=AV21),AND(AF33<>\"\",AD33<>\"\",AD33<>DISTANCE_Q,AV21<>DISTANCE_Q)),\"ERR!\",\"\"))","v":""},{"$f":"IF(AD34=\"!...\",AD34,IF(OR(AND(AF33<>\"\",AE33=\"\",AE33<>AW21),AND(AF33<>\"\",AE33<>\"\",AE33=AW21),AND(AF33<>\"\",AE33<>\"\",AE33<>DISTANCE_Q,AW21<>DISTANCE_Q)),\"ERR!\",\"\"))","v":""},{"$f":"IF(AF33=\"\",\"\",IF(AF33=\"G\",(NB_SETS_G_Q*2)-1-COUNTIF(AS21:AW21,DISTANCE_Q),COUNTIF(AA33:AE33,DISTANCE_Q)))","v":""},{"$f":"IF(OR(COUNTIF(AG33:AK33,\"\")<>COUNTIF(AS25:AW25,\"\"),AND(AL33=\"\",SUM(AG33:AK33)<>0)),\"!...\",IF(OR(AND(AL33<>\"\",AG33=\"\",AG33<>AS25),AND(AL33<>\"\",AG33<>\"\",AG33=AS25),AND(AL33<>\"\",AG33<>\"\",AG33<>DISTANCE_Q,AS25<>DISTANCE_Q)),\"ERR!\",\"\"))","v":""},{"$f":"IF(AG34=\"!...\",AG34,IF(OR(AND(AL33<>\"\",AH33=\"\",AH33<>AT25),AND(AL33<>\"\",AH33<>\"\",AH33=AT25),AND(AL33<>\"\",AH33<>\"\",AH33<>DISTANCE_Q,AT25<>DISTANCE_Q)),\"ERR!\",\"\"))","v":""},{"$f":"IF(AH34=\"!...\",AH34,IF(OR(AND(AL33<>\"\",AI33=\"\",AI33<>AU25),AND(AL33<>\"\",AI33<>\"\",AI33=AU25),AND(AL33<>\"\",AI33<>\"\",AI33<>DISTANCE_Q,AU25<>DISTANCE_Q)),\"ERR!\",\"\"))","v":""},{"$f":"IF(AI34=\"!...\",AI34,IF(OR(AND(AL33<>\"\",AJ33=\"\",AJ33<>AV25),AND(AL33<>\"\",AJ33<>\"\",AJ33=AV25),AND(AL33<>\"\",AJ33<>\"\",AJ33<>DISTANCE_Q,AV25<>DISTANCE_Q)),\"ERR!\",\"\"))","v":""},{"$f":"IF(AJ34=\"!...\",AJ34,IF(OR(AND(AL33<>\"\",AK33=\"\",AK33<>AW25),AND(AL33<>\"\",AK33<>\"\",AK33=AW25),AND(AL33<>\"\",AK33<>\"\",AK33<>DISTANCE_Q,AW25<>DISTANCE_Q)),\"ERR!\",\"\"))","v":""},{"$f":"IF(AL33=\"\",\"\",IF(AL33=\"G\",(NB_SETS_G_Q*2)-1-COUNTIF(AS25:AW25,DISTANCE_Q),COUNTIF(AG33:AK33,DISTANCE_Q)))","v":""},{"$f":"IF(OR(COUNTIF(AM33:AQ33,\"\")<>COUNTIF(AS29:AW29,\"\"),AND(AR33=\"\",SUM(AM33:AQ33)<>0)),\"!...\",IF(OR(AND(AR33<>\"\",AM33=\"\",AM33<>AS29),AND(AR33<>\"\",AM33<>\"\",AM33=AS29),AND(AR33<>\"\",AM33<>\"\",AM33<>DISTANCE_Q,AS29<>DISTANCE_Q)),\"ERR!\",\"\"))","v":""},{"$f":"IF(AM34=\"!...\",AM34,IF(OR(AND(AR33<>\"\",AN33=\"\",AN33<>AT29),AND(AR33<>\"\",AN33<>\"\",AN33=AT29),AND(AR33<>\"\",AN33<>\"\",AN33<>DISTANCE_Q,AT29<>DISTANCE_Q)),\"ERR!\",\"\"))","v":""},{"$f":"IF(AN34=\"!...\",AN34,IF(OR(AND(AR33<>\"\",AO33=\"\",AO33<>AU29),AND(AR33<>\"\",AO33<>\"\",AO33=AU29),AND(AR33<>\"\",AO33<>\"\",AO33<>DISTANCE_Q,AU29<>DISTANCE_Q)),\"ERR!\",\"\"))","v":""},{"$f":"IF(AO34=\"!...\",AO34,IF(OR(AND(AR33<>\"\",AP33=\"\",AP33<>AV29),AND(AR33<>\"\",AP33<>\"\",AP33=AV29),AND(AR33<>\"\",AP33<>\"\",AP33<>DISTANCE_Q,AV29<>DISTANCE_Q)),\"ERR!\",\"\"))","v":""},{"$f":"IF(AP34=\"!...\",AP34,IF(OR(AND(AR33<>\"\",AQ33=\"\",AQ33<>AW29),AND(AR33<>\"\",AQ33<>\"\",AQ33=AW29),AND(AR33<>\"\",AQ33<>\"\",AQ33<>DISTANCE_Q,AW29<>DISTANCE_Q)),\"ERR!\",\"\"))","v":""},{"$f":"IF(AR33=\"\",\"\",IF(AR33=\"G\",(NB_SETS_G_Q*2)-1-COUNTIF(AS29:AW29,DISTANCE_Q),COUNTIF(AM33:AQ33,DISTANCE_Q)))","v":""}]
[null,"Licence",null,null,null,null,null,{"$f":"IF(H33=\"\",\"\",IF(SUM(AS5:AW5)<>0,ROUNDDOWN(SUM(C33:G33)/SUM(AS5:AW5),3),\"\"))","v":""},null,null,null,null,null,{"$f":"IF(N33=\"\",\"\",IF(SUM(AS9:AW9)<>0,ROUNDDOWN(SUM(I33:M33)/SUM(AS9:AW9),3),\"\"))","v":""},null,null,null,null,null,{"$f":"IF(T33=\"\",\"\",IF(SUM(AS13:AW13)<>0,ROUNDDOWN(SUM(O33:S33)/SUM(AS13:AW13),3),\"\"))","v":""},null,null,null,null,null,{"$f":"IF(Z33=\"\",\"\",IF(SUM(AS17:AW17)<>0,ROUNDDOWN(SUM(U33:Y33)/SUM(AS17:AW17),3),\"\"))","v":""},null,null,null,null,null,{"$f":"IF(AF33=\"\",\"\",IF(SUM(AS21:AW21)<>0,ROUNDDOWN(SUM(AA33:AE33)/SUM(AS21:AW21),3),\"\"))","v":""},null,null,null,null,null,{"$f":"IF(AL33=\"\",\"\",IF(SUM(AS25:AW25)<>0,ROUNDDOWN(SUM(AG33:AK33)/SUM(AS25:AW25),3),\"\"))","v":""},null,null,null,null,null,{"$f":"IF(AR33=\"\",\"\",IF(SUM(AS29:AW29)<>0,ROUNDDOWN(SUM(AM33:AQ33)/SUM(AS29:AW29),3),\"\"))","v":""}]
[]
[]
[null,"Poule",{"$f":"\"J\" & RIGHT(B39,1) & \" \" &B40","v":"J1 Nom & Prénom"},null,null,null,null,null,{"$f":"\"J\" & RIGHT(B43,1) & \" \" &B44","v":"J2 Nom & Prénom"},null,null,null,null,null,{"$f":"\"J\" & RIGHT(B47,1) & \" \" &B48","v":"J3 Nom & Prénom"},null,null,null,null,null,{"$f":"\"J\" & RIGHT(B51,1) & \" \" &B52","v":"J4 Nom & Prénom"},null,null,null,null,null,{"$f":"\"J\" & RIGHT(B55,1) & \" \" &B56","v":"J5 Nom & Prénom"},null,null,null,null,null,{"$f":"\"J\" & RIGHT(B59,1) & \" \" &B60","v":"J6 Nom & Prénom"},null,null,null,null,null,{"$f":"\"J\" & RIGHT(B63,1) & \" \" &B64","v":"J7 Nom & Prénom"},null,null,null,null,null,null,null,null,null,null,null,null,"Clst","Pts Match","Pts Sets","Moy. Gen.","Moy. Part.","Pts marq.","Pts subis",null,"Calcul 1er"]
[null,"Joueur 1","Sets",null,null,null,null,"Match","set 1","set 2","set 3","set 4","set 5","J1-J2","set 1","set 2","set 3","set 4","set 5","J1-J3","set 1","set 2","set 3","set 4","set 5","J1-J4","set 1","set 2","set 3","set 4","set 5","J1-J5","set 1","set 2","set 3","set 4","set 5","J1-J6","set 1","set 2","set 3","set 4","set 5","J1-J7",null,null,null,null,null,null,null,{"$f":"IF(BH39<>\"\",RANK(BH39,BH39:BH66),\"\")","v":""},{"$f":"IF(TYPE_QUALIF=\"Poules 8J\",(COUNTIF(N40:AR40,\"G\")*VAL_PT_MATCH)+VAL_PT_MATCH,COUNTIF(N40:AR40,\"G\")*VAL_PT_MATCH)","v":0},{"$f":"IF(TYPE_QUALIF=\"Poules 8J\",(NB_SETS_G_Q*2-1)+SUM(AR41,AL41,AF41,Z41,T41,N41),SUM(AR41,AL41,AF41,Z41,T41,N41))","v":0},{"$f":"IF(BF39<>0,ROUNDDOWN(BE39/BF39,3),\"\")","v":""},{"$f":"MAX(N42,T42,Z42,AF42,AL42,AR42)","v":0},{"$f":"SUM(I40:M40,O40:S40,U40:Y40,AA40:AE40,AG40:AK40,AM40:AQ40)","v":0},{"$f":"SUM(C44:G44,C48:G48,C52:G52,C56:G56,C60:G60,C64:G64)","v":0},null,{"$f":"IF(BC39<>\"\",(BA39*10000000)+(BB39*100000)+(BC39*10000)+BD39,\"\")","v":""}]
[null,"Nom & Prénom","Pts",null,null,null,null,"G/P",null,null,null,null,null,{"$f":"IF(COUNTIF(I40:M40,DISTANCE_Q)=NB_SETS_G_Q,\"G\",IF(COUNTIF(C44:G44,DISTANCE_Q)=NB_SETS_G_Q,\"P\",\"\"))","v":""},null,null,null,null,null,{"$f":"IF(COUNTIF(O40:S40,DISTANCE_Q)=NB_SETS_G_Q,\"G\",IF(COUNTIF(C48:G48,DISTANCE_Q)=NB_SETS_G_Q,\"P\",\"\"))","v":""},null,null,null,null,null,{"$f":"IF(COUNTIF(U40:Y40,DISTANCE_Q)=NB_SETS_G_Q,\"G\",IF(COUNTIF(C52:G52,DISTANCE_Q)=NB_SETS_G_Q,\"P\",\"\"))","v":""},null,null,null,null,null,{"$f":"IF(COUNTIF(AA40:AE40,DISTANCE_Q)=NB_SETS_G_Q,\"G\",IF(COUNTIF(C56:G56,DISTANCE_Q)=NB_SETS_G_Q,\"P\",\"\"))","v":""},null,null,null,null,null,{"$f":"IF(COUNTIF(AG40:AK40,DISTANCE_Q)=NB_SETS_G_Q,\"G\",IF(COUNTIF(C60:G60,DISTANCE_Q)=NB_SETS_G_Q,\"P\",\"\"))","v":""},null,null,null,null,null,{"$f":"IF(COUNTIF(AM40:AQ40,DISTANCE_Q)=NB_SETS_G_Q,\"G\",IF(COUNTIF(C64:G64,DISTANCE_Q)=NB_SETS_G_Q,\"P\",\"\"))","v":""}]
[null,"Ville ou Club",null,null,null,null,null,"Pts de Sets",{"$f":"IF(OR(COUNTIF(I40:M40,\"\")<>COUNTIF(C44:G44,\"\"),AND(N40=\"\",SUM(I40:M40)<>0)),\"!...\",IF(OR(AND(N40<>\"\",I40=\"\",I40<>C44),AND(N40<>\"\",I40<>\"\",I40=C44),AND(N40<>\"\",I40<>\"\",I40<>DISTANCE_Q,C44<>DISTANCE_Q)),\"ERR!\",\"\"))","v":""},{"$f":"IF(I41=\"!...\",I41,IF(OR(AND(N40<>\"\",J40=\"\",J40<>D44),AND(N40<>\"\",J40<>\"\",J40=D44),AND(N40<>\"\",J40<>\"\",J40<>DISTANCE_Q,D44<>DISTANCE_Q)),\"ERR!\",\"\"))","v":""},{"$f":"IF(J41=\"!...\",J41,IF(OR(AND(N40<>\"\",K40=\"\",K40<>E44),AND(N40<>\"\",K40<>\"\",K40=E44),AND(N40<>\"\",K40<>\"\",K40<>DISTANCE_Q,E44<>DISTANCE_Q)),\"ERR!\",\"\"))","v":""},{"$f":"IF(K41=\"!...\",K41,IF(OR(AND(N40<>\"\",L40=\"\",L40<>F44),AND(N40<>\"\",L40<>\"\",L40=F44),AND(N40<>\"\",L40<>\"\",L40<>DISTANCE_Q,F44<>DISTANCE_Q)),\"ERR!\",\"\"))","v":""},{"$f":"IF(L41=\"!...\",L41,IF(OR(AND(N40<>\"\",M40=\"\",M40<>G44),AND(N40<>\"\",M40<>\"\",M40=G44),AND(N40<>\"\",M40<>\"\",M40<>DISTANCE_Q,G44<>DISTANCE_Q)),\"ERR!\",\"\"))","v":""},{"$f":"IF(N40=\"\",\"\",IF(N40=\"G\",(NB_SETS_G_Q*2)-1-COUNTIF(C44:G44,DISTANCE_Q),COUNTIF(I40:M40,DISTANCE_Q)))","v":""},{"$f":"IF(OR(COUNTIF(O40:S40,\"\")<>COUNTIF(C48:G48,\"\"),AND(T40=\"\",SUM(O40:S40)<>0)),\"!...\",IF(OR(AND(T40<>\"\",O40=\"\",O40<>C48),AND(T40<>\"\",O40<>\"\",O40=C48),AND(T40<>\"\",O40<>\"\",O40<>DISTANCE_Q,C48<>DISTANCE_Q)),\"ERR!\",\"\"))","v":""},{"$f":"IF(O41=\"!...\",O41,IF(OR(AND(T40<>\"\",P40=\"\",P40<>D48),AND(T40<>\"\",P40<>\"\",P40=D48),AND(T40<>\"\",P40<>\"\",P40<>DISTANCE_Q,D48<>DISTANCE_Q)),\"ERR!\",\"\"))","v":""},{"$f":"IF(P41=\"!...\",P41,IF(OR(AND(T40<>\"\",Q40=\"\",Q40<>E48),AND(T40<>\"\",Q40<>\"\",Q40=E48),AND(T40<>\"\",Q40<>\"\",Q40<>DISTANCE_Q,E48<>DISTANCE_Q)),\"ERR!\",\"\"))","v":""},{"$f":"IF(Q41=\"!...\",Q41,IF(OR(AND(T40<>\"\",R40=\"\",R40<>F48),AND(T40<>\"\",R40<>\"\",R40=F48),AND(T40<>\"\",R40<>\"\",R40<>DISTANCE_Q,F48<>DISTANCE_Q)),\"ERR!\",\"\"))","v":""},{"$f":"IF(R41=\"!...\",R41,IF(OR(AND(T40<>\"\",S40=\"\",S40<>G48),AND(T40<>\"\",S40<>\"\",S40=G48),AND(T40<>\"\",S40<>\"\",S40<>DISTANCE_Q,G48<>DISTANCE_Q)),\"ERR!\",\"\"))","v":""},{"$f":"IF(T40=\"\",\"\",IF(T40=\"G\",(NB_SETS_G_Q*2)-1-COUNTIF(C48:G48,DISTANCE_Q),COUNTIF(O40:S40,DISTANCE_Q)))","v":""},{"$f":"IF(OR(COUNTIF(U40:Y40,\"\")<>COUNTIF(C52:G52,\"\"),AND(Z40=\"\",SUM(U40:Y40)<>0)),\"!...\",IF(OR(AND(Z40<>\"\",U40=\"\",U40<>C52),AND(Z40<>\"\",U40<>\"\",U40=C52),AND(Z40<>\"\",U40<>\"\",U40<>DISTANCE_Q,C52<>DISTANCE_Q)),\"ERR!\",\"\"))","v":""},{"$f":"IF(U41=\"!...\",U41,IF(OR(AND(Z40<>\"\",V40=\"\",V40<>D52),AND(Z40<>\"\",V40<>\"\",V40=D52),AND(Z40<>\"\",V40<>\"\",V40<>DISTANCE_Q,D52<>DISTANCE_Q)),\"ERR!\",\"\"))","v":""},{"$f":"IF(V41=\"!...\",V41,IF(OR(AND(Z40<>\"\",W40=\"\",W40<>E52),AND(Z40<>\"\",W40<>\"\",W40=E52),AND(Z40<>\"\",W40<>\"\",W40<>DISTANCE_Q,E52<>DISTANCE_Q)),\"ERR!\",\"\"))","v":""},{"$f":"IF(W41=\"!...\",W41,IF(OR(AND(Z40<>\"\",X40=\"\",X40<>F52),AND(Z40<>\"\",X40<>\"\",X40=F52),AND(Z40<>\"\",X40<>\"\",X40<>DISTANCE_Q,F52<>DISTANCE_Q)),\"ERR!\",\"\"))","v":""},{"$f":"IF(X41=\"!...\",X41,IF(OR(AND(Z40<>\"\",Y40=\"\",Y40<>G52),AND(Z40<>\"\",Y40<>\"\",Y40=G52),AND(Z40<>\"\",Y40<>\"\",Y40<>DISTANCE_Q,G52<>DISTANCE_Q)),\"ERR!\",\"\"))","v":""},{"$f":"IF(Z40=\"\",\"\",IF(Z40=\"G\",(NB_SETS_G_Q*2)-1-COUNTIF(C52:G52,DISTANCE_Q),COUNTIF(U40:Y40,DISTANCE_Q)))","v":""},{"$f":"IF(OR(COUNTIF(AA40:AE40,\"\")<>COUNTIF(C56:G56,\"\"),AND(AF40=\"\",SUM(AA40:AE40)<>0)),\"!...\",IF(OR(AND(AF40<>\"\",AA40=\"\",AA40<>C56),AND(AF40<>\"\",AA40<>\"\",AA40=C56),AND(AF40<>\"\",AA40<>\"\",AA40<>DISTANCE_Q,C56<>DISTANCE_Q)),\"ERR!\",\"\"))","v":""},{"$f":"IF(AA41=\"!...\",AA41,IF(OR(AND(AF40<>\"\",AB40=\"\",AB40<>D56),AND(AF40<>\"\",AB40<>\"\",AB40=D56),AND(AF40<>\"\",AB40<>\"\",AB40<>DISTANCE_Q,D56<>DISTANCE_Q)),\"ERR!\",\"\"))","v":""},{"$f":"IF(AB41=\"!...\",AB41,IF(OR(AND(AF40<>\"\",AC40=\"\",AC40<>E56),AND(AF40<>\"\",AC40<>\"\",AC40=E56),AND(AF40<>\"\",AC40<>\"\",AC40<>DISTANCE_Q,E56<>DISTANCE_Q)),\"ERR!\",\"\"))","v":""},{"$f":"IF(AC41=\"!...\",AC41,IF(OR(AND(AF40<>\"\",AD40=\"\",AD40<>F56),AND(AF40<>\"\",AD40<>\"\",AD40=F56),AND(AF40<>\"\",AD40<>\"\",AD40<>DISTANCE_Q,F56<>DISTANCE_Q)),\"ERR!\",\"\"))","v":""},{"$f":"IF(AD41=\"!...\",AD41,IF(OR(AND(AF40<>\"\",AE40=\"\",AE40<>G56),AND(AF40<>\"\",AE40<>\"\",AE40=G56),AND(AF40<>\"\",AE40<>\"\",AE40<>DISTANCE_Q,G56<>DISTANCE_Q)),\"ERR!\",\"\"))","v":""},{"$f":"IF(AF40=\"\",\"\",IF(AF40=\"G\",(NB_SETS_G_Q*2)-1-COUNTIF(C56:G56,DISTANCE_Q),COUNTIF(AA40:AE40,DISTANCE_Q)))","v":""},{"$f":"IF(OR(COUNTIF(AG40:AK40,\"\")<>COUNTIF(C60:G60,\"\"),AND(AL40=\"\",SUM(AG40:AK40)<>0)),\"!...\",IF(OR(AND(AL40<>\"\",AG40=\"\",AG40<>C60),AND(AL40<>\"\",AG40<>\"\",AG40=C60),AND(AL40<>\"\",AG40<>\"\",AG40<>DISTANCE_Q,C60<>DISTANCE_Q)),\"ERR!\",\"\"))","v":""},{"$f":"IF(AG41=\"!...\",AG41,IF(OR(AND(AL40<>\"\",AH40=\"\",AH40<>D60),AND(AL40<>\"\",AH40<>\"\",AH40=D60),AND(AL40<>\"\",AH40<>\"\",AH40<>DISTANCE_Q,D60<>DISTANCE_Q)),\"ERR!\",\"\"))","v":""},{"$f":"IF(AH41=\"!...\",AH41,IF(OR(AND(AL40<>\"\",AI40=\"\",AI40<>E60),AND(AL40<>\"\",AI40<>\"\",AI40=E60),AND(AL40<>\"\",AI40<>\"\",AI40<>DISTANCE_Q,E60<>DISTANCE_Q)),\"ERR!\",\"\"))","v":""},{"$f":"IF(AI41=\"!...\",AI41,IF(OR(AND(AL40<>\"\",AJ40=\"\",AJ40<>F60),AND(AL40<>\"\",AJ40<>\"\",AJ40=F60),AND(AL40<>\"\",AJ40<>\"\",AJ40<>DISTANCE_Q,F60<>DISTANCE_Q)),\"ERR!\",\"\"))","v":""},{"$f":"IF(AJ41=\"!...\",AJ41,IF(OR(AND(AL40<>\"\",AK40=\"\",AK40<>G60),AND(AL40<>\"\",AK40<>\"\",AK40=G60),AND(AL40<>\"\",AK40<>\"\",AK40<>DISTANCE_Q,G60<>DISTANCE_Q)),\"ERR!\",\"\"))","v":""},{"$f":"IF(AL40=\"\",\"\",IF(AL40=\"G\",(NB_SETS_G_Q*2)-1-COUNTIF(C60:G60,DISTANCE_Q),COUNTIF(AG40:AK40,DISTANCE_Q)))","v":""},{"$f":"IF(OR(COUNTIF(AM40:AQ40,\"\")<>COUNTIF(C64:G64,\"\"),AND(AR40=\"\",SUM(AM40:AQ40)<>0)),\"!...\",IF(OR(AND(AR40<>\"\",AM40=\"\",AM40<>C64),AND(AR40<>\"\",AM40<>\"\",AM40=C64),AND(AR40<>\"\",AM40<>\"\",AM40<>DISTANCE_Q,C64<>DISTANCE_Q)),\"ERR!\",\"\"))","v":""},{"$f":"IF(AM41=\"!...\",AM41,IF(OR(AND(AR40<>\"\",AN40=\"\",AN40<>D64),AND(AR40<>\"\",AN40<>\"\",AN40=D64),AND(AR40<>\"\",AN40<>\"\",AN40<>DISTANCE_Q,D64<>DISTANCE_Q)),\"ERR!\",\"\"))","v":""},{"$f":"IF(AN41=\"!...\",AN41,IF(OR(AND(AR40<>\"\",AO40=\"\",AO40<>E64),AND(AR40<>\"\",AO40<>\"\",AO40=E64),AND(AR40<>\"\",AO40<>\"\",AO40<>DISTANCE_Q,E64<>DISTANCE_Q)),\"ERR!\",\"\"))","v":""},{"$f":"IF(AO41=\"!...\",AO41,IF(OR(AND(AR40<>\"\",AP40=\"\",AP40<>F64),AND(AR40<>\"\",AP40<>\"\",AP40=F64),AND(AR40<>\"\",AP40<>\"\",AP40<>DISTANCE_Q,F64<>DISTANCE_Q)),\"ERR!\",\"\"))","v":""},{"$f":"IF(AP41=\"!...\",AP41,IF(OR(AND(AR40<>\"\",AQ40=\"\",AQ40<>G64),AND(AR40<>\"\",AQ40<>\"\",AQ40=G64),AND(AR40<>\"\",AQ40<>\"\",AQ40<>DISTANCE_Q,G64<>DISTANCE_Q)),\"ERR!\",\"\"))","v":""},{"$f":"IF(AR40=\"\",\"\",IF(AR40=\"G\",(NB_SETS_G_Q*2)-1-COUNTIF(C64:G64,DISTANCE_Q),COUNTIF(AM40:AQ40,DISTANCE_Q)))","v":""}]
[null,"Licence",null,null,null,null,null,"Moyenne",null,null,null,null,null,{"$f":"IF(N40=\"\",\"\",IF(SUM(C44:G44)<>0,ROUNDDOWN(SUM(I40:M40)/SUM(C44:G44),3),\"\"))","v":""},null,null,null,null,null,{"$f":"IF(T40=\"\",\"\",IF(SUM(C48:G48)<>0,ROUNDDOWN(SUM(O40:S40)/SUM(C48:G48),3),\"\"))","v":""},null,null,null,null,null,{"$f":"IF(Z40=\"\",\"\",IF(SUM(C52:G52)<>0,ROUNDDOWN(SUM(U40:Y40)/SUM(C52:G52),3),\"\"))","v":""},null,null,null,null,null,{"$f":"IF(AF40=\"\",\"\",IF(SUM(C56:G56)<>0,ROUNDDOWN(SUM(AA40:AE40)/SUM(C56:G56),3),\"\"))","v":""},null,null,null,null,null,{"$f":"IF(AL40=\"\",\"\",IF(SUM(C60:G60)<>0,ROUNDDOWN(SUM(AG40:AK40)/SUM(C60:G60),3),\"\"))","v":""},null,null,null,null,null,{"$f":"IF(AR40=\"\",\"\",IF(SUM(C64:G64)<>0,ROUNDDOWN(SUM(AM40:AQ40)/SUM(C64:G64),3),\"\"))","v":""}]
[null,"Joueur 2","set 1","set 2","set 3","set 4","set 5","J1-J2",null,null,null,null,null,null,"set 1","set 2","set 3","set 4","set 5","J2-J3","set 1","set 2","set 3","set 4","set 5","J2-J4","set 1","set 2","set 3","set 4","set 5","J2-J5","set 1","set 2","set 3","set 4","set 5","J2-J6","set 1","set 2","set 3","set 4","set 5","J2-J7",null,null,null,null,null,null,null,{"$f":"IF(BH43<>\"\",RANK(BH43,BH39:BH66),\"\")","v":""},{"$f":"IF(TYPE_QUALIF=\"Poules 8J\",(COUNTIF(H44:AR44,\"G\")*VAL_PT_MATCH)+VAL_PT_MATCH,COUNTIF(H44:AR44,\"G\")*VAL_PT_MATCH)","v":0},{"$f":"IF(TYPE_QUALIF=\"Poules 8J\",(NB_SETS_G_Q*2-1)+SUM(AR45,AL45,AF45,Z45,T45,H45),SUM(AR45,AL45,AF45,Z45,T45,H45))","v":0},{"$f":"IF(BF43<>0,ROUNDDOWN(BE43/BF43,3),\"\")","v":""},{"$f":"MAX(H46,T46,Z46,AF46,AL46,AR46)","v":0},{"$f":"SUM(C44:G44,O44:S44,U44:Y44,AA44:AE44,AG44:AK44,AM44:AQ44)","v":0},{"$f":"SUM(I48:M48,I52:M52,I56:M56,I60:M60,I64:M64,I40:M40)","v":0},null,{"$f":"IF(BC43<>\"\",(BA43*10000000)+(BB43*100000)+(BC43*10000)+BD43,\"\")","v":""}]
[null,"Nom & Prénom",null,null,null,null,null,{"$f":"IF(COUNTIF(C44:G44,DISTANCE_Q)=NB_SETS_G_Q,\"G\",IF(COUNTIF(I40:M40,DISTANCE_Q)=NB_SETS_G_Q,\"P\",\"\"))","v":""},null,null,null,null,null,null,null,null,null,null,null,{"$f":"IF(COUNTIF(O44:S44,DISTANCE_Q)=NB_SETS_G_Q,\"G\",IF(COUNTIF(I48:M48,DISTANCE_Q)=NB_SETS_G_Q,\"P\",\"\"))","v":""},null,null,null,null,null,{"$f":"IF(COUNTIF(U44:Y44,DISTANCE_Q)=NB_SETS_G_Q,\"G\",IF(COUNTIF(I52:M52,DISTANCE_Q)=NB_SETS_G_Q,\"P\",\"\"))","v":""},null,null,null,null,null,{"$f":"IF(COUNTIF(AA44:AE44,DISTANCE_Q)=NB_SETS_G_Q,\"G\",IF(COUNTIF(I56:M56,DISTANCE_Q)=NB_SETS_G_Q,\"P\",\"\"))","v":""},null,null,null,null,null,{"$f":"IF(COUNTIF(AG44:AK44,DISTANCE_Q)=NB_SETS_G_Q,\"G\",IF(COUNTIF(I60:M60,DISTANCE_Q)=NB_SETS_G_Q,\"P\",\"\"))","v":""},null,null,null,null,null,{"$f":"IF(COUNTIF(AM44:AQ44,DISTANCE_Q)=NB_SETS_G_Q,\"G\",IF(COUNTIF(I64:M64,DISTANCE_Q)=NB_SETS_G_Q,\"P\",\"\"))","v":""}]
[null,"Ville ou Club",{"$f":"IF(OR(COUNTIF(C44:G44,\"\")<>COUNTIF(I40:M40,\"\"),AND(H44=\"\",SUM(C44:G44)<>0)),\"!...\",IF(OR(AND(H44<>\"\",C44=\"\",C44<>I40),AND(H44<>\"\",C44<>\"\",C44=I40),AND(H44<>\"\",C44<>\"\",C44<>DISTANCE_Q,I40<>DISTANCE_Q)),\"ERR!\",\"\"))","v":""},{"$f":"IF(C45=\"!...\",C45,IF(OR(AND(H44<>\"\",D44=\"\",D44<>J40),AND(H44<>\"\",D44<>\"\",D44=J40),AND(H44<>\"\",D44<>\"\",D44<>DISTANCE_Q,J40<>DISTANCE_Q)),\"ERR!\",\"\"))","v":""},{"$f":"IF(D45=\"!...\",D45,IF(OR(AND(H44<>\"\",E44=\"\",E44<>K40),AND(H44<>\"\",E44<>\"\",E44=K40),AND(H44<>\"\",E44<>\"\",E44<>DISTANCE_Q,K40<>DISTANCE_Q)),\"ERR!\",\"\"))","v":""},{"$f":"IF(E45=\"!...\",E45,IF(OR(AND(H44<>\"\",F44=\"\",F44<>L40),AND(H44<>\"\",F44<>\"\",F44=L40),AND(H44<>\"\",F44<>\"\",F44<>DISTANCE_Q,L40<>DISTANCE_Q)),\"ERR!\",\"\"))","v":""},{"$f":"IF(F45=\"!...\",F45,IF(OR(AND(H44<>\"\",G44=\"\",G44<>M40),AND(H44<>\"\",G44<>\"\",G44=M40),AND(H44<>\"\",G44<>\"\",G44<>DISTANCE_Q,M40<>DISTANCE_Q)),\"ERR!\",\"\"))","v":""},{"$f":"IF(H44=\"\",\"\",IF(H44=\"G\",(NB_SETS_G_Q*2)-1-COUNTIF(I40:M40,DISTANCE_Q),COUNTIF(C44:G44,DISTANCE_Q)))","v":""},null,null,null,null,null,null,{"$f":"IF(OR(COUNTIF(O44:S44,\"\")<>COUNTIF(I48:M48,\"\"),AND(T44=\"\",SUM(O44:S44)<>0)),\"!...\",IF(OR(AND(T44<>\"\",O44=\"\",O44<>I48),AND(T44<>\"\",O44<>\"\",O44=I48),AND(T44<>\"\",O44<>\"\",O44<>DISTANCE_Q,I48<>DISTANCE_Q)),\"ERR!\",\"\"))","v":""},{"$f":"IF(O45=\"!...\",O45,IF(OR(AND(T44<>\"\",P44=\"\",P44<>J48),AND(T44<>\"\",P44<>\"\",P44=J48),AND(T44<>\"\",P44<>\"\",P44<>DISTANCE_Q,J48<>DISTANCE_Q)),\"ERR!\",\"\"))","v":""},{"$f":"IF(P45=\"!...\",P45,IF(OR(AND(T44<>\"\",Q44=\"\",Q44<>K48),AND(T44<>\"\",Q44<>\"\",Q44=K48),AND(T44<>\"\",Q44<>\"\",Q44<>DISTANCE_Q,K48<>DISTANCE_Q)),\"ERR!\",\"\"))","v":""},{"$f":"IF(Q45=\"!...\",Q45,IF(OR(AND(T44<>\"\",R44=\"\",R44<>L48),AND(T44<>\"\",R44<>\"\",R44=L48),AND(T44<>\"\",R44<>\"\",R44<>DISTANCE_Q,L48<>DISTANCE_Q)),\"ERR!\",\"\"))","v":""},{"$f":"IF(R45=\"!...\",R45,IF(OR(AND(T44<>\"\",S44=\"\",S44<>M48),AND(T44<>\"\",S44<>\"\",S44=M48),AND(T44<>\"\",S44<>\"\",S44<>DISTANCE_Q,M48<>DISTANCE_Q)),\"ERR!\",\"\"))","v":""},{"$f":"IF(T44=\"\",\"\",IF(T44=\"G\",(NB_SETS_G_Q*2)-1-COUNTIF(I48:M48,DISTANCE_Q),COUNTIF(O44:S44,DISTANCE_Q)))","v":""},{"$f":"IF(OR(COUNTIF(U44:Y44,\"\")<>COUNTIF(I52:M52,\"\"),AND(Z44=\"\",SUM(U44:Y44)<>0)),\"!...\",IF(OR(AND(Z44<>\"\",U44=\"\",U44<>I52),AND(Z44<>\"\",U44<>\"\",U44=I52),AND(Z44<>\"\",U44<>\"\",U44<>DISTANCE_Q,I52<>DISTANCE_Q)),\"ERR!\",\"\"))","v":""},{"$f":"IF(U45=\"!...\",U45,IF(OR(AND(Z44<>\"\",V44=\"\",V44<>J52),AND(Z44<>\"\",V44<>\"\",V44=J52),AND(Z44<>\"\",V44<>\"\",V44<>DISTANCE_Q,J52<>DISTANCE_Q)),\"ERR!\",\"\"))","v":""},{"$f":"IF(V45=\"!...\",V45,IF(OR(AND(Z44<>\"\",W44=\"\",W44<>K52),AND(Z44<>\"\",W44<>\"\",W44=K52),AND(Z44<>\"\",W44<>\"\",W44<>DISTANCE_Q,K52<>DISTANCE_Q)),\"ERR!\",\"\"))","v":""},{"$f":"IF(W45=\"!...\",W45,IF(OR(AND(Z44<>\"\",X44=\"\",X44<>L52),AND(Z44<>\"\",X44<>\"\",X44=L52),AND(Z44<>\"\",X44<>\"\",X44<>DISTANCE_Q,L52<>DISTANCE_Q)),\"ERR!\",\"\"))","v":""},{"$f":"IF(X45=\"!...\",X45,IF(OR(AND(Z44<>\"\",Y44=\"\",Y44<>M52),AND(Z44<>\"\",Y44<>\"\",Y44=M52),AND(Z44<>\"\",Y44<>\"\",Y44<>DISTANCE_Q,M52<>DISTANCE_Q)),\"ERR!\",\"\"))","v":""},{"$f":"IF(Z44=\"\",\"\",IF(Z44=\"G\",(NB_SETS_G_Q*2)-1-COUNTIF(I52:M52,DISTANCE_Q),COUNTIF(U44:Y44,DISTANCE_Q)))","v":""},{"$f":"IF(OR(COUNTIF(AA44:AE44,\"\")<>COUNTIF(I56:M56,\"\"),AND(AF44=\"\",SUM(AA44:AE44)<>0)),\"!...\",IF(OR(AND(AF44<>\"\",AA44=\"\",AA44<>I56),AND(AF44<>\"\",AA44<>\"\",AA44=I56),AND(AF44<>\"\",AA44<>\"\",AA44<>DISTANCE_Q,I56<>DISTANCE_Q)),\"ERR!\",\"\"))","v":""},{"$f":"IF(AA45=\"!...\",AA45,IF(OR(AND(AF44<>\"\",AB44=\"\",AB44<>J56),AND(AF44<>\"\",AB44<>\"\",AB44=J56),AND(AF44<>\"\",AB44<>\"\",AB44<>DISTANCE_Q,J56<>DISTANCE_Q)),\"ERR!\",\"\"))","v":""},{"$f":"IF(AB45=\"!...\",AB45,IF(OR(AND(AF44<>\"\",AC44=\"\",AC44<>K56),AND(AF44<>\"\",AC44<>\"\",AC44=K56),AND(AF44<>\"\",AC44<>\"\",AC44<>DISTANCE_Q,K56<>DISTANCE_Q)),\"ERR!\",\"\"))","v":""},{"$f":"IF(AC45=\"!...\",AC45,IF(OR(AND(AF44<>\"\",AD44=\"\",AD44<>L56),AND(AF44<>\"\",AD44<>\"\",AD44=L56),AND(AF44<>\"\",AD44<>\"\",AD44<>DISTANCE_Q,L56<>DISTANCE_Q)),\"ERR!\",\"\"))","v":""},{"$f":"IF(AD45=\"!...\",AD45,IF(OR(AND(AF44<>\"\",AE44=\"\",AE44<>M56),AND(AF44<>\"\",AE44<>\"\",AE44=M56),AND(AF44<>\"\",AE44<>\"\",AE44<>DISTANCE_Q,M56<>DISTANCE_Q)),\"ERR!\",\"\"))","v":""},{"$f":"IF(AF44=\"\",\"\",IF(AF44=\"G\",(NB_SETS_G_Q*2)-1-COUNTIF(I56:M56,DISTANCE_Q),COUNTIF(AA44:AE44,DISTANCE_Q)))","v":""},{"$f":"IF(OR(COUNTIF(AG44:AK44,\"\")<>COUNTIF(I60:M60,\"\"),AND(AL44=\"\",SUM(AG44:AK44)<>0)),\"!...\",IF(OR(AND(AL44<>\"\",AG44=\"\",AG44<>I60),AND(AL44<>\"\",AG44<>\"\",AG44=I60),AND(AL44<>\"\",AG44<>\"\",AG44<>DISTANCE_Q,I60<>DISTANCE_Q)),\"ERR!\",\"\"))","v":""},{"$f":"IF(AG45=\"!...\",AG45,IF(OR(AND(AL44<>\"\",AH44=\"\",AH44<>J60),AND(AL44<>\"\",AH44<>\"\",AH44=J60),AND(AL44<>\"\",AH44<>\"\",AH44<>DISTANCE_Q,J60<>DISTANCE_Q)),\"ERR!\",\"\"))","v":""},{"$f":"IF(AH45=\"!...\",AH45,IF(OR(AND(AL44<>\"\",AI44=\"\",AI44<>K60),AND(AL44<>\"\",AI44<>\"\",AI44=K60),AND(AL44<>\"\",AI44<>\"\",AI44<>DISTANCE_Q,K60<>DISTANCE_Q)),\"ERR!\",\"\"))","v":""},{"$f":"IF(AI45=\"!...\",AI45,IF(OR(AND(AL44<>\"\",AJ44=\"\",AJ44<>L60),AND(AL44<>\"\",AJ44<>\"\",AJ44=L60),AND(AL44<>\"\",AJ44<>\"\",AJ44<>DISTANCE_Q,L60<>DISTANCE_Q)),\"ERR!\",\"\"))","v":""},{"$f":"IF(AJ45=\"!...\",AJ45,IF(OR(AND(AL44<>\"\",AK44=\"\",AK44<>M60),AND(AL44<>\"\",AK44<>\"\",AK44=M60),AND(AL44<>\"\",AK44<>\"\",AK44<>DISTANCE_Q,M60<>DISTANCE_Q)),\"ERR!\",\"\"))","v":""},{"$f":"IF(AL44=\"\",\"\",IF(AL44=\"G\",(NB_SETS_G_Q*2)-1-COUNTIF(I60:M60,DISTANCE_Q),COUNTIF(AG44:AK44,DISTANCE_Q)))","v":""},{"$f":"IF(OR(COUNTIF(AM44:AQ44,\"\")<>COUNTIF(I64:M64,\"\"),AND(AR44=\"\",SUM(AM44:AQ44)<>0)),\"!...\",IF(OR(AND(AR44<>\"\",AM44=\"\",AM44<>I64),AND(AR44<>\"\",AM44<>\"\",AM44=I64),AND(AR44<>\"\",AM44<>\"\",AM44<>DISTANCE_Q,I64<>DISTANCE_Q)),\"ERR!\",\"\"))","v":""},{"$f":"IF(AM45=\"!...\",AM45,IF(OR(AND(AR44<>\"\",AN44=\"\",AN44<>J64),AND(AR44<>\"\",AN44<>\"\",AN44=J64),AND(AR44<>\"\",AN44<>\"\",AN44<>DISTANCE_Q,J64<>DISTANCE_Q)),\"ERR!\",\"\"))","v":""},{"$f":"IF(AN45=\"!...\",AN45,IF(OR(AND(AR44<>\"\",AO44=\"\",AO44<>K64),AND(AR44<>\"\",AO44<>\"\",AO44=K64),AND(AR44<>\"\",AO44<>\"\",AO44<>DISTANCE_Q,K64<>DISTANCE_Q)),\"ERR!\",\"\"))","v":""},{"$f":"IF(AO45=\"!...\",AO45,IF(OR(AND(AR44<>\"\",AP44=\"\",AP44<>L64),AND(AR44<>\"\",AP44<>\"\",AP44=L64),AND(AR44<>\"\",AP44<>\"\",AP44<>DISTANCE_Q,L64<>DISTANCE_Q)),\"ERR!\",\"\"))","v":""},{"$f":"IF(AP45=\"!...\",AP45,IF(OR(AND(AR44<>\"\",AQ44=\"\",AQ44<>M64),AND(AR44<>\"\",AQ44<>\"\",AQ44=M64),AND(AR44<>\"\",AQ44<>\"\",AQ44<>DISTANCE_Q,M64<>DISTANCE_Q)),\"ERR!\",\"\"))","v":""},{"$f":"IF(AR44=\"\",\"\",IF(AR44=\"G\",(NB_SETS_G_Q*2)-1-COUNTIF(I64:M64,DISTANCE_Q),COUNTIF(AM44:AQ44,DISTANCE_Q)))","v":""}]
[null,"Licence",null,null,null,null,null,{"$f":"IF(H44=\"\",\"\",IF(SUM(I40:M40)<>0,ROUNDDOWN(SUM(C44:G44)/SUM(I40:M40),3),\"\"))","v":""},null,null,null,null,null,null,null,null,null,null,null,{"$f":"IF(T44=\"\",\"\",IF(SUM(I48:M48)<>0,ROUNDDOWN(SUM(O44:S44)/SUM(I48:M48),3),\"\"))","v":""},null,null,null,null,null,{"$f":"IF(Z44=\"\",\"\",IF(SUM(I52:M52)<>0,ROUNDDOWN(SUM(U44:Y44)/SUM(I52:M52),3),\"\"))","v":""},null,null,null,null,null,{"$f":"IF(AF44=\"\",\"\",IF(SUM(I56:M56)<>0,ROUNDDOWN(SUM(AA44:AE44)/SUM(I56:M56),3),\"\"))","v":""},null,null,null,null,null,{"$f":"IF(AL44=\"\",\"\",IF(SUM(I60:M60)<>0,ROUNDDOWN(SUM(AG44:AK44)/SUM(I60:M60),3),\"\"))","v":""},null,null,null,null,null,{"$f":"IF(AR44=\"\",\"\",IF(SUM(I64:M64)<>0,ROUNDDOWN(SUM(AM44:AQ44)/SUM(I64:M64),3),\"\"))","v":""}]
[null,"Joueur 3","set 1","set 2","set 3","set 4","set 5","J1-J3","set 1","set 2","set 3","set 4","set 5","J2-J3",null,null,null,null,null,null,"set 1","set 2","set 3","set 4","set 5","J3-J4","set 1","set 2","set 3","set 4","set 5","J3-J5","set 1","set 2","set 3","set 4","set 5","J3-J6","set 1","set 2","set 3","set 4","set 5","J3-J7",null,null,null,null,null,null,null,{"$f":"IF(BH47<>\"\",RANK(BH47,BH39:BH66),\"\")","v":""},{"$f":"IF(TYPE_QUALIF=\"Poules 8J\",(COUNTIF(H48:AR48,\"G\")*VAL_PT_MATCH)+VAL_PT_MATCH,COUNTIF(H48:AR48,\"G\")*VAL_PT_MATCH)","v":0},{"$f":"IF(TYPE_QUALIF=\"Poules 8J\",(NB_SETS_G_Q*2-1)+SUM(AR49,AL49,AF49,Z49,H49,N49),SUM(AR49,AL49,AF49,Z49,H49,N49))","v":0},{"$f":"IF(BF47<>0,ROUNDDOWN(BE47/BF47,3),\"\")","v":""},{"$f":"MAX(N50,H50,Z50,AF50,AL50,AR50)","v":0},{"$f":"SUM(I48:M48,C48:G48,U48:Y48,AA48:AE48,AG48:AK48,AM48:AQ48)","v":0},{"$f":"SUM(O52:S52,O56:S56,O60:S60,O64:S64,O44:S44,O40:S40)","v":0},null,{"$f":"IF(BC47<>\"\",(BA47*10000000)+(BB47*100000)+(BC47*10000)+BD47,\"\")","v":""}]
[null,"Nom & Prénom",null,null,null,null,null,{"$f":"IF(COUNTIF(C48:G48,DISTANCE_Q)=NB_SETS_G_Q,\"G\",IF(COUNTIF(O40:S40,DISTANCE_Q)=NB_SETS_G_Q,\"P\",\"\"))","v":""},null,null,null,null,null,{"$f":"IF(COUNTIF(I48:M48,DISTANCE_Q)=NB_SETS_G_Q,\"G\",IF(COUNTIF(O44:S44,DISTANCE_Q)=NB_SETS_G_Q,\"P\",\"\"))","v":""},null,null,null,null,null,null,null,null,null,null,null,{"$f":"IF(COUNTIF(U48:Y48,DISTANCE_Q)=NB_SETS_G_Q,\"G\",IF(COUNTIF(O52:S52,DISTANCE_Q)=NB_SETS_G_Q,\"P\",\"\"))","v":""},null,null,null,null,null,{"$f":"IF(COUNTIF(AA48:AE48,DISTANCE_Q)=NB_SETS_G_Q,\"G\",IF(COUNTIF(O56:S56,DISTANCE_Q)=NB_SETS_G_Q,\"P\",\"\"))","v":""},null,null,null,null,null,{"$f":"IF(COUNTIF(AG48:AK48,DISTANCE_Q)=NB_SETS_G_Q,\"G\",IF(COUNTIF(O60:S60,DISTANCE_Q)=NB_SETS_G_Q,\"P\",\"\"))","v":""},null,null,null,null,null,{"$f":"IF(COUNTIF(AM48:AQ48,DISTANCE_Q)=NB_SETS_G_Q,\"G\",IF(COUNTIF(O64:S64,DISTANCE_Q)=NB_SETS_G_Q,\"P\",\"\"))","v":""}]
[null,"Ville ou Club",{"$f":"IF(OR(COUNTIF(C48:G48,\"\")<>COUNTIF(O40:S40,\"\"),AND(H48=\"\",SUM(C48:G48)<>0)),\"!...\",IF(OR(AND(H48<>\"\",C48=\"\",C48<>O40),AND(H48<>\"\",C48<>\"\",C48=O40),AND(H48<>\"\",C48<>\"\",C48<>DISTANCE_Q,O40<>DISTANCE_Q)),\"ERR!\",\"\"))","v":""},{"$f":"IF(C49=\"!...\",C49,IF(OR(AND(H48<>\"\",D48=\"\",D48<>P40),AND(H48<>\"\",D48<>\"\",D48=P40),AND(H48<>\"\",D48<>\"\",D48<>DISTANCE_Q,P40<>DISTANCE_Q)),\"ERR!\",\"\"))","v":""},{"$f":"IF(D49=\"!...\",D49,IF(OR(AND(H48<>\"\",E48=\"\",E48<>Q40),AND(H48<>\"\",E48<>\"\",E48=Q40),AND(H48<>\"\",E48<>\"\",E48<>DISTANCE_Q,Q40<>DISTANCE_Q)),\"ERR!\",\"\"))","v":""},{"$f":"IF(E49=\"!...\",E49,IF(OR(AND(H48<>\"\",F48=\"\",F48<>R40),AND(H48<>\"\",F48<>\"\",F48=R40),AND(H48<>\"\",F48<>\"\",F48<>DISTANCE_Q,R40<>DISTANCE_Q)),\"ERR!\",\"\"))","v":""},{"$f":"IF(F49=\"!...\",F49,IF(OR(AND(H48<>\"\",G48=\"\",G48<>S40),AND(H48<>\"\",G48<>\"\",G48=S40),AND(H48<>\"\",G48<>\"\",G48<>DISTANCE_Q,S40<>DISTANCE_Q)),\"ERR!\",\"\"))","v":""},{"$f":"IF(H48=\"\",\"\",IF(H48=\"G\",(NB_SETS_G_Q*2)-1-COUNTIF(O40:S40,DISTANCE_Q),COUNTIF(C48:G48,DISTANCE_Q)))","v":""},{"$f":"IF(OR(COUNTIF(I48:M48,\"\")<>COUNTIF(O44:S44,\"\"),AND(N48=\"\",SUM(I48:M48)<>0)),\"!...\",IF(OR(AND(N48<>\"\",I48=\"\",I48<>O44),AND(N48<>\"\",I48<>\"\",I48=O44),AND(N48<>\"\",I48<>\"\",I48<>DISTANCE_Q,O44<>DISTANCE_Q)),\"ERR!\",\"\"))","v":""},{"$f":"IF(I49=\"!...\",I49,IF(OR(AND(N48<>\"\",J48=\"\",J48<>P44),AND(N48<>\"\",J48<>\"\",J48=P44),AND(N48<>\"\",J48<>\"\",J48<>DISTANCE_Q,P44<>DISTANCE_Q)),\"ERR!\",\"\"))","v":""},{"$f":"IF(J49=\"!...\",J49,IF(OR(AND(N48<>\"\",K48=\"\",K48<>Q44),AND(N48<>\"\",K48<>\"\",K48=Q44),AND(N48<>\"\",K48<>\"\",K48<>DISTANCE_Q,Q44<>DISTANCE_Q)),\"ERR!\",\"\"))","v":""},{"$f":"IF(K49=\"!...\",K49,IF(OR(AND(N48<>\"\",L48=\"\",L48<>R44),AND(N48<>\"\",L48<>\"\",L48=R44),AND(N48<>\"\",L48<>\"\",L48<>DISTANCE_Q,R44<>DISTANCE_Q)),\"ERR!\",\"\"))","v":""},{"$f":"IF(L49=\"!...\",L49,IF(OR(AND(N48<>\"\",M48=\"\",M48<>S44),AND(N48<>\"\",M48<>\"\",M48=S44),AND(N48<>\"\",M48<>\"\",M48<>DISTANCE_Q,S44<>DISTANCE_Q)),\"ERR!\",\"\"))","v":""},{"$f":"IF(N48=\"\",\"\",IF(N48=\"G\",(NB_SETS_G_Q*2)-1-COUNTIF(O44:S44,DISTANCE_Q),COUNTIF(I48:M48,DISTANCE_Q)))","v":""},null,null,null,null,null,null,{"$f":"IF(OR(COUNTIF(U48:Y48,\"\")<>COUNTIF(O52:S52,\"\"),AND(Z48=\"\",SUM(U48:Y48)<>0)),\"!...\",IF(OR(AND(Z48<>\"\",U48=\"\",U48<>O52),AND(Z48<>\"\",U48<>\"\",U48=O52),AND(Z48<>\"\",U48<>\"\",U48<>DISTANCE_Q,O52<>DISTANCE_Q)),\"ERR!\",\"\"))","v":""},{"$f":"IF(U49=\"!...\",U49,IF(OR(AND(Z48<>\"\",V48=\"\",V48<>P52),AND(Z48<>\"\",V48<>\"\",V48=P52),AND(Z48<>\"\",V48<>\"\",V48<>DISTANCE_Q,P52<>DISTANCE_Q)),\"ERR!\",\"\"))","v":""},{"$f":"IF(V49=\"!...\",V49,IF(OR(AND(Z48<>\"\",W48=\"\",W48<>Q52),AND(Z48<>\"\",W48<>\"\",W48=Q52),AND(Z48<>\"\",W48<>\"\",W48<>DISTANCE_Q,Q52<>DISTANCE_Q)),\"ERR!\",\"\"))","v":""},{"$f":"IF(W49=\"!...\",W49,IF(OR(AND(Z48<>\"\",X48=\"\",X48<>R52),AND(Z48<>\"\",X48<>\"\",X48=R52),AND(Z48<>\"\",X48<>\"\",X48<>DISTANCE_Q,R52<>DISTANCE_Q)),\"ERR!\",\"\"))","v":""},{"$f":"IF(X49=\"!...\",X49,IF(OR(AND(Z48<>\"\",Y48=\"\",Y48<>S52),AND(Z48<>\"\",Y48<>\"\",Y48=S52),AND(Z48<>\"\",Y48<>\"\",Y48<>DISTANCE_Q,S52<>DISTANCE_Q)),\"ERR!\",\"\"))","v":""},{"$f":"IF(Z48=\"\",\"\",IF(Z48=\"G\",(NB_SETS_G_Q*2)-1-COUNTIF(O52:S52,DISTANCE_Q),COUNTIF(U48:Y48,DISTANCE_Q)))","v":""},{"$f":"IF(OR(COUNTIF(AA48:AE48,\"\")<>COUNTIF(O56:S56,\"\"),AND(AF48=\"\",SUM(AA48:AE48)<>0)),\"!...\",IF(OR(AND(AF48<>\"\",AA48=\"\",AA48<>O56),AND(AF48<>\"\",AA48<>\"\",AA48=O56),AND(AF48<>\"\",AA48<>\"\",AA48<>DISTANCE_Q,O56<>DISTANCE_Q)),\"ERR!\",\"\"))","v":""},{"$f":"IF(AA49=\"!...\",AA49,IF(OR(AND(AF48<>\"\",AB48=\"\",AB48<>P56),AND(AF48<>\"\",AB48<>\"\",AB48=P56),AND(AF48<>\"\",AB48<>\"\",AB48<>DISTANCE_Q,P56<>DISTANCE_Q)),\"ERR!\",\"\"))","v":""},{"$f":"IF(AB49=\"!...\",AB49,IF(OR(AND(AF48<>\"\",AC48=\"\",AC48<>Q56),AND(AF48<>\"\",AC48<>\"\",AC48=Q56),AND(AF48<>\"\",AC48<>\"\",AC48<>DISTANCE_Q,Q56<>DISTANCE_Q)),\"ERR!\",\"\"))","v":""},{"$f":"IF(AC49=\"!...\",AC49,IF(OR(AND(AF48<>\"\",AD48=\"\",AD48<>R56),AND(AF48<>\"\",AD48<>\"\",AD48=R56),AND(AF48<>\"\",AD48<>\"\",AD48<>DISTANCE_Q,R56<>DISTANCE_Q)),\"ERR!\",\"\"))","v":""},{"$f":"IF(AD49=\"!...\",AD49,IF(OR(AND(AF48<>\"\",AE48=\"\",AE48<>S56),AND(AF48<>\"\",AE48<>\"\",AE48=S56),AND(AF48<>\"\",AE48<>\"\",AE48<>DISTANCE_Q,S56<>DISTANCE_Q)),\"ERR!\",\"\"))","v":""},{"$f":"IF(AF48=\"\",\"\",IF(AF48=\"G\",(NB_SETS_G_Q*2)-1-COUNTIF(O56:S56,DISTANCE_Q),COUNTIF(AA48:AE48,DISTANCE_Q)))","v":""},{"$f":"IF(OR(COUNTIF(AG48:AK48,\"\")<>COUNTIF(O60:S60,\"\"),AND(AL48=\"\",SUM(AG48:AK48)<>0)),\"!...\",IF(OR(AND(AL48<>\"\",AG48=\"\",AG48<>O60),AND(AL48<>\"\",AG48<>\"\",AG48=O60),AND(AL48<>\"\",AG48<>\"\",AG48<>DISTANCE_Q,O60<>DISTANCE_Q)),\"ERR!\",\"\"))","v":""},{"$f":"IF(AG49=\"!...\",AG49,IF(OR(AND(AL48<>\"\",AH48=\"\",AH48<>P60),AND(AL48<>\"\",AH48<>\"\",AH48=P60),AND(AL48<>\"\",AH48<>\"\",AH48<>DISTANCE_Q,P60<>DISTANCE_Q)),\"ERR!\",\"\"))","v":""},{"$f":"IF(AH49=\"!...\",AH49,IF(OR(AND(AL48<>\"\",AI48=\"\",AI48<>Q60),AND(AL48<>\"\",AI48<>\"\",AI48=Q60),AND(AL48<>\"\",AI48<>\"\",AI48<>DISTANCE_Q,Q60<>DISTANCE_Q)),\"ERR!\",\"\"))","v":""},{"$f":"IF(AI49=\"!...\",AI49,IF(OR(AND(AL48<>\"\",AJ48=\"\",AJ48<>R60),AND(AL48<>\"\",AJ48<>\"\",AJ48=R60),AND(AL48<>\"\",AJ48<>\"\",AJ48<>DISTANCE_Q,R60<>DISTANCE_Q)),\"ERR!\",\"\"))","v":""},{"$f":"IF(AJ49=\"!...\",AJ49,IF(OR(AND(AL48<>\"\",AK48=\"\",AK48<>S60),AND(AL48<>\"\",AK48<>\"\",AK48=S60),AND(AL48<>\"\",AK48<>\"\",AK48<>DISTANCE_Q,S60<>DISTANCE_Q)),\"ERR!\",\"\"))","v":""},{"$f":"IF(AL48=\"\",\"\",IF(AL48=\"G\",(NB_SETS_G_Q*2)-1-COUNTIF(O60:S60,DISTANCE_Q),COUNTIF(AG48:AK48,DISTANCE_Q)))","v":""},{"$f":"IF(OR(COUNTIF(AM48:AQ48,\"\")<>COUNTIF(O64:S64,\"\"),AND(AR48=\"\",SUM(AM48:AQ48)<>0)),\"!...\",IF(OR(AND(AR48<>\"\",AM48=\"\",AM48<>O64),AND(AR48<>\"\",AM48<>\"\",AM48=O64),AND(AR48<>\"\",AM48<>\"\",AM48<>DISTANCE_Q,O64<>DISTANCE_Q)),\"ERR!\",\"\"))","v":""},{"$f":"IF(AM49=\"!...\",AM49,IF(OR(AND(AR48<>\"\",AN48=\"\",AN48<>P64),AND(AR48<>\"\",AN48<>\"\",AN48=P64),AND(AR48<>\"\",AN48<>\"\",AN48<>DISTANCE_Q,P64<>DISTANCE_Q)),\"ERR!\",\"\"))","v":""},{"$f":"IF(AN49=\"!...\",AN49,IF(OR(AND(AR48<>\"\",AO48=\"\",AO48<>Q64),AND(AR48<>\"\",AO48<>\"\",AO48=Q64),AND(AR48<>\"\",AO48<>\"\",AO48<>DISTANCE_Q,Q64<>DISTANCE_Q)),\"ERR!\",\"\"))","v":""},{"$f":"IF(AO49=\"!...\",AO49,IF(OR(AND(AR48<>\"\",AP48=\"\",AP48<>R64),AND(AR48<>\"\",AP48<>\"\",AP48=R64),AND(AR48<>\"\",AP48<>\"\",AP48<>DISTANCE_Q,R64<>DISTANCE_Q)),\"ERR!\",\"\"))","v":""},{"$f":"IF(AP49=\"!...\",AP49,IF(OR(AND(AR48<>\"\",AQ48=\"\",AQ48<>S64),AND(AR48<>\"\",AQ48<>\"\",AQ48=S64),AND(AR48<>\"\",AQ48<>\"\",AQ48<>DISTANCE_Q,S64<>DISTANCE_Q)),\"ERR!\",\"\"))","v":""},{"$f":"IF(AR48=\"\",\"\",IF(AR48=\"G\",(NB_SETS_G_Q*2)-1-COUNTIF(O64:S64,DISTANCE_Q),COUNTIF(AM48:AQ48,DISTANCE_Q)))","v":""}]
[null,"Licence",null,null,null,null,null,{"$f":"IF(H48=\"\",\"\",IF(SUM(O40:S40)<>0,ROUNDDOWN(SUM(C48:G48)/SUM(O40:S40),3),\"\"))","v":""},null,null,null,null,null,{"$f":"IF(N48=\"\",\"\",IF(SUM(O44:S44)<>0,ROUNDDOWN(SUM(I48:M48)/SUM(O44:S44),3),\"\"))","v":""},null,null,null,null,null,null,null,null,null,null,null,{"$f":"IF(Z48=\"\",\"\",IF(SUM(O52:S52)<>0,ROUNDDOWN(SUM(U48:Y48)/SUM(O52:S52),3),\"\"))","v":""},null,null,null,null,null,{"$f":"IF(AF48=\"\",\"\",IF(SUM(O56:S56)<>0,ROUNDDOWN(SUM(AA48:AE48)/SUM(O56:S56),3),\"\"))","v":""},null,null,null,null,null,{"$f":"IF(AL48=\"\",\"\",IF(SUM(O60:S60)<>0,ROUNDDOWN(SUM(AG48:AK48)/SUM(O60:S60),3),\"\"))","v":""},null,null,null,null,null,{"$f":"IF(AR48=\"\",\"\",IF(SUM(O64:S64)<>0,ROUNDDOWN(SUM(AM48:AQ48)/SUM(O64:S64),3),\"\"))","v":""}]
[null,"Joueur 4","set 1","set 2","set 3","set 4","set 5","J1-J4","set 1","set 2","set 3","set 4","set 5","J2-J4","set 1","set 2","set 3","set 4","set 5","J3-J4",null,null,null,null,null,null,"set 1","set 2","set 3","set 4","set 5","J4-J5","set 1","set 2","set 3","set 4","set 5","J4-J6","set 1","set 2","set 3","set 4","set 5","J4-J7",null,null,null,null,null,null,null,{"$f":"IF(BH51<>\"\",RANK(BH51,BH39:BH66),\"\")","v":""},{"$f":"IF(TYPE_QUALIF=\"Poules 8J\",(COUNTIF(H52:AR52,\"G\")*VAL_PT_MATCH)+VAL_PT_MATCH,COUNTIF(H52:AR52,\"G\")*VAL_PT_MATCH)","v":0},{"$f":"IF(TYPE_QUALIF=\"Poules 8J\",(NB_SETS_G_Q*2-1)+SUM(AR53,AL53,AF53,H53,T53,N53),SUM(AR53,AL53,AF53,H53,T53,N53))","v":0},{"$f":"IF(BF51<>0,ROUNDDOWN(BE51/BF51,3),\"\")","v":""},{"$f":"MAX(N54,T54,H54,AF54,AL54,AR54)","v":0},{"$f":"SUM(I52:M52,O52:S52,C52:G52,AA52:AE52,AG52:AK52,AM52:AQ52)","v":0},{"$f":"SUM(U56:Y56,U60:Y60,U64:Y64,U48:Y48,U44:Y44,U40:Y40)","v":0},null,{"$f":"IF(BC51<>\"\",(BA51*10000000)+(BB51*100000)+(BC51*10000)+BD51,\"\")","v":""}]
[null,"Nom & Prénom",null,null,null,null,null,{"$f":"IF(COUNTIF(C52:G52,DISTANCE_Q)=NB_SETS_G_Q,\"G\",IF(COUNTIF(U40:Y40,DISTANCE_Q)=NB_SETS_G_Q,\"P\",\"\"))","v":""},null,null,null,null,null,{"$f":"IF(COUNTIF(I52:M52,DISTANCE_Q)=NB_SETS_G_Q,\"G\",IF(COUNTIF(U44:Y44,DISTANCE_Q)=NB_SETS_G_Q,\"P\",\"\"))","v":""},null,null,null,null,null,{"$f":"IF(COUNTIF(O52:S52,DISTANCE_Q)=NB_SETS_G_Q,\"G\",IF(COUNTIF(U48:Y48,DISTANCE_Q)=NB_SETS_G_Q,\"P\",\"\"))","v":""},null,null,null,null,null,null,null,null,null,null,null,{"$f":"IF(COUNTIF(AA52:AE52,DISTANCE_Q)=NB_SETS_G_Q,\"G\",IF(COUNTIF(U56:Y56,DISTANCE_Q)=NB_SETS_G_Q,\"P\",\"\"))","v":""},null,null,null,null,null,{"$f":"IF(COUNTIF(AG52:AK52,DISTANCE_Q)=NB_SETS_G_Q,\"G\",IF(COUNTIF(U60:Y60,DISTANCE_Q)=NB_SETS_G_Q,\"P\",\"\"))","v":""},null,null,null,null,null,{"$f":"IF(COUNTIF(AM52:AQ52,DISTANCE_Q)=NB_SETS_G_Q,\"G\",IF(COUNTIF(U64:Y64,DISTANCE_Q)=NB_SETS_G_Q,\"P\",\"\"))","v":""}]
[null,"Ville ou Club",{"$f":"IF(OR(COUNTIF(C52:G52,\"\")<>COUNTIF(U40:Y40,\"\"),AND(H52=\"\",SUM(C52:G52)<>0)),\"!...\",IF(OR(AND(H52<>\"\",C52=\"\",C52<>U40),AND(H52<>\"\",C52<>\"\",C52=U40),AND(H52<>\"\",C52<>\"\",C52<>DISTANCE_Q,U40<>DISTANCE_Q)),\"ERR!\",\"\"))","v":""},{"$f":"IF(C53=\"!...\",C53,IF(OR(AND(H52<>\"\",D52=\"\",D52<>V40),AND(H52<>\"\",D52<>\"\",D52=V40),AND(H52<>\"\",D52<>\"\",D52<>DISTANCE_Q,V40<>DISTANCE_Q)),\"ERR!\",\"\"))","v":""},{"$f":"IF(D53=\"!...\",D53,IF(OR(AND(H52<>\"\",E52=\"\",E52<>W40),AND(H52<>\"\",E52<>\"\",E52=W40),AND(H52<>\"\",E52<>\"\",E52<>DISTANCE_Q,W40<>DISTANCE_Q)),\"ERR!\",\"\"))","v":""},{"$f":"IF(E53=\"!...\",E53,IF(OR(AND(H52<>\"\",F52=\"\",F52<>X40),AND(H52<>\"\",F52<>\"\",F52=X40),AND(H52<>\"\",F52<>\"\",F52<>DISTANCE_Q,X40<>DISTANCE_Q)),\"ERR!\",\"\"))","v":""},{"$f":"IF(F53=\"!...\",F53,IF(OR(AND(H52<>\"\",G52=\"\",G52<>Y40),AND(H52<>\"\",G52<>\"\",G52=Y40),AND(H52<>\"\",G52<>\"\",G52<>DISTANCE_Q,Y40<>DISTANCE_Q)),\"ERR!\",\"\"))","v":""},{"$f":"IF(H52=\"\",\"\",IF(H52=\"G\",(NB_SETS_G_Q*2)-1-COUNTIF(U40:Y40,DISTANCE_Q),COUNTIF(C52:G52,DISTANCE_Q)))","v":""},{"$f":"IF(OR(COUNTIF(I52:M52,\"\")<>COUNTIF(U44:Y44,\"\"),AND(N52=\"\",SUM(I52:M52)<>0)),\"!...\",IF(OR(AND(N52<>\"\",I52=\"\",I52<>U44),AND(N52<>\"\",I52<>\"\",I52=U44),AND(N52<>\"\",I52<>\"\",I52<>DISTANCE_Q,U44<>DISTANCE_Q)),\"ERR!\",\"\"))","v":""},{"$f":"IF(I53=\"!...\",I53,IF(OR(AND(N52<>\"\",J52=\"\",J52<>V44),AND(N52<>\"\",J52<>\"\",J52=V44),AND(N52<>\"\",J52<>\"\",J52<>DISTANCE_Q,V44<>DISTANCE_Q)),\"ERR!\",\"\"))","v":""},{"$f":"IF(J53=\"!...\",J53,IF(OR(AND(N52<>\"\",K52=\"\",K52<>W44),AND(N52<>\"\",K52<>\"\",K52=W44),AND(N52<>\"\",K52<>\"\",K52<>DISTANCE_Q,W44<>DISTANCE_Q)),\"ERR!\",\"\"))","v":""},{"$f":"IF(K53=\"!...\",K53,IF(OR(AND(N52<>\"\",L52=\"\",L52<>X44),AND(N52<>\"\",L52<>\"\",L52=X44),AND(N52<>\"\",L52<>\"\",L52<>DISTANCE_Q,X44<>DISTANCE_Q)),\"ERR!\",\"\"))","v":""},{"$f":"IF(L53=\"!...\",L53,IF(OR(AND(N52<>\"\",M52=\"\",M52<>Y44),AND(N52<>\"\",M52<>\"\",M52=Y44),AND(N52<>\"\",M52<>\"\",M52<>DISTANCE_Q,Y44<>DISTANCE_Q)),\"ERR!\",\"\"))","v":""},{"$f":"IF(N52=\"\",\"\",IF(N52=\"G\",(NB_SETS_G_Q*2)-1-COUNTIF(U44:Y44,DISTANCE_Q),COUNTIF(I52:M52,DISTANCE_Q)))","v":""},{"$f":"IF(OR(COUNTIF(O52:S52,\"\")<>COUNTIF(U48:Y48,\"\"),AND(T52=\"\",SUM(O52:S52)<>0)),\"!...\",IF(OR(AND(T52<>\"\",O52=\"\",O52<>U48),AND(T52<>\"\",O52<>\"\",O52=U48),AND(T52<>\"\",O52<>\"\",O52<>DISTANCE_Q,U48<>DISTANCE_Q)),\"ERR!\",\"\"))","v":""},{"$f":"IF(O53=\"!...\",O53,IF(OR(AND(T52<>\"\",P52=\"\",P52<>V48),AND(T52<>\"\",P52<>\"\",P52=V48),AND(T52<>\"\",P52<>\"\",P52<>DISTANCE_Q,V48<>DISTANCE_Q)),\"ERR!\",\"\"))","v":""},{"$f":"IF(P53=\"!...\",P53,IF(OR(AND(T52<>\"\",Q52=\"\",Q52<>W48),AND(T52<>\"\",Q52<>\"\",Q52=W48),AND(T52<>\"\",Q52<>\"\",Q52<>DISTANCE_Q,W48<>DISTANCE_Q)),\"ERR!\",\"\"))","v":""},{"$f":"IF(Q53=\"!...\",Q53,IF(OR(AND(T52<>\"\",R52=\"\",R52<>X48),AND(T52<>\"\",R52<>\"\",R52=X48),AND(T52<>\"\",R52<>\"\",R52<>DISTANCE_Q,X48<>DISTANCE_Q)),\"ERR!\",\"\"))","v":""},{"$f":"IF(R53=\"!...\",R53,IF(OR(AND(T52<>\"\",S52=\"\",S52<>Y48),AND(T52<>\"\",S52<>\"\",S52=Y48),AND(T52<>\"\",S52<>\"\",S52<>DISTANCE_Q,Y48<>DISTANCE_Q)),\"ERR!\",\"\"))","v":""},{"$f":"IF(T52=\"\",\"\",IF(T52=\"G\",(NB_SETS_G_Q*2)-1-COUNTIF(U48:Y48,DISTANCE_Q),COUNTIF(O52:S52,DISTANCE_Q)))","v":""},null,null,null,null,null,null,{"$f":"IF(OR(COUNTIF(AA52:AE52,\"\")<>COUNTIF(U56:Y56,\"\"),AND(AF52=\"\",SUM(AA52:AE52)<>0)),\"!...\",IF(OR(AND(AF52<>\"\",AA52=\"\",AA52<>U56),AND(AF52<>\"\",AA52<>\"\",AA52=U56),AND(AF52<>\"\",AA52<>\"\",AA52<>DISTANCE_Q,U56<>DISTANCE_Q)),\"ERR!\",\"\"))","v":""},{"$f":"IF(AA53=\"!...\",AA53,IF(OR(AND(AF52<>\"\",AB52=\"\",AB52<>V56),AND(AF52<>\"\",AB52<>\"\",AB52=V56),AND(AF52<>\"\",AB52<>\"\",AB52<>DISTANCE_Q,V56<>DISTANCE_Q)),\"ERR!\",\"\"))","v":""},{"$f":"IF(AB53=\"!...\",AB53,IF(OR(AND(AF52<>\"\",AC52=\"\",AC52<>W56),AND(AF52<>\"\",AC52<>\"\",AC52=W56),AND(AF52<>\"\",AC52<>\"\",AC52<>DISTANCE_Q,W56<>DISTANCE_Q)),\"ERR!\",\"\"))","v":""},{"$f":"IF(AC53=\"!...\",AC53,IF(OR(AND(AF52<>\"\",AD52=\"\",AD52<>X56),AND(AF52<>\"\",AD52<>\"\",AD52=X56),AND(AF52<>\"\",AD52<>\"\",AD52<>DISTANCE_Q,X56<>DISTANCE_Q)),\"ERR!\",\"\"))","v":""},{"$f":"IF(AD53=\"!...\",AD53,IF(OR(AND(AF52<>\"\",AE52=\"\",AE52<>Y56),AND(AF52<>\"\",AE52<>\"\",AE52=Y56),AND(AF52<>\"\",AE52<>\"\",AE52<>DISTANCE_Q,Y56<>DISTANCE_Q)),\"ERR!\",\"\"))","v":""},{"$f":"IF(AF52=\"\",\"\",IF(AF52=\"G\",(NB_SETS_G_Q*2)-1-COUNTIF(U56:Y56,DISTANCE_Q),COUNTIF(AA52:AE52,DISTANCE_Q)))","v":""},{"$f":"IF(OR(COUNTIF(AG52:AK52,\"\")<>COUNTIF(U60:Y60,\"\"),AND(AL52=\"\",SUM(AG52:AK52)<>0)),\"!...\",IF(OR(AND(AL52<>\"\",AG52=\"\",AG52<>U60),AND(AL52<>\"\",AG52<>\"\",AG52=U60),AND(AL52<>\"\",AG52<>\"\",AG52<>DISTANCE_Q,U60<>DISTANCE_Q)),\"ERR!\",\"\"))","v":""},{"$f":"IF(AG53=\"!...\",AG53,IF(OR(AND(AL52<>\"\",AH52=\"\",AH52<>V60),AND(AL52<>\"\",AH52<>\"\",AH52=V60),AND(AL52<>\"\",AH52<>\"\",AH52<>DISTANCE_Q,V60<>DISTANCE_Q)),\"ERR!\",\"\"))","v":""},{"$f":"IF(AH53=\"!...\",AH53,IF(OR(AND(AL52<>\"\",AI52=\"\",AI52<>W60),AND(AL52<>\"\",AI52<>\"\",AI52=W60),AND(AL52<>\"\",AI52<>\"\",AI52<>DISTANCE_Q,W60<>DISTANCE_Q)),\"ERR!\",\"\"))","v":""},{"$f":"IF(AI53=\"!...\",AI53,IF(OR(AND(AL52<>\"\",AJ52=\"\",AJ52<>X60),AND(AL52<>\"\",AJ52<>\"\",AJ52=X60),AND(AL52<>\"\",AJ52<>\"\",AJ52<>DISTANCE_Q,X60<>DISTANCE_Q)),\"ERR!\",\"\"))","v":""},{"$f":"IF(AJ53=\"!...\",AJ53,IF(OR(AND(AL52<>\"\",AK52=\"\",AK52<>Y60),AND(AL52<>\"\",AK52<>\"\",AK52=Y60),AND(AL52<>\"\",AK52<>\"\",AK52<>DISTANCE_Q,Y60<>DISTANCE_Q)),\"ERR!\",\"\"))","v":""},{"$f":"IF(AL52=\"\",\"\",IF(AL52=\"G\",(NB_SETS_G_Q*2)-1-COUNTIF(U60:Y60,DISTANCE_Q),COUNTIF(AG52:AK52,DISTANCE_Q)))","v":""},{"$f":"IF(OR(COUNTIF(AM52:AQ52,\"\")<>COUNTIF(U64:Y64,\"\"),AND(AR52=\"\",SUM(AM52:AQ52)<>0)),\"!...\",IF(OR(AND(AR52<>\"\",AM52=\"\",AM52<>U64),AND(AR52<>\"\",AM52<>\"\",AM52=U64),AND(AR52<>\"\",AM52<>\"\",AM52<>DISTANCE_Q,U64<>DISTANCE_Q)),\"ERR!\",\"\"))","v":""},{"$f":"IF(AM53=\"!...\",AM53,IF(OR(AND(AR52<>\"\",AN52=\"\",AN52<>V64),AND(AR52<>\"\",AN52<>\"\",AN52=V64),AND(AR52<>\"\",AN52<>\"\",AN52<>DISTANCE_Q,V64<>DISTANCE_Q)),\"ERR!\",\"\"))","v":""},{"$f":"IF(AN53=\"!...\",AN53,IF(OR(AND(AR52<>\"\",AO52=\"\",AO52<>W64),AND(AR52<>\"\",AO52<>\"\",AO52=W64),AND(AR52<>\"\",AO52<>\"\",AO52<>DISTANCE_Q,W64<>DISTANCE_Q)),\"ERR!\",\"\"))","v":""},{"$f":"IF(AO53=\"!...\",AO53,IF(OR(AND(AR52<>\"\",AP52=\"\",AP52<>X64),AND(AR52<>\"\",AP52<>\"\",AP52=X64),AND(AR52<>\"\",AP52<>\"\",AP52<>DISTANCE_Q,X64<>DISTANCE_Q)),\"ERR!\",\"\"))","v":""},{"$f":"IF(AP53=\"!...\",AP53,IF(OR(AND(AR52<>\"\",AQ52=\"\",AQ52<>Y64),AND(AR52<>\"\",AQ52<>\"\",AQ52=Y64),AND(AR52<>\"\",AQ52<>\"\",AQ52<>DISTANCE_Q,Y64<>DISTANCE_Q)),\"ERR!\",\"\"))","v":""},{"$f":"IF(AR52=\"\",\"\",IF(AR52=\"G\",(NB_SETS_G_Q*2)-1-COUNTIF(U64:Y64,DISTANCE_Q),COUNTIF(AM52:AQ52,DISTANCE_Q)))","v":""}]
[null,"Licence",null,null,null,null,null,{"$f":"IF(H52=\"\",\"\",IF(SUM(U40:Y40)<>0,ROUNDDOWN(SUM(C52:G52)/SUM(U40:Y40),3),\"\"))","v":""},null,null,null,null,null,{"$f":"IF(N52=\"\",\"\",IF(SUM(U44:Y44)<>0,ROUNDDOWN(SUM(I52:M52)/SUM(U44:Y44),3),\"\"))","v":""},null,null,null,null,null,{"$f":"IF(T52=\"\",\"\",IF(SUM(U48:Y48)<>0,ROUNDDOWN(SUM(O52:S52)/SUM(U48:Y48),3),\"\"))","v":""},null,null,null,null,null,null,null,null,null,null,null,{"$f":"IF(AF52=\"\",\"\",IF(SUM(U56:Y56)<>0,ROUNDDOWN(SUM(AA52:AE52)/SUM(U56:Y56),3),\"\"))","v":""},null,null,null,null,null,{"$f":"IF(AL52=\"\",\"\",IF(SUM(U60:Y60)<>0,ROUNDDOWN(SUM(AG52:AK52)/SUM(U60:Y60),3),\"\"))","v":""},null,null,null,null,null,{"$f":"IF(AR52=\"\",\"\",IF(SUM(U64:Y64)<>0,ROUNDDOWN(SUM(AM52:AQ52)/SUM(U64:Y64),3),\"\"))","v":""}]
[null,"Joueur 5","set 1","set 2","set 3","set 4","set 5","J1-J5","set 1","set 2","set 3","set 4","set 5","J2-J5","set 1","set 2","set 3","set 4","set 5","J3-J5","set 1","set 2","set 3","set 4","set 5","J4-J5",null,null,null,null,null,null,"set 1","set 2","set 3","set 4","set 5","J5-J6","set 1","set 2","set 3","set 4","set 5","J5-J7",null,null,null,null,null,null,null,{"$f":"IF(BH55<>\"\",RANK(BH55,BH39:BH66),\"\")","v":""},{"$f":"IF(TYPE_QUALIF=\"Poules 8J\",(COUNTIF(H56:AR56,\"G\")*VAL_PT_MATCH)+VAL_PT_MATCH,COUNTIF(H56:AR56,\"G\")*VAL_PT_MATCH)","v":0},{"$f":"IF(TYPE_QUALIF=\"Poules 8J\",(NB_SETS_G_Q*2-1)+SUM(AR57,AL57,H57,Z57,T57,N57),SUM(AR57,AL57,H57,Z57,T57,N57))","v":0},{"$f":"IF(BF55<>0,ROUNDDOWN(BE55/BF55,3),\"\")","v":""},{"$f":"MAX(N58,T58,Z58,H58,AL58,AR58)","v":0},{"$f":"SUM(I56:M56,O56:S56,U56:Y56,C56:G56,AG56:AK56,AM56:AQ56)","v":0},{"$f":"SUM(AA60:AE60,AA64:AE64,AA52:AE52,AA48:AE48,AA44:AE44,AA40:AE40)","v":0},null,{"$f":"IF(BC55<>\"\",(BA55*10000000)+(BB55*100000)+(BC55*10000)+BD55,\"\")","v":""}]
[null,"Nom & Prénom",null,null,null,null,null,{"$f":"IF(COUNTIF(C56:G56,DISTANCE_Q)=NB_SETS_G_Q,\"G\",IF(COUNTIF(AA40:AE40,DISTANCE_Q)=NB_SETS_G_Q,\"P\",\"\"))","v":""},null,null,null,null,null,{"$f":"IF(COUNTIF(I56:M56,DISTANCE_Q)=NB_SETS_G_Q,\"G\",IF(COUNTIF(AA44:AE44,DISTANCE_Q)=NB_SETS_G_Q,\"P\",\"\"))","v":""},null,null,null,null,null,{"$f":"IF(COUNTIF(O56:S56,DISTANCE_Q)=NB_SETS_G_Q,\"G\",IF(COUNTIF(AA48:AE48,DISTANCE_Q)=NB_SETS_G_Q,\"P\",\"\"))","v":""},null,null,null,null,null,{"$f":"IF(COUNTIF(U56:Y56,DISTANCE_Q)=NB_SETS_G_Q,\"G\",IF(COUNTIF(AA52:AE52,DISTANCE_Q)=NB_SETS_G_Q,\"P\",\"\"))","v":""},null,null,null,null,null,null,null,null,null,null,null,{"$f":"IF(COUNTIF(AG56:AK56,DISTANCE_Q)=NB_SETS_G_Q,\"G\",IF(COUNTIF(AA60:AE60,DISTANCE_Q)=NB_SETS_G_Q,\"P\",\"\"))","v":""},null,null,null,null,null,{"$f":"IF(COUNTIF(AM56:AQ56,DISTANCE_Q)=NB_SETS_G_Q,\"G\",IF(COUNTIF(AA64:AE64,DISTANCE_Q)=NB_SETS_G_Q,\"P\",\"\"))","v":""}]
[null,"Ville ou Club",{"$f":"IF(OR(COUNTIF(C56:G56,\"\")<>COUNTIF(AA40:AE40,\"\"),AND(H56=\"\",SUM(C56:G56)<>0)),\"!...\",IF(OR(AND(H56<>\"\",C56=\"\",C56<>AA40),AND(H56<>\"\",C56<>\"\",C56=AA40),AND(H56<>\"\",C56<>\"\",C56<>DISTANCE_Q,AA40<>DISTANCE_Q)),\"ERR!\",\"\"))","v":""},{"$f":"IF(C57=\"!...\",C57,IF(OR(AND(H56<>\"\",D56=\"\",D56<>AB40),AND(H56<>\"\",D56<>\"\",D56=AB40),AND(H56<>\"\",D56<>\"\",D56<>DISTANCE_Q,AB40<>DISTANCE_Q)),\"ERR!\",\"\"))","v":""},{"$f":"IF(D57=\"!...\",D57,IF(OR(AND(H56<>\"\",E56=\"\",E56<>AC40),AND(H56<>\"\",E56<>\"\",E56=AC40),AND(H56<>\"\",E56<>\"\",E56<>DISTANCE_Q,AC40<>DISTANCE_Q)),\"ERR!\",\"\"))","v":""},{"$f":"IF(E57=\"!...\",E57,IF(OR(AND(H56<>\"\",F56=\"\",F56<>AD40),AND(H56<>\"\",F56<>\"\",F56=AD40),AND(H56<>\"\",F56<>\"\",F56<>DISTANCE_Q,AD40<>DISTANCE_Q)),\"ERR!\",\"\"))","v":""},{"$f":"IF(F57=\"!...\",F57,IF(OR(AND(H56<>\"\",G56=\"\",G56<>AE40),AND(H56<>\"\",G56<>\"\",G56=AE40),AND(H56<>\"\",G56<>\"\",G56<>DISTANCE_Q,AE40<>DISTANCE_Q)),\"ERR!\",\"\"))","v":""},{"$f":"IF(H56=\"\",\"\",IF(H56=\"G\",(NB_SETS_G_Q*2)-1-COUNTIF(AA40:AE40,DISTANCE_Q),COUNTIF(C56:G56,DISTANCE_Q)))","v":""},{"$f":"IF(OR(COUNTIF(I56:M56,\"\")<>COUNTIF(AA44:AE44,\"\"),AND(N56=\"\",SUM(I56:M56)<>0)),\"!...\",IF(OR(AND(N56<>\"\",I56=\"\",I56<>AA44),AND(N56<>\"\",I56<>\"\",I56=AA44),AND(N56<>\"\",I56<>\"\",I56<>DISTANCE_Q,AA44<>DISTANCE_Q)),\"ERR!\",\"\"))","v":""},{"$f":"IF(I57=\"!...\",I57,IF(OR(AND(N56<>\"\",J56=\"\",J56<>AB44),AND(N56<>\"\",J56<>\"\",J56=AB44),AND(N56<>\"\",J56<>\"\",J56<>DISTANCE_Q,AB44<>DISTANCE_Q)),\"ERR!\",\"\"))","v":""},{"$f":"IF(J57=\"!...\",J57,IF(OR(AND(N56<>\"\",K56=\"\",K56<>AC44),AND(N56<>\"\",K56<>\"\",K56=AC44),AND(N56<>\"\",K56<>\"\",K56<>DISTANCE_Q,AC44<>DISTANCE_Q)),\"ERR!\",\"\"))","v":""},{"$f":"IF(K57=\"!...\",K57,IF(OR(AND(N56<>\"\",L56=\"\",L56<>AD44),AND(N56<>\"\",L56<>\"\",L56=AD44),AND(N56<>\"\",L56<>\"\",L56<>DISTANCE_Q,AD44<>DISTANCE_Q)),\"ERR!\",\"\"))","v":""},{"$f":"IF(L57=\"!...\",L57,IF(OR(AND(N56<>\"\",M56=\"\",M56<>AE44),AND(N56<>\"\",M56<>\"\",M56=AE44),AND(N56<>\"\",M56<>\"\",M56<>DISTANCE_Q,AE44<>DISTANCE_Q)),\"ERR!\",\"\"))","v":""},{"$f":"IF(N56=\"\",\"\",IF(N56=\"G\",(NB_SETS_G_Q*2)-1-COUNTIF(AA44:AE44,DISTANCE_Q),COUNTIF(I56:M56,DISTANCE_Q)))","v":""},{"$f":"IF(OR(COUNTIF(O56:S56,\"\")<>COUNTIF(AA48:AE48,\"\"),AND(T56=\"\",SUM(O56:S56)<>0)),\"!...\",IF(OR(AND(T56<>\"\",O56=\"\",O56<>AA48),AND(T56<>\"\",O56<>\"\",O56=AA48),AND(T56<>\"\",O56<>\"\",O56<>DISTANCE_Q,AA48<>DISTANCE_Q)),\"ERR!\",\"\"))","v":""},{"$f":"IF(O57=\"!...\",O57,IF(OR(AND(T56<>\"\",P56=\"\",P56<>AB48),AND(T56<>\"\",P56<>\"\",P56=AB48),AND(T56<>\"\",P56<>\"\",P56<>DISTANCE_Q,AB48<>DISTANCE_Q)),\"ERR!\",\"\"))","v":""},{"$f":"IF(P57=\"!...\",P57,IF(OR(AND(T56<>\"\",Q56=\"\",Q56<>AC48),AND(T56<>\"\",Q56<>\"\",Q56=AC48),AND(T56<>\"\",Q56<>\"\",Q56<>DISTANCE_Q,AC48<>DISTANCE_Q)),\"ERR!\",\"\"))","v":""},{"$f":"IF(Q57=\"!...\",Q57,IF(OR(AND(T56<>\"\",R56=\"\",R56<>AD48),AND(T56<>\"\",R56<>\"\",R56=AD48),AND(T56<>\"\",R56<>\"\",R56<>DISTANCE_Q,AD48<>DISTANCE_Q)),\"ERR!\",\"\"))","v":""},{"$f":"IF(R57=\"!...\",R57,IF(OR(AND(T56<>\"\",S56=\"\",S56<>AE48),AND(T56<>\"\",S56<>\"\",S56=AE48),AND(T56<>\"\",S56<>\"\",S56<>DISTANCE_Q,AE48<>DISTANCE_Q)),\"ERR!\",\"\"))","v":""},{"$f":"IF(T56=\"\",\"\",IF(T56=\"G\",(NB_SETS_G_Q*2)-1-COUNTIF(AA48:AE48,DISTANCE_Q),COUNTIF(O56:S56,DISTANCE_Q)))","v":""},{"$f":"IF(OR(COUNTIF(U56:Y56,\"\")<>COUNTIF(AA52:AE52,\"\"),AND(Z56=\"\",SUM(U56:Y56)<>0)),\"!...\",IF(OR(AND(Z56<>\"\",U56=\"\",U56<>AA52),AND(Z56<>\"\",U56<>\"\",U56=AA52),AND(Z56<>\"\",U56<>\"\",U56<>DISTANCE_Q,AA52<>DISTANCE_Q)),\"ERR!\",\"\"))","v":""},{"$f":"IF(U57=\"!...\",U57,IF(OR(AND(Z56<>\"\",V56=\"\",V56<>AB52),AND(Z56<>\"\",V56<>\"\",V56=AB52),AND(Z56<>\"\",V56<>\"\",V56<>DISTANCE_Q,AB52<>DISTANCE_Q)),\"ERR!\",\"\"))","v":""},{"$f":"IF(V57=\"!...\",V57,IF(OR(AND(Z56<>\"\",W56=\"\",W56<>AC52),AND(Z56<>\"\",W56<>\"\",W56=AC52),AND(Z56<>\"\",W56<>\"\",W56<>DISTANCE_Q,AC52<>DISTANCE_Q)),\"ERR!\",\"\"))","v":""},{"$f":"IF(W57=\"!...\",W57,IF(OR(AND(Z56<>\"\",X56=\"\",X56<>AD52),AND(Z56<>\"\",X56<>\"\",X56=AD52),AND(Z56<>\"\",X56<>\"\",X56<>DISTANCE_Q,AD52<>DISTANCE_Q)),\"ERR!\",\"\"))","v":""},{"$f":"IF(X57=\"!...\",X57,IF(OR(AND(Z56<>\"\",Y56=\"\",Y56<>AE52),AND(Z56<>\"\",Y56<>\"\",Y56=AE52),AND(Z56<>\"\",Y56<>\"\",Y56<>DISTANCE_Q,AE52<>DISTANCE_Q)),\"ERR!\",\"\"))","v":""},{"$f":"IF(Z56=\"\",\"\",IF(Z56=\"G\",(NB_SETS_G_Q*2)-1-COUNTIF(AA52:AE52,DISTANCE_Q),COUNTIF(U56:Y56,DISTANCE_Q)))","v":""},null,null,null,null,null,null,{"$f":"IF(OR(COUNTIF(AG56:AK56,\"\")<>COUNTIF(AA60:AE60,\"\"),AND(AL56=\"\",SUM(AG56:AK56)<>0)),\"!...\",IF(OR(AND(AL56<>\"\",AG56=\"\",AG56<>AA60),AND(AL56<>\"\",AG56<>\"\",AG56=AA60),AND(AL56<>\"\",AG56<>\"\",AG56<>DISTANCE_Q,AA60<>DISTANCE_Q)),\"ERR!\",\"\"))","v":""},{"$f":"IF(AG57=\"!...\",AG57,IF(OR(AND(AL56<>\"\",AH56=\"\",AH56<>AB60),AND(AL56<>\"\",AH56<>\"\",AH56=AB60),AND(AL56<>\"\",AH56<>\"\",AH56<>DISTANCE_Q,AB60<>DISTANCE_Q)),\"ERR!\",\"\"))","v":""},{"$f":"IF(AH57=\"!...\",AH57,IF(OR(AND(AL56<>\"\",AI56=\"\",AI56<>AC60),AND(AL56<>\"\",AI56<>\"\",AI56=AC60),AND(AL56<>\"\",AI56<>\"\",AI56<>DISTANCE_Q,AC60<>DISTANCE_Q)),\"ERR!\",\"\"))","v":""},{"$f":"IF(AI57=\"!...\",AI57,IF(OR(AND(AL56<>\"\",AJ56=\"\",AJ56<>AD60),AND(AL56<>\"\",AJ56<>\"\",AJ56=AD60),AND(AL56<>\"\",AJ56<>\"\",AJ56<>DISTANCE_Q,AD60<>DISTANCE_Q)),\"ERR!\",\"\"))","v":""},{"$f":"IF(AJ57=\"!...\",AJ57,IF(OR(AND(AL56<>\"\",AK56=\"\",AK56<>AE60),AND(AL56<>\"\",AK56<>\"\",AK56=AE60),AND(AL56<>\"\",AK56<>\"\",AK56<>DISTANCE_Q,AE60<>DISTANCE_Q)),\"ERR!\",\"\"))","v":""},{"$f":"IF(AL56=\"\",\"\",IF(AL56=\"G\",(NB_SETS_G_Q*2)-1-COUNTIF(AA60:AE60,DISTANCE_Q),COUNTIF(AG56:AK56,DISTANCE_Q)))","v":""},{"$f":"IF(OR(COUNTIF(AM56:AQ56,\"\")<>COUNTIF(AA64:AE64,\"\"),AND(AR56=\"\",SUM(AM56:AQ56)<>0)),\"!...\",IF(OR(AND(AR56<>\"\",AM56=\"\",AM56<>AA64),AND(AR56<>\"\",AM56<>\"\",AM56=AA64),AND(AR56<>\"\",AM56<>\"\",AM56<>DISTANCE_Q,AA64<>DISTANCE_Q)),\"ERR!\",\"\"))","v":""},{"$f":"IF(AM57=\"!...\",AM57,IF(OR(AND(AR56<>\"\",AN56=\"\",AN56<>AB64),AND(AR56<>\"\",AN56<>\"\",AN56=AB64),AND(AR56<>\"\",AN56<>\"\",AN56<>DISTANCE_Q,AB64<>DISTANCE_Q)),\"ERR!\",\"\"))","v":""},{"$f":"IF(AN57=\"!...\",AN57,IF(OR(AND(AR56<>\"\",AO56=\"\",AO56<>AC64),AND(AR56<>\"\",AO56<>\"\",AO56=AC64),AND(AR56<>\"\",AO56<>\"\",AO56<>DISTANCE_Q,AC64<>DISTANCE_Q)),\"ERR!\",\"\"))","v":""},{"$f":"IF(AO57=\"!...\",AO57,IF(OR(AND(AR56<>\"\",AP56=\"\",AP56<>AD64),AND(AR56<>\"\",AP56<>\"\",AP56=AD64),AND(AR56<>\"\",AP56<>\"\",AP56<>DISTANCE_Q,AD64<>DISTANCE_Q)),\"ERR!\",\"\"))","v":""},{"$f":"IF(AP57=\"!...\",AP57,IF(OR(AND(AR56<>\"\",AQ56=\"\",AQ56<>AE64),AND(AR56<>\"\",AQ56<>\"\",AQ56=AE64),AND(AR56<>\"\",AQ56<>\"\",AQ56<>DISTANCE_Q,AE64<>DISTANCE_Q)),\"ERR!\",\"\"))","v":""},{"$f":"IF(AR56=\"\",\"\",IF(AR56=\"G\",(NB_SETS_G_Q*2)-1-COUNTIF(AA64:AE64,DISTANCE_Q),COUNTIF(AM56:AQ56,DISTANCE_Q)))","v":""}]
[null,"Licence",null,null,null,null,null,{"$f":"IF(H56=\"\",\"\",IF(SUM(AA40:AE40)<>0,ROUNDDOWN(SUM(C56:G56)/SUM(AA40:AE40),3),\"\"))","v":""},null,null,null,null,null,{"$f":"IF(N56=\"\",\"\",IF(SUM(AA44:AE44)<>0,ROUNDDOWN(SUM(I56:M56)/SUM(AA44:AE44),3),\"\"))","v":""},null,null,null,null,null,{"$f":"IF(T56=\"\",\"\",IF(SUM(AA48:AE48)<>0,ROUNDDOWN(SUM(O56:S56)/SUM(AA48:AE48),3),\"\"))","v":""},null,null,null,null,null,{"$f":"IF(Z56=\"\",\"\",IF(SUM(AA52:AE52)<>0,ROUNDDOWN(SUM(U56:Y56)/SUM(AA52:AE52),3),\"\"))","v":""},null,null,null,null,null,null,null,null,null,null,null,{"$f":"IF(AL56=\"\",\"\",IF(SUM(AA60:AE60)<>0,ROUNDDOWN(SUM(AG56:AK56)/SUM(AA60:AE60),3),\"\"))","v":""},null,null,null,null,null,{"$f":"IF(AR56=\"\",\"\",IF(SUM(AA64:AE64)<>0,ROUNDDOWN(SUM(AM56:AQ56)/SUM(AA64:AE64),3),\"\"))","v":""}]
[null,"Joueu 6","set 1","set 2","set 3","set 4","set 5","J1-J6","set 1","set 2","set 3","set 4","set 5","J2-J6","set 1","set 2","set 3","set 4","set 5","J3-J6","set 1","set 2","set 3","set 4","set 5","J4-J6","set 1","set 2","set 3","set 4","set 5","J5-J6",null,null,null,null,null,null,"set 1","set 2","set 3","set 4","set 5","J6-J7",null,null,null,null,null,null,null,{"$f":"IF(BH59<>\"\",RANK(BH59,BH39:BH66),\"\")","v":""},{"$f":"IF(TYPE_QUALIF=\"Poules 8J\",(COUNTIF(H60:AR60,\"G\")*VAL_PT_MATCH)+VAL_PT_MATCH,COUNTIF(H60:AR60,\"G\")*VAL_PT_MATCH)","v":0},{"$f":"IF(TYPE_QUALIF=\"Poules 8J\",(NB_SETS_G_Q*2-1)+SUM(AR61,H61,AF61,Z61,T61,N61),SUM(AR61,H61,AF61,Z61,T61,N61))","v":0},{"$f":"IF(BF59<>0,ROUNDDOWN(BE59/BF59,3),\"\")","v":""},{"$f":"MAX(N62,T62,Z62,AF62,H62,AR62)","v":0},{"$f":"SUM(I60:M60,O60:S60,U60:Y60,AA60:AE60,C60:G60,AM60:AQ60)","v":0},{"$f":"SUM(AG64:AK64,AG56:AK56,AG52:AK52,AG48:AK48,AG44:AK44,AG40:AK40)","v":0},null,{"$f":"IF(BC59<>\"\",(BA59*10000000)+(BB59*100000)+(BC59*10000)+BD59,\"\")","v":""}]
[null,"Nom & Prénom",null,null,null,null,null,{"$f":"IF(COUNTIF(C60:G60,DISTANCE_Q)=NB_SETS_G_Q,\"G\",IF(COUNTIF(AG40:AK40,DISTANCE_Q)=NB_SETS_G_Q,\"P\",\"\"))","v":""},null,null,null,null,null,{"$f":"IF(COUNTIF(I60:M60,DISTANCE_Q)=NB_SETS_G_Q,\"G\",IF(COUNTIF(AG44:AK44,DISTANCE_Q)=NB_SETS_G_Q,\"P\",\"\"))","v":""},null,null,null,null,null,{"$f":"IF(COUNTIF(O60:S60,DISTANCE_Q)=NB_SETS_G_Q,\"G\",IF(COUNTIF(AG48:AK48,DISTANCE_Q)=NB_SETS_G_Q,\"P\",\"\"))","v":""},null,null,null,null,null,{"$f":"IF(COUNTIF(U60:Y60,DISTANCE_Q)=NB_SETS_G_Q,\"G\",IF(COUNTIF(AG52:AK52,DISTANCE_Q)=NB_SETS_G_Q,\"P\",\"\"))","v":""},null,null,null,null,null,{"$f":"IF(COUNTIF(AA60:AE60,DISTANCE_Q)=NB_SETS_G_Q,\"G\",IF(COUNTIF(AG56:AK56,DISTANCE_Q)=NB_SETS_G_Q,\"P\",\"\"))","v":""},null,null,null,null,null,null,null,null,null,null,null,{"$f":"IF(COUNTIF(AM60:AQ60,DISTANCE_Q)=NB_SETS_G_Q,\"G\",IF(COUNTIF(AG64:AK64,DISTANCE_Q)=NB_SETS_G_Q,\"P\",\"\"))","v":""}]
[null,"Ville ou Club",{"$f":"IF(OR(COUNTIF(C60:G60,\"\")<>COUNTIF(AG40:AK40,\"\"),AND(H60=\"\",SUM(C60:G60)<>0)),\"!...\",IF(OR(AND(H60<>\"\",C60=\"\",C60<>AG40),AND(H60<>\"\",C60<>\"\",C60=AG40),AND(H60<>\"\",C60<>\"\",C60<>DISTANCE_Q,AG40<>DISTANCE_Q)),\"ERR!\",\"\"))","v":""},{"$f":"IF(C61=\"!...\",C61,IF(OR(AND(H60<>\"\",D60=\"\",D60<>AH40),AND(H60<>\"\",D60<>\"\",D60=AH40),AND(H60<>\"\",D60<>\"\",D60<>DISTANCE_Q,AH40<>DISTANCE_Q)),\"ERR!\",\"\"))","v":""},{"$f":"IF(D61=\"!...\",D61,IF(OR(AND(H60<>\"\",E60=\"\",E60<>AI40),AND(H60<>\"\",E60<>\"\",E60=AI40),AND(H60<>\"\",E60<>\"\",E60<>DISTANCE_Q,AI40<>DISTANCE_Q)),\"ERR!\",\"\"))","v":""},{"$f":"IF(E61=\"!...\",E61,IF(OR(AND(H60<>\"\",F60=\"\",F60<>AJ40),AND(H60<>\"\",F60<>\"\",F60=AJ40),AND(H60<>\"\",F60<>\"\",F60<>DISTANCE_Q,AJ40<>DISTANCE_Q)),\"ERR!\",\"\"))","v":""},{"$f":"IF(F61=\"!...\",F61,IF(OR(AND(H60<>\"\",G60=\"\",G60<>AK40),AND(H60<>\"\",G60<>\"\",G60=AK40),AND(H60<>\"\",G60<>\"\",G60<>DISTANCE_Q,AK40<>DISTANCE_Q)),\"ERR!\",\"\"))","v":""},{"$f":"IF(H60=\"\",\"\",IF(H60=\"G\",(NB_SETS_G_Q*2)-1-COUNTIF(AG40:AK40,DISTANCE_Q),COUNTIF(C60:G60,DISTANCE_Q)))","v":""},{"$f":"IF(OR(COUNTIF(I60:M60,\"\")<>COUNTIF(AG44:AK44,\"\"),AND(N60=\"\",SUM(I60:M60)<>0)),\"!...\",IF(OR(AND(N60<>\"\",I60=\"\",I60<>AG44),AND(N60<>\"\",I60<>\"\",I60=AG44),AND(N60<>\"\",I60<>\"\",I60<>DISTANCE_Q,AG44<>DISTANCE_Q)),\"ERR!\",\"\"))","v":""},{"$f":"IF(I61=\"!...\",I61,IF(OR(AND(N60<>\"\",J60=\"\",J60<>AH44),AND(N60<>\"\",J60<>\"\",J60=AH44),AND(N60<>\"\",J60<>\"\",J60<>DISTANCE_Q,AH44<>DISTANCE_Q)),\"ERR!\",\"\"))","v":""},{"$f":"IF(J61=\"!...\",J61,IF(OR(AND(N60<>\"\",K60=\"\",K60<>AI44),AND(N60<>\"\",K60<>\"\",K60=AI44),AND(N60<>\"\",K60<>\"\",K60<>DISTANCE_Q,AI44<>DISTANCE_Q)),\"ERR!\",\"\"))","v":""},{"$f":"IF(K61=\"!...\",K61,IF(OR(AND(N60<>\"\",L60=\"\",L60<>AJ44),AND(N60<>\"\",L60<>\"\",L60=AJ44),AND(N60<>\"\",L60<>\"\",L60<>DISTANCE_Q,AJ44<>DISTANCE_Q)),\"ERR!\",\"\"))","v":""},{"$f":"IF(L61=\"!...\",L61,IF(OR(AND(N60<>\"\",M60=\"\",M60<>AK44),AND(N60<>\"\",M60<>\"\",M60=AK44),AND(N60<>\"\",M60<>\"\",M60<>DISTANCE_Q,AK44<>DISTANCE_Q)),\"ERR!\",\"\"))","v":""},{"$f":"IF(N60=\"\",\"\",IF(N60=\"G\",(NB_SETS_G_Q*2)-1-COUNTIF(AG44:AK44,DISTANCE_Q),COUNTIF(I60:M60,DISTANCE_Q)))","v":""},{"$f":"IF(OR(COUNTIF(O60:S60,\"\")<>COUNTIF(AG48:AK48,\"\"),AND(T60=\"\",SUM(O60:S60)<>0)),\"!...\",IF(OR(AND(T60<>\"\",O60=\"\",O60<>AG48),AND(T60<>\"\",O60<>\"\",O60=AG48),AND(T60<>\"\",O60<>\"\",O60<>DISTANCE_Q,AG48<>DISTANCE_Q)),\"ERR!\",\"\"))","v":""},{"$f":"IF(O61=\"!...\",O61,IF(OR(AND(T60<>\"\",P60=\"\",P60<>AH48),AND(T60<>\"\",P60<>\"\",P60=AH48),AND(T60<>\"\",P60<>\"\",P60<>DISTANCE_Q,AH48<>DISTANCE_Q)),\"ERR!\",\"\"))","v":""},{"$f":"IF(P61=\"!...\",P61,IF(OR(AND(T60<>\"\",Q60=\"\",Q60<>AI48),AND(T60<>\"\",Q60<>\"\",Q60=AI48),AND(T60<>\"\",Q60<>\"\",Q60<>DISTANCE_Q,AI48<>DISTANCE_Q)),\"ERR!\",\"\"))","v":""},{"$f":"IF(Q61=\"!...\",Q61,IF(OR(AND(T60<>\"\",R60=\"\",R60<>AJ48),AND(T60<>\"\",R60<>\"\",R60=AJ48),AND(T60<>\"\",R60<>\"\",R60<>DISTANCE_Q,AJ48<>DISTANCE_Q)),\"ERR!\",\"\"))","v":""},{"$f":"IF(R61=\"!...\",R61,IF(OR(AND(T60<>\"\",S60=\"\",S60<>AK48),AND(T60<>\"\",S60<>\"\",S60=AK48),AND(T60<>\"\",S60<>\"\",S60<>DISTANCE_Q,AK48<>DISTANCE_Q)),\"ERR!\",\"\"))","v":""},{"$f":"IF(T60=\"\",\"\",IF(T60=\"G\",(NB_SETS_G_Q*2)-1-COUNTIF(AG48:AK48,DISTANCE_Q),COUNTIF(O60:S60,DISTANCE_Q)))","v":""},{"$f":"IF(OR(COUNTIF(U60:Y60,\"\")<>COUNTIF(AG52:AK52,\"\"),AND(Z60=\"\",SUM(U60:Y60)<>0)),\"!...\",IF(OR(AND(Z60<>\"\",U60=\"\",U60<>AG52),AND(Z60<>\"\",U60<>\"\",U60=AG52),AND(Z60<>\"\",U60<>\"\",U60<>DISTANCE_Q,AG52<>DISTANCE_Q)),\"ERR!\",\"\"))","v":""},{"$f":"IF(U61=\"!...\",U61,IF(OR(AND(Z60<>\"\",V60=\"\",V60<>AH52),AND(Z60<>\"\",V60<>\"\",V60=AH52),AND(Z60<>\"\",V60<>\"\",V60<>DISTANCE_Q,AH52<>DISTANCE_Q)),\"ERR!\",\"\"))","v":""},{"$f":"IF(V61=\"!...\",V61,IF(OR(AND(Z60<>\"\",W60=\"\",W60<>AI52),AND(Z60<>\"\",W60<>\"\",W60=AI52),AND(Z60<>\"\",W60<>\"\",W60<>DISTANCE_Q,AI52<>DISTANCE_Q)),\"ERR!\",\"\"))","v":""},{"$f":"IF(W61=\"!...\",W61,IF(OR(AND(Z60<>\"\",X60=\"\",X60<>AJ52),AND(Z60<>\"\",X60<>\"\",X60=AJ52),AND(Z60<>\"\",X60<>\"\",X60<>DISTANCE_Q,AJ52<>DISTANCE_Q)),\"ERR!\",\"\"))","v":""},{"$f":"IF(X61=\"!...\",X61,IF(OR(AND(Z60<>\"\",Y60=\"\",Y60<>AK52),AND(Z60<>\"\",Y60<>\"\",Y60=AK52),AND(Z60<>\"\",Y60<>\"\",Y60<>DISTANCE_Q,AK52<>DISTANCE_Q)),\"ERR!\",\"\"))","v":""},{"$f":"IF(Z60=\"\",\"\",IF(Z60=\"G\",(NB_SETS_G_Q*2)-1-COUNTIF(AG52:AK52,DISTANCE_Q),COUNTIF(U60:Y60,DISTANCE_Q)))","v":""},{"$f":"IF(OR(COUNTIF(AA60:AE60,\"\")<>COUNTIF(AG56:AK56,\"\"),AND(AF60=\"\",SUM(AA60:AE60)<>0)),\"!...\",IF(OR(AND(AF60<>\"\",AA60=\"\",AA60<>AG56),AND(AF60<>\"\",AA60<>\"\",AA60=AG56),AND(AF60<>\"\",AA60<>\"\",AA60<>DISTANCE_Q,AG56<>DISTANCE_Q)),\"ERR!\",\"\"))","v":""},{"$f":"IF(AA61=\"!...\",AA61,IF(OR(AND(AF60<>\"\",AB60=\"\",AB60<>AH56),AND(AF60<>\"\",AB60<>\"\",AB60=AH56),AND(AF60<>\"\",AB60<>\"\",AB60<>DISTANCE_Q,AH56<>DISTANCE_Q)),\"ERR!\",\"\"))","v":""},{"$f":"IF(AB61=\"!...\",AB61,IF(OR(AND(AF60<>\"\",AC60=\"\",AC60<>AI56),AND(AF60<>\"\",AC60<>\"\",AC60=AI56),AND(AF60<>\"\",AC60<>\"\",AC60<>DISTANCE_Q,AI56<>DISTANCE_Q)),\"ERR!\",\"\"))","v":""},{"$f":"IF(AC61=\"!...\",AC61,IF(OR(AND(AF60<>\"\",AD60=\"\",AD60<>AJ56),AND(AF60<>\"\",AD60<>\"\",AD60=AJ56),AND(AF60<>\"\",AD60<>\"\",AD60<>DISTANCE_Q,AJ56<>DISTANCE_Q)),\"ERR!\",\"\"))","v":""},{"$f":"IF(AD61=\"!...\",AD61,IF(OR(AND(AF60<>\"\",AE60=\"\",AE60<>AK56),AND(AF60<>\"\",AE60<>\"\",AE60=AK56),AND(AF60<>\"\",AE60<>\"\",AE60<>DISTANCE_Q,AK56<>DISTANCE_Q)),\"ERR!\",\"\"))","v":""},{"$f":"IF(AF60=\"\",\"\",IF(AF60=\"G\",(NB_SETS_G_Q*2)-1-COUNTIF(AG56:AK56,DISTANCE_Q),COUNTIF(AA60:AE60,DISTANCE_Q)))","v":""},null,null,null,null,null,null,{"$f":"IF(OR(COUNTIF(AM60:AQ60,\"\")<>COUNTIF(AG64:AK64,\"\"),AND(AR60=\"\",SUM(AM60:AQ60)<>0)),\"!...\",IF(OR(AND(AR60<>\"\",AM60=\"\",AM60<>AG64),AND(AR60<>\"\",AM60<>\"\",AM60=AG64),AND(AR60<>\"\",AM60<>\"\",AM60<>DISTANCE_Q,AG64<>DISTANCE_Q)),\"ERR!\",\"\"))","v":""},{"$f":"IF(AM61=\"!...\",AM61,IF(OR(AND(AR60<>\"\",AN60=\"\",AN60<>AH64),AND(AR60<>\"\",AN60<>\"\",AN60=AH64),AND(AR60<>\"\",AN60<>\"\",AN60<>DISTANCE_Q,AH64<>DISTANCE_Q)),\"ERR!\",\"\"))","v":""},{"$f":"IF(AN61=\"!...\",AN61,IF(OR(AND(AR60<>\"\",AO60=\"\",AO60<>AI64),AND(AR60<>\"\",AO60<>\"\",AO60=AI64),AND(AR60<>\"\",AO60<>\"\",AO60<>DISTANCE_Q,AI64<>DISTANCE_Q)),\"ERR!\",\"\"))","v":""},{"$f":"IF(AO61=\"!...\",AO61,IF(OR(AND(AR60<>\"\",AP60=\"\",AP60<>AJ64),AND(AR60<>\"\",AP60<>\"\",AP60=AJ64),AND(AR60<>\"\",AP60<>\"\",AP60<>DISTANCE_Q,AJ64<>DISTANCE_Q)),\"ERR!\",\"\"))","v":""},{"$f":"IF(AP61=\"!...\",AP61,IF(OR(AND(AR60<>\"\",AQ60=\"\",AQ60<>AK64),AND(AR60<>\"\",AQ60<>\"\",AQ60=AK64),AND(AR60<>\"\",AQ60<>\"\",AQ60<>DISTANCE_Q,AK64<>DISTANCE_Q)),\"ERR!\",\"\"))","v":""},{"$f":"IF(AR60=\"\",\"\",IF(AR60=\"G\",(NB_SETS_G_Q*2)-1-COUNTIF(AG64:AK64,DISTANCE_Q),COUNTIF(AM60:AQ60,DISTANCE_Q)))","v":""}]
[null,"Licence",null,null,null,null,null,{"$f":"IF(H60=\"\",\"\",IF(SUM(AG40:AK40)<>0,ROUNDDOWN(SUM(C60:G60)/SUM(AG40:AK40),3),\"\"))","v":""},null,null,null,null,null,{"$f":"IF(N60=\"\",\"\",IF(SUM(AG44:AK44)<>0,ROUNDDOWN(SUM(I60:M60)/SUM(AG44:AK44),3),\"\"))","v":""},null,null,null,null,null,{"$f":"IF(T60=\"\",\"\",IF(SUM(AG48:AK48)<>0,ROUNDDOWN(SUM(O60:S60)/SUM(AG48:AK48),3),\"\"))","v":""},null,null,null,null,null,{"$f":"IF(Z60=\"\",\"\",IF(SUM(AG52:AK52)<>0,ROUNDDOWN(SUM(U60:Y60)/SUM(AG52:AK52),3),\"\"))","v":""},null,null,null,null,null,{"$f":"IF(AF60=\"\",\"\",IF(SUM(AG56:AK56)<>0,ROUNDDOWN(SUM(AA60:AE60)/SUM(AG56:AK56),3),\"\"))","v":""},null,null,null,null,null,null,null,null,null,null,null,{"$f":"IF(AR60=\"\",\"\",IF(SUM(AG64:AK64)<>0,ROUNDDOWN(SUM(AM60:AQ60)/SUM(AG64:AK64),3),\"\"))","v":""}]
[null,"Joueur 7","set 1","set 2","set 3","set 4","set 5","J1-J7","set 1","set 2","set 3","set 4","set 5","J2-J7","set 1","set 2","set 3","set 4","set 5","J3-J7","set 1","set 2","set 3","set 4","set 5","J4-J7","set 1","set 2","set 3","set 4","set 5","J5-J7","set 1","set 2","set 3","set 4","set 5","J6-J7",null,null,null,null,null,null,null,null,null,null,null,null,null,{"$f":"IF(BH63<>\"\",RANK(BH63,BH39:BH66),\"\")","v":""},{"$f":"IF(TYPE_QUALIF=\"Poules 8J\",(COUNTIF(H64:AR64,\"G\")*VAL_PT_MATCH)+VAL_PT_MATCH,COUNTIF(H64:AR64,\"G\")*VAL_PT_MATCH)","v":0},{"$f":"IF(TYPE_QUALIF=\"Poules 8J\",(NB_SETS_G_Q*2-1)+SUM(H65,AL65,AF65,Z65,T65,N65),SUM(H65,AL65,AF65,Z65,T65,N65))","v":0},{"$f":"IF(BF63<>0,ROUNDDOWN(BE63/BF63,3),\"\")","v":""},{"$f":"MAX(N66,T66,Z66,AF66,AL66,H66)","v":0},{"$f":"SUM(I64:M64,O64:S64,U64:Y64,AA64:AE64,AG64:AK64,C64:G64)","v":0},{"$f":"SUM(AM60:AQ60,AM56:AQ56,AM52:AQ52,AM48:AQ48,AM44:AQ44,AM40:AQ40)","v":0},null,{"$f":"IF(BC63<>\"\",(BA63*10000000)+(BB63*100000)+(BC63*10000)+BD63,\"\")","v":""}]
[null,"Nom & Prénom",null,null,null,null,null,{"$f":"IF(COUNTIF(C64:G64,DISTANCE_Q)=NB_SETS_G_Q,\"G\",IF(COUNTIF(AM40:AQ40,DISTANCE_Q)=NB_SETS_G_Q,\"P\",\"\"))","v":""},null,null,null,null,null,{"$f":"IF(COUNTIF(I64:M64,DISTANCE_Q)=NB_SETS_G_Q,\"G\",IF(COUNTIF(AM44:AQ44,DISTANCE_Q)=NB_SETS_G_Q,\"P\",\"\"))","v":""},null,null,null,null,null,{"$f":"IF(COUNTIF(O64:S64,DISTANCE_Q)=NB_SETS_G_Q,\"G\",IF(COUNTIF(AM48:AQ48,DISTANCE_Q)=NB_SETS_G_Q,\"P\",\"\"))","v":""},null,null,null,null,null,{"$f":"IF(COUNTIF(U64:Y64,DISTANCE_Q)=NB_SETS_G_Q,\"G\",IF(COUNTIF(AM52:AQ52,DISTANCE_Q)=NB_SETS_G_Q,\"P\",\"\"))","v":""},null,null,null,null,null,{"$f":"IF(COUNTIF(AA64:AE64,DISTANCE_Q)=NB_SETS_G_Q,\"G\",IF(COUNTIF(AM56:AQ56,DISTANCE_Q)=NB_SETS_G_Q,\"P\",\"\"))","v":""},null,null,null,null,null,{"$f":"IF(COUNTIF(AG64:AK64,DISTANCE_Q)=NB_SETS_G_Q,\"G\",IF(COUNTIF(AM60:AQ60,DISTANCE_Q)=NB_SETS_G_Q,\"P\",\"\"))","v":""}]
[null,"Ville ou Club",{"$f":"IF(OR(COUNTIF(C64:G64,\"\")<>COUNTIF(AM40:AQ40,\"\"),AND(H64=\"\",SUM(C64:G64)<>0)),\"!...\",IF(OR(AND(H64<>\"\",C64=\"\",C64<>AM40),AND(H64<>\"\",C64<>\"\",C64=AM40),AND(H64<>\"\",C64<>\"\",C64<>DISTANCE_Q,AM40<>DISTANCE_Q)),\"ERR!\",\"\"))","v":""},{"$f":"IF(C65=\"!...\",C65,IF(OR(AND(H64<>\"\",D64=\"\",D64<>AN40),AND(H64<>\"\",D64<>\"\",D64=AN40),AND(H64<>\"\",D64<>\"\",D64<>DISTANCE_Q,AN40<>DISTANCE_Q)),\"ERR!\",\"\"))","v":""},{"$f":"IF(D65=\"!...\",D65,IF(OR(AND(H64<>\"\",E64=\"\",E64<>AO40),AND(H64<>\"\",E64<>\"\",E64=AO40),AND(H64<>\"\",E64<>\"\",E64<>DISTANCE_Q,AO40<>DISTANCE_Q)),\"ERR!\",\"\"))","v":""},{"$f":"IF(E65=\"!...\",E65,IF(OR(AND(H64<>\"\",F64=\"\",F64<>AP40),AND(H64<>\"\",F64<>\"\",F64=AP40),AND(H64<>\"\",F64<>\"\",F64<>DISTANCE_Q,AP40<>DISTANCE_Q)),\"ERR!\",\"\"))","v":""},{"$f":"IF(F65=\"!...\",F65,IF(OR(AND(H64<>\"\",G64=\"\",G64<>AQ40),AND(H64<>\"\",G64<>\"\",G64=AQ40),AND(H64<>\"\",G64<>\"\",G64<>DISTANCE_Q,AQ40<>DISTANCE_Q)),\"ERR!\",\"\"))","v":""},{"$f":"IF(H64=\"\",\"\",IF(H64=\"G\",(NB_SETS_G_Q*2)-1-COUNTIF(AM40:AQ40,DISTANCE_Q),COUNTIF(C64:G64,DISTANCE_Q)))","v":""},{"$f":"IF(OR(COUNTIF(I64:M64,\"\")<>COUNTIF(AM44:AQ44,\"\"),AND(N64=\"\",SUM(I64:M64)<>0)),\"!...\",IF(OR(AND(N64<>\"\",I64=\"\",I64<>AM44),AND(N64<>\"\",I64<>\"\",I64=AM44),AND(N64<>\"\",I64<>\"\",I64<>DISTANCE_Q,AM44<>DISTANCE_Q)),\"ERR!\",\"\"))","v":""},{"$f":"IF(I65=\"!...\",I65,IF(OR(AND(N64<>\"\",J64=\"\",J64<>AN44),AND(N64<>\"\",J64<>\"\",J64=AN44),AND(N64<>\"\",J64<>\"\",J64<>DISTANCE_Q,AN44<>DISTANCE_Q)),\"ERR!\",\"\"))","v":""},{"$f":"IF(J65=\"!...\",J65,IF(OR(AND(N64<>\"\",K64=\"\",K64<>AO44),AND(N64<>\"\",K64<>\"\",K64=AO44),AND(N64<>\"\",K64<>\"\",K64<>DISTANCE_Q,AO44<>DISTANCE_Q)),\"ERR!\",\"\"))","v":""},{"$f":"IF(K65=\"!...\",K65,IF(OR(AND(N64<>\"\",L64=\"\",L64<>AP44),AND(N64<>\"\",L64<>\"\",L64=AP44),AND(N64<>\"\",L64<>\"\",L64<>DISTANCE_Q,AP44<>DISTANCE_Q)),\"ERR!\",\"\"))","v":""},{"$f":"IF(L65=\"!...\",L65,IF(OR(AND(N64<>\"\",M64=\"\",M64<>AQ44),AND(N64<>\"\",M64<>\"\",M64=AQ44),AND(N64<>\"\",M64<>\"\",M64<>DISTANCE_Q,AQ44<>DISTANCE_Q)),\"ERR!\",\"\"))","v":""},{"$f":"IF(N64=\"\",\"\",IF(N64=\"G\",(NB_SETS_G_Q*2)-1-COUNTIF(AM44:AQ44,DISTANCE_Q),COUNTIF(I64:M64,DISTANCE_Q)))","v":""},{"$f":"IF(OR(COUNTIF(O64:S64,\"\")<>COUNTIF(AM48:AQ48,\"\"),AND(T64=\"\",SUM(O64:S64)<>0)),\"!...\",IF(OR(AND(T64<>\"\",O64=\"\",O64<>AM48),AND(T64<>\"\",O64<>\"\",O64=AM48),AND(T64<>\"\",O64<>\"\",O64<>DISTANCE_Q,AM48<>DISTANCE_Q)),\"ERR!\",\"\"))","v":""},{"$f":"IF(O65=\"!...\",O65,IF(OR(AND(T64<>\"\",P64=\"\",P64<>AN48),AND(T64<>\"\",P64<>\"\",P64=AN48),AND(T64<>\"\",P64<>\"\",P64<>DISTANCE_Q,AN48<>DISTANCE_Q)),\"ERR!\",\"\"))","v":""},{"$f":"IF(P65=\"!...\",P65,IF(OR(AND(T64<>\"\",Q64=\"\",Q64<>AO48),AND(T64<>\"\",Q64<>\"\",Q64=AO48),AND(T64<>\"\",Q64<>\"\",Q64<>DISTANCE_Q,AO48<>DISTANCE_Q)),\"ERR!\",\"\"))","v":""},{"$f":"IF(Q65=\"!...\",Q65,IF(OR(AND(T64<>\"\",R64=\"\",R64<>AP48),AND(T64<>\"\",R64<>\"\",R64=AP48),AND(T64<>\"\",R64<>\"\",R64<>DISTANCE_Q,AP48<>DISTANCE_Q)),\"ERR!\",\"\"))","v":""},{"$f":"IF(R65=\"!...\",R65,IF(OR(AND(T64<>\"\",S64=\"\",S64<>AQ48),AND(T64<>\"\",S64<>\"\",S64=AQ48),AND(T64<>\"\",S64<>\"\",S64<>DISTANCE_Q,AQ48<>DISTANCE_Q)),\"ERR!\",\"\"))","v":""},{"$f":"IF(T64=\"\",\"\",IF(T64=\"G\",(NB_SETS_G_Q*2)-1-COUNTIF(AM48:AQ48,DISTANCE_Q),COUNTIF(O64:S64,DISTANCE_Q)))","v":""},{"$f":"IF(OR(COUNTIF(U64:Y64,\"\")<>COUNTIF(AM52:AQ52,\"\"),AND(Z64=\"\",SUM(U64:Y64)<>0)),\"!...\",IF(OR(AND(Z64<>\"\",U64=\"\",U64<>AM52),AND(Z64<>\"\",U64<>\"\",U64=AM52),AND(Z64<>\"\",U64<>\"\",U64<>DISTANCE_Q,AM52<>DISTANCE_Q)),\"ERR!\",\"\"))","v":""},{"$f":"IF(U65=\"!...\",U65,IF(OR(AND(Z64<>\"\",V64=\"\",V64<>AN52),AND(Z64<>\"\",V64<>\"\",V64=AN52),AND(Z64<>\"\",V64<>\"\",V64<>DISTANCE_Q,AN52<>DISTANCE_Q)),\"ERR!\",\"\"))","v":""},{"$f":"IF(V65=\"!...\",V65,IF(OR(AND(Z64<>\"\",W64=\"\",W64<>AO52),AND(Z64<>\"\",W64<>\"\",W64=AO52),AND(Z64<>\"\",W64<>\"\",W64<>DISTANCE_Q,AO52<>DISTANCE_Q)),\"ERR!\",\"\"))","v":""},{"$f":"IF(W65=\"!...\",W65,IF(OR(AND(Z64<>\"\",X64=\"\",X64<>AP52),AND(Z64<>\"\",X64<>\"\",X64=AP52),AND(Z64<>\"\",X64<>\"\",X64<>DISTANCE_Q,AP52<>DISTANCE_Q)),\"ERR!\",\"\"))","v":""},{"$f":"IF(X65=\"!...\",X65,IF(OR(AND(Z64<>\"\",Y64=\"\",Y64<>AQ52),AND(Z64<>\"\",Y64<>\"\",Y64=AQ52),AND(Z64<>\"\",Y64<>\"\",Y64<>DISTANCE_Q,AQ52<>DISTANCE_Q)),\"ERR!\",\"\"))","v":""},{"$f":"IF(Z64=\"\",\"\",IF(Z64=\"G\",(NB_SETS_G_Q*2)-1-COUNTIF(AM52:AQ52,DISTANCE_Q),COUNTIF(U64:Y64,DISTANCE_Q)))","v":""},{"$f":"IF(OR(COUNTIF(AA64:AE64,\"\")<>COUNTIF(AM56:AQ56,\"\"),AND(AF64=\"\",SUM(AA64:AE64)<>0)),\"!...\",IF(OR(AND(AF64<>\"\",AA64=\"\",AA64<>AM56),AND(AF64<>\"\",AA64<>\"\",AA64=AM56),AND(AF64<>\"\",AA64<>\"\",AA64<>DISTANCE_Q,AM56<>DISTANCE_Q)),\"ERR!\",\"\"))","v":""},{"$f":"IF(AA65=\"!...\",AA65,IF(OR(AND(AF64<>\"\",AB64=\"\",AB64<>AN56),AND(AF64<>\"\",AB64<>\"\",AB64=AN56),AND(AF64<>\"\",AB64<>\"\",AB64<>DISTANCE_Q,AN56<>DISTANCE_Q)),\"ERR!\",\"\"))","v":""},{"$f":"IF(AB65=\"!...\",AB65,IF(OR(AND(AF64<>\"\",AC64=\"\",AC64<>AO56),AND(AF64<>\"\",AC64<>\"\",AC64=AO56),AND(AF64<>\"\",AC64<>\"\",AC64<>DISTANCE_Q,AO56<>DISTANCE_Q)),\"ERR!\",\"\"))","v":""},{"$f":"IF(AC65=\"!...\",AC65,IF(OR(AND(AF64<>\"\",AD64=\"\",AD64<>AP56),AND(AF64<>\"\",AD64<>\"\",AD64=AP56),AND(AF64<>\"\",AD64<>\"\",AD64<>DISTANCE_Q,AP56<>DISTANCE_Q)),\"ERR!\",\"\"))","v":""},{"$f":"IF(AD65=\"!...\",AD65,IF(OR(AND(AF64<>\"\",AE64=\"\",AE64<>AQ56),AND(AF64<>\"\",AE64<>\"\",AE64=AQ56),AND(AF64<>\"\",AE64<>\"\",AE64<>DISTANCE_Q,AQ56<>DISTANCE_Q)),\"ERR!\",\"\"))","v":""},{"$f":"IF(AF64=\"\",\"\",IF(AF64=\"G\",(NB_SETS_G_Q*2)-1-COUNTIF(AM56:AQ56,DISTANCE_Q),COUNTIF(AA64:AE64,DISTANCE_Q)))","v":""},{"$f":"IF(OR(COUNTIF(AG64:AK64,\"\")<>COUNTIF(AM60:AQ60,\"\"),AND(AL64=\"\",SUM(AG64:AK64)<>0)),\"!...\",IF(OR(AND(AL64<>\"\",AG64=\"\",AG64<>AM60),AND(AL64<>\"\",AG64<>\"\",AG64=AM60),AND(AL64<>\"\",AG64<>\"\",AG64<>DISTANCE_Q,AM60<>DISTANCE_Q)),\"ERR!\",\"\"))","v":""},{"$f":"IF(AG65=\"!...\",AG65,IF(OR(AND(AL64<>\"\",AH64=\"\",AH64<>AN60),AND(AL64<>\"\",AH64<>\"\",AH64=AN60),AND(AL64<>\"\",AH64<>\"\",AH64<>DISTANCE_Q,AN60<>DISTANCE_Q)),\"ERR!\",\"\"))","v":""},{"$f":"IF(AH65=\"!...\",AH65,IF(OR(AND(AL64<>\"\",AI64=\"\",AI64<>AO60),AND(AL64<>\"\",AI64<>\"\",AI64=AO60),AND(AL64<>\"\",AI64<>\"\",AI64<>DISTANCE_Q,AO60<>DISTANCE_Q)),\"ERR!\",\"\"))","v":""},{"$f":"IF(AI65=\"!...\",AI65,IF(OR(AND(AL64<>\"\",AJ64=\"\",AJ64<>AP60),AND(AL64<>\"\",AJ64<>\"\",AJ64=AP60),AND(AL64<>\"\",AJ64<>\"\",AJ64<>DISTANCE_Q,AP60<>DISTANCE_Q)),\"ERR!\",\"\"))","v":""},{"$f":"IF(AJ65=\"!...\",AJ65,IF(OR(AND(AL64<>\"\",AK64=\"\",AK64<>AQ60),AND(AL64<>\"\",AK64<>\"\",AK64=AQ60),AND(AL64<>\"\",AK64<>\"\",AK64<>DISTANCE_Q,AQ60<>DISTANCE_Q)),\"ERR!\",\"\"))","v":""},{"$f":"IF(AL64=\"\",\"\",IF(AL64=\"G\",(NB_SETS_G_Q*2)-1-COUNTIF(AM60:AQ60,DISTANCE_Q),COUNTIF(AG64:AK64,DISTANCE_Q)))","v":""}]
[null,"Licence",null,null,null,null,null,{"$f":"IF(H64=\"\",\"\",IF(SUM(AM40:AQ40)<>0,ROUNDDOWN(SUM(C64:G64)/SUM(AM40:AQ40),3),\"\"))","v":""},null,null,null,null,null,{"$f":"IF(N64=\"\",\"\",IF(SUM(AM44:AQ44)<>0,ROUNDDOWN(SUM(I64:M64)/SUM(AM44:AQ44),3),\"\"))","v":""},null,null,null,null,null,{"$f":"IF(T64=\"\",\"\",IF(SUM(AM48:AQ48)<>0,ROUNDDOWN(SUM(O64:S64)/SUM(AM48:AQ48),3),\"\"))","v":""},null,null,null,null,null,{"$f":"IF(Z64=\"\",\"\",IF(SUM(AM52:AQ52)<>0,ROUNDDOWN(SUM(U64:Y64)/SUM(AM52:AQ52),3),\"\"))","v":""},null,null,null,null,null,{"$f":"IF(AF64=\"\",\"\",IF(SUM(AM56:AQ56)<>0,ROUNDDOWN(SUM(AA64:AE64)/SUM(AM56:AQ56),3),\"\"))","v":""},null,null,null,null,null,{"$f":"IF(AL64=\"\",\"\",IF(SUM(AM60:AQ60)<>0,ROUNDDOWN(SUM(AG64:AK64)/SUM(AM60:AQ60),3),\"\"))","v":""}]
[]
[]
[null,"Poule",{"$f":"\"J\" & RIGHT(B70,1) & \" \" &B71","v":"J1 Nom & Prénom"},null,null,null,null,null,{"$f":"\"J\" & RIGHT(B74,1) & \" \" &B75","v":"J2 Nom & Prénom"},null,null,null,null,null,{"$f":"\"J\" & RIGHT(B78,1) & \" \" &B79","v":"J3 Nom & Prénom"},null,null,null,null,null,{"$f":"\"J\" & RIGHT(B82,1) & \" \" &B83","v":"J4 Nom & Prénom"},null,null,null,null,null,{"$f":"\"J\" & RIGHT(B86,1) & \" \" &B87","v":"J5 Nom & Prénom"},null,null,null,null,null,{"$f":"\"J\" & RIGHT(B90,1) & \" \" &B91","v":"J6 Nom & Prénom"},null,null,null,null,null,null,null,null,null,null,null,null,null,null,null,null,null,null,"Clst","Pts Match","Pts Sets","Moy. Gen.","Moy. Part.","Pts marq.","Pts subis",null,"Calcul 1er"]
[null,"Joueur 1","Sets",null,null,null,null,"Match","set 1","set 2","set 3","set 4","set 5","J1-J2","set 1","set 2","set 3","set 4","set 5","J1-J3","set 1","set 2","set 3","set 4","set 5","J1-J4","set 1","set 2","set 3","set 4","set 5","J1-J5","set 1","set 2","set 3","set 4","set 5","J1-J6",null,null,null,null,null,null,null,null,null,null,null,null,null,{"$f":"IF(BH70<>\"\",RANK(BH70,BH70:BH93),\"\")","v":""},{"$f":"IF(TYPE_QUALIF=\"Poules 7J\",(COUNTIF(N71:AL71,\"G\")*VAL_PT_MATCH)+VAL_PT_MATCH,COUNTIF(N71:AL71,\"G\")*VAL_PT_MATCH)","v":0},{"$f":"IF(TYPE_QUALIF=\"Poules 7J\",(NB_SETS_G_Q*2-1)+SUM(AL72,AF72,Z72,T72,N72),SUM(AL72,AF72,Z72,T72,N72))","v":0},{"$f":"IF(BF70<>0,ROUNDDOWN(BE70/BF70,3),\"\")","v":""},{"$f":"MAX(N73,T73,Z73,AF73,AL73)","v":0},{"$f":"SUM(I71:M71,O71:S71,U71:Y71,AA71:AE71,AG71:AK71)","v":0},{"$f":"SUM(C75:G75,C79:G79,C83:G83,C87:G87,C91:G91)","v":0},null,{"$f":"IF(BC70<>\"\",(BA70*10000000)+(BB70*100000)+(BC70*10000)+BD70,\"\")","v":""}]
[null,"Nom & Prénom","Pts",null,null,null,null,"G/P",null,null,null,null,null,{"$f":"IF(COUNTIF(I71:M71,DISTANCE_Q)=NB_SETS_G_Q,\"G\",IF(COUNTIF(C75:G75,DISTANCE_Q)=NB_SETS_G_Q,\"P\",\"\"))","v":""},null,null,null,null,null,{"$f":"IF(COUNTIF(O71:S71,DISTANCE_Q)=NB_SETS_G_Q,\"G\",IF(COUNTIF(C79:G79,DISTANCE_Q)=NB_SETS_G_Q,\"P\",\"\"))","v":""},null,null,null,null,null,{"$f":"IF(COUNTIF(U71:Y71,DISTANCE_Q)=NB_SETS_G_Q,\"G\",IF(COUNTIF(C83:G83,DISTANCE_Q)=NB_SETS_G_Q,\"P\",\"\"))","v":""},null,null,null,null,null,{"$f":"IF(COUNTIF(AA71:AE71,DISTANCE_Q)=NB_SETS_G_Q,\"G\",IF(COUNTIF(C87:G87,DISTANCE_Q)=NB_SETS_G_Q,\"P\",\"\"))","v":""},null,null,null,null,null,{"$f":"IF(COUNTIF(AG71:AK71,DISTANCE_Q)=NB_SETS_G_Q,\"G\",IF(COUNTIF(C91:G91,DISTANCE_Q)=NB_SETS_G_Q,\"P\",\"\"))","v":""}]
[null,"Ville ou Club",null,null,null,null,null,"Pts de Sets",{"$f":"IF(OR(COUNTIF(I71:M71,\"\")<>COUNTIF(C75:G75,\"\"),AND(N71=\"\",SUM(I71:M71)<>0)),\"!...\",IF(OR(AND(N71<>\"\",I71=\"\",I71<>C75),AND(N71<>\"\",I71<>\"\",I71=C75),AND(N71<>\"\",I71<>\"\",I71<>DISTANCE_Q,C75<>DISTANCE_Q)),\"ERR!\",\"\"))","v":""},{"$f":"IF(I72=\"!...\",I72,IF(OR(AND(N71<>\"\",J71=\"\",J71<>D75),AND(N71<>\"\",J71<>\"\",J71=D75),AND(N71<>\"\",J71<>\"\",J71<>DISTANCE_Q,D75<>DISTANCE_Q)),\"ERR!\",\"\"))","v":""},{"$f":"IF(J72=\"!...\",J72,IF(OR(AND(N71<>\"\",K71=\"\",K71<>E75),AND(N71<>\"\",K71<>\"\",K71=E75),AND(N71<>\"\",K71<>\"\",K71<>DISTANCE_Q,E75<>DISTANCE_Q)),\"ERR!\",\"\"))","v":""},{"$f":"IF(K72=\"!...\",K72,IF(OR(AND(N71<>\"\",L71=\"\",L71<>F75),AND(N71<>\"\",L71<>\"\",L71=F75),AND(N71<>\"\",L71<>\"\",L71<>DISTANCE_Q,F75<>DISTANCE_Q)),\"ERR!\",\"\"))","v":""},{"$f":"IF(L72=\"!...\",L72,IF(OR(AND(N71<>\"\",M71=\"\",M71<>G75),AND(N71<>\"\",M71<>\"\",M71=G75),AND(N71<>\"\",M71<>\"\",M71<>DISTANCE_Q,G75<>DISTANCE_Q)),\"ERR!\",\"\"))","v":""},{"$f":"IF(N71=\"\",\"\",IF(N71=\"G\",(NB_SETS_G_Q*2)-1-COUNTIF(C75:G75,DISTANCE_Q),COUNTIF(I71:M71,DISTANCE_Q)))","v":""},{"$f":"IF(OR(COUNTIF(O71:S71,\"\")<>COUNTIF(C79:G79,\"\"),AND(T71=\"\",SUM(O71:S71)<>0)),\"!...\",IF(OR(AND(T71<>\"\",O71=\"\",O71<>C79),AND(T71<>\"\",O71<>\"\",O71=C79),AND(T71<>\"\",O71<>\"\",O71<>DISTANCE_Q,C79<>DISTANCE_Q)),\"ERR!\",\"\"))","v":""},{"$f":"IF(O72=\"!...\",O72,IF(OR(AND(T71<>\"\",P71=\"\",P71<>D79),AND(T71<>\"\",P71<>\"\",P71=D79),AND(T71<>\"\",P71<>\"\",P71<>DISTANCE_Q,D79<>DISTANCE_Q)),\"ERR!\",\"\"))","v":""},{"$f":"IF(P72=\"!...\",P72,IF(OR(AND(T71<>\"\",Q71=\"\",Q71<>E79),AND(T71<>\"\",Q71<>\"\",Q71=E79),AND(T71<>\"\",Q71<>\"\",Q71<>DISTANCE_Q,E79<>DISTANCE_Q)),\"ERR!\",\"\"))","v":""},{"$f":"IF(Q72=\"!...\",Q72,IF(OR(AND(T71<>\"\",R71=\"\",R71<>F79),AND(T71<>\"\",R71<>\"\",R71=F79),AND(T71<>\"\",R71<>\"\",R71<>DISTANCE_Q,F79<>DISTANCE_Q)),\"ERR!\",\"\"))","v":""},{"$f":"IF(R72=\"!...\",R72,IF(OR(AND(T71<>\"\",S71=\"\",S71<>G79),AND(T71<>\"\",S71<>\"\",S71=G79),AND(T71<>\"\",S71<>\"\",S71<>DISTANCE_Q,G79<>DISTANCE_Q)),\"ERR!\",\"\"))","v":""},{"$f":"IF(T71=\"\",\"\",IF(T71=\"G\",(NB_SETS_G_Q*2)-1-COUNTIF(C79:G79,DISTANCE_Q),COUNTIF(O71:S71,DISTANCE_Q)))","v":""},{"$f":"IF(OR(COUNTIF(U71:Y71,\"\")<>COUNTIF(C83:G83,\"\"),AND(Z71=\"\",SUM(U71:Y71)<>0)),\"!...\",IF(OR(AND(Z71<>\"\",U71=\"\",U71<>C83),AND(Z71<>\"\",U71<>\"\",U71=C83),AND(Z71<>\"\",U71<>\"\",U71<>DISTANCE_Q,C83<>DISTANCE_Q)),\"ERR!\",\"\"))","v":""},{"$f":"IF(U72=\"!...\",U72,IF(OR(AND(Z71<>\"\",V71=\"\",V71<>D83),AND(Z71<>\"\",V71<>\"\",V71=D83),AND(Z71<>\"\",V71<>\"\",V71<>DISTANCE_Q,D83<>DISTANCE_Q)),\"ERR!\",\"\"))","v":""},{"$f":"IF(V72=\"!...\",V72,IF(OR(AND(Z71<>\"\",W71=\"\",W71<>E83),AND(Z71<>\"\",W71<>\"\",W71=E83),AND(Z71<>\"\",W71<>\"\",W71<>DISTANCE_Q,E83<>DISTANCE_Q)),\"ERR!\",\"\"))","v":""},{"$f":"IF(W72=\"!...\",W72,IF(OR(AND(Z71<>\"\",X71=\"\",X71<>F83),AND(Z71<>\"\",X71<>\"\",X71=F83),AND(Z71<>\"\",X71<>\"\",X71<>DISTANCE_Q,F83<>DISTANCE_Q)),\"ERR!\",\"\"))","v":""},{"$f":"IF(X72=\"!...\",X72,IF(OR(AND(Z71<>\"\",Y71=\"\",Y71<>G83),AND(Z71<>\"\",Y71<>\"\",Y71=G83),AND(Z71<>\"\",Y71<>\"\",Y71<>DISTANCE_Q,G83<>DISTANCE_Q)),\"ERR!\",\"\"))","v":""},{"$f":"IF(Z71=\"\",\"\",IF(Z71=\"G\",(NB_SETS_G_Q*2)-1-COUNTIF(C83:G83,DISTANCE_Q),COUNTIF(U71:Y71,DISTANCE_Q)))","v":""},{"$f":"IF(OR(COUNTIF(AA71:AE71,\"\")<>COUNTIF(C87:G87,\"\"),AND(AF71=\"\",SUM(AA71:AE71)<>0)),\"!...\",IF(OR(AND(AF71<>\"\",AA71=\"\",AA71<>C87),AND(AF71<>\"\",AA71<>\"\",AA71=C87),AND(AF71<>\"\",AA71<>\"\",AA71<>DISTANCE_Q,C87<>DISTANCE_Q)),\"ERR!\",\"\"))","v":""},{"$f":"IF(AA72=\"!...\",AA72,IF(OR(AND(AF71<>\"\",AB71=\"\",AB71<>D87),AND(AF71<>\"\",AB71<>\"\",AB71=D87),AND(AF71<>\"\",AB71<>\"\",AB71<>DISTANCE_Q,D87<>DISTANCE_Q)),\"ERR!\",\"\"))","v":""},{"$f":"IF(AB72=\"!...\",AB72,IF(OR(AND(AF71<>\"\",AC71=\"\",AC71<>E87),AND(AF71<>\"\",AC71<>\"\",AC71=E87),AND(AF71<>\"\",AC71<>\"\",AC71<>DISTANCE_Q,E87<>DISTANCE_Q)),\"ERR!\",\"\"))","v":""},{"$f":"IF(AC72=\"!...\",AC72,IF(OR(AND(AF71<>\"\",AD71=\"\",AD71<>F87),AND(AF71<>\"\",AD71<>\"\",AD71=F87),AND(AF71<>\"\",AD71<>\"\",AD71<>DISTANCE_Q,F87<>DISTANCE_Q)),\"ERR!\",\"\"))","v":""},{"$f":"IF(AD72=\"!...\",AD72,IF(OR(AND(AF71<>\"\",AE71=\"\",AE71<>G87),AND(AF71<>\"\",AE71<>\"\",AE71=G87),AND(AF71<>\"\",AE71<>\"\",AE71<>DISTANCE_Q,G87<>DISTANCE_Q)),\"ERR!\",\"\"))","v":""},{"$f":"IF(AF71=\"\",\"\",IF(AF71=\"G\",(NB_SETS_G_Q*2)-1-COUNTIF(C87:G87,DISTANCE_Q),COUNTIF(AA71:AE71,DISTANCE_Q)))","v":""},{"$f":"IF(OR(COUNTIF(AG71:AK71,\"\")<>COUNTIF(C91:G91,\"\"),AND(AL71=\"\",SUM(AG71:AK71)<>0)),\"!...\",IF(OR(AND(AL71<>\"\",AG71=\"\",AG71<>C91),AND(AL71<>\"\",AG71<>\"\",AG71=C91),AND(AL71<>\"\",AG71<>\"\",AG71<>DISTANCE_Q,C91<>DISTANCE_Q)),\"ERR!\",\"\"))","v":""},{"$f":"IF(AG72=\"!...\",AG72,IF(OR(AND(AL71<>\"\",AH71=\"\",AH71<>D91),AND(AL71<>\"\",AH71<>\"\",AH71=D91),AND(AL71<>\"\",AH71<>\"\",AH71<>DISTANCE_Q,D91<>DISTANCE_Q)),\"ERR!\",\"\"))","v":""},{"$f":"IF(AH72=\"!...\",AH72,IF(OR(AND(AL71<>\"\",AI71=\"\",AI71<>E91),AND(AL71<>\"\",AI71<>\"\",AI71=E91),AND(AL71<>\"\",AI71<>\"\",AI71<>DISTANCE_Q,E91<>DISTANCE_Q)),\"ERR!\",\"\"))","v":""},{"$f":"IF(AI72=\"!...\",AI72,IF(OR(AND(AL71<>\"\",AJ71=\"\",AJ71<>F91),AND(AL71<>\"\",AJ71<>\"\",AJ71=F91),AND(AL71<>\"\",AJ71<>\"\",AJ71<>DISTANCE_Q,F91<>DISTANCE_Q)),\"ERR!\",\"\"))","v":""},{"$f":"IF(AJ72=\"!...\",AJ72,IF(OR(AND(AL71<>\"\",AK71=\"\",AK71<>G91),AND(AL71<>\"\",AK71<>\"\",AK71=G91),AND(AL71<>\"\",AK71<>\"\",AK71<>DISTANCE_Q,G91<>DISTANCE_Q)),\"ERR!\",\"\"))","v":""},{"$f":"IF(AL71=\"\",\"\",IF(AL71=\"G\",(NB_SETS_G_Q*2)-1-COUNTIF(C91:G91,DISTANCE_Q),COUNTIF(AG71:AK71,DISTANCE_Q)))","v":""}]
[null,"Licence",null,null,null,null,null,"Moyenne",null,null,null,null,null,{"$f":"IF(N71=\"\",\"\",IF(SUM(C75:G75)<>0,ROUNDDOWN(SUM(I71:M71)/SUM(C75:G75),3),\"\"))","v":""},null,null,null,null,null,{"$f":"IF(T71=\"\",\"\",IF(SUM(C79:G79)<>0,ROUNDDOWN(SUM(O71:S71)/SUM(C79:G79),3),\"\"))","v":""},null,null,null,null,null,{"$f":"IF(Z71=\"\",\"\",IF(SUM(C83:G83)<>0,ROUNDDOWN(SUM(U71:Y71)/SUM(C83:G83),3),\"\"))","v":""},null,null,null,null,null,{"$f":"IF(AF71=\"\",\"\",IF(SUM(C87:G87)<>0,ROUNDDOWN(SUM(AA71:AE71)/SUM(C87:G87),3),\"\"))","v":""},null,null,null,null,null,{"$f":"IF(AL71=\"\",\"\",IF(SUM(C91:G91)<>0,ROUNDDOWN(SUM(AG71:AK71)/SUM(C91:G91),3),\"\"))","v":""}]
[null,"Joueur 2","set 1","set 2","set 3","set 4","set 5","J1-J2",null,null,null,null,null,null,"set 1","set 2","set 3","set 4","set 5","J2-J3","set 1","set 2","set 3","set 4","set 5","J2-J4","set 1","set 2","set 3","set 4","set 5","J2-J5","set 1","set 2","set 3","set 4","set 5","J2-J6",null,null,null,null,null,null,null,null,null,null,null,null,null,{"$f":"IF(BH74<>\"\",RANK(BH74,BH70:BH93),\"\")","v":""},{"$f":"IF(TYPE_QUALIF=\"Poules 7J\",(COUNTIF(H75:AL75,\"G\")*VAL_PT_MATCH)+VAL_PT_MATCH,COUNTIF(H75:AL75,\"G\")*VAL_PT_MATCH)","v":0},{"$f":"IF(TYPE_QUALIF=\"Poules 7J\",(NB_SETS_G_Q*2-1)+SUM(AL76,AF76,Z76,T76,H76),SUM(AL76,AF76,Z76,T76,H76))","v":0},{"$f":"IF(BF74<>0,ROUNDDOWN(BE74/BF74,3),\"\")","v":""},{"$f":"MAX(H77,T77,Z77,AF77,AL77)","v":0},{"$f":"SUM(C75:G75,O75:S75,U75:Y75,AA75:AE75,AG75:AK75)","v":0},{"$f":"SUM(I79:M79,I83:M83,I87:M87,I91:M91,I71:M71)","v":0},null,{"$f":"IF(BC74<>\"\",(BA74*10000000)+(BB74*100000)+(BC74*10000)+BD74,\"\")","v":""}]
[null,"Nom & Prénom",null,null,null,null,null,{"$f":"IF(COUNTIF(C75:G75,DISTANCE_Q)=NB_SETS_G_Q,\"G\",IF(COUNTIF(I71:M71,DISTANCE_Q)=NB_SETS_G_Q,\"P\",\"\"))","v":""},null,null,null,null,null,null,null,null,null,null,null,{"$f":"IF(COUNTIF(O75:S75,DISTANCE_Q)=NB_SETS_G_Q,\"G\",IF(COUNTIF(I79:M79,DISTANCE_Q)=NB_SETS_G_Q,\"P\",\"\"))","v":""},null,null,null,null,null,{"$f":"IF(COUNTIF(U75:Y75,DISTANCE_Q)=NB_SETS_G_Q,\"G\",IF(COUNTIF(I83:M83,DISTANCE_Q)=NB_SETS_G_Q,\"P\",\"\"))","v":""},null,null,null,null,null,{"$f":"IF(COUNTIF(AA75:AE75,DISTANCE_Q)=NB_SETS_G_Q,\"G\",IF(COUNTIF(I87:M87,DISTANCE_Q)=NB_SETS_G_Q,\"P\",\"\"))","v":""},null,null,null,null,null,{"$f":"IF(COUNTIF(AG75:AK75,DISTANCE_Q)=NB_SETS_G_Q,\"G\",IF(COUNTIF(I91:M91,DISTANCE_Q)=NB_SETS_G_Q,\"P\",\"\"))","v":""}]
[null,"Ville ou Club",{"$f":"IF(OR(COUNTIF(C75:G75,\"\")<>COUNTIF(I71:M71,\"\"),AND(H75=\"\",SUM(C75:G75)<>0)),\"!...\",IF(OR(AND(H75<>\"\",C75=\"\",C75<>I71),AND(H75<>\"\",C75<>\"\",C75=I71),AND(H75<>\"\",C75<>\"\",C75<>DISTANCE_Q,I71<>DISTANCE_Q)),\"ERR!\",\"\"))","v":""},{"$f":"IF(C76=\"!...\",C76,IF(OR(AND(H75<>\"\",D75=\"\",D75<>J71),AND(H75<>\"\",D75<>\"\",D75=J71),AND(H75<>\"\",D75<>\"\",D75<>DISTANCE_Q,J71<>DISTANCE_Q)),\"ERR!\",\"\"))","v":""},{"$f":"IF(D76=\"!...\",D76,IF(OR(AND(H75<>\"\",E75=\"\",E75<>K71),AND(H75<>\"\",E75<>\"\",E75=K71),AND(H75<>\"\",E75<>\"\",E75<>DISTANCE_Q,K71<>DISTANCE_Q)),\"ERR!\",\"\"))","v":""},{"$f":"IF(E76=\"!...\",E76,IF(OR(AND(H75<>\"\",F75=\"\",F75<>L71),AND(H75<>\"\",F75<>\"\",F75=L71),AND(H75<>\"\",F75<>\"\",F75<>DISTANCE_Q,L71<>DISTANCE_Q)),\"ERR!\",\"\"))","v":""},{"$f":"IF(F76=\"!...\",F76,IF(OR(AND(H75<>\"\",G75=\"\",G75<>M71),AND(H75<>\"\",G75<>\"\",G75=M71),AND(H75<>\"\",G75<>\"\",G75<>DISTANCE_Q,M71<>DISTANCE_Q)),\"ERR!\",\"\"))","v":""},{"$f":"IF(H75=\"\",\"\",IF(H75=\"G\",(NB_SETS_G_Q*2)-1-COUNTIF(I71:M71,DISTANCE_Q),COUNTIF(C75:G75,DISTANCE_Q)))","v":""},null,null,null,null,null,null,{"$f":"IF(OR(COUNTIF(O75:S75,\"\")<>COUNTIF(I79:M79,\"\"),AND(T75=\"\",SUM(O75:S75)<>0)),\"!...\",IF(OR(AND(T75<>\"\",O75=\"\",O75<>I79),AND(T75<>\"\",O75<>\"\",O75=I79),AND(T75<>\"\",O75<>\"\",O75<>DISTANCE_Q,I79<>DISTANCE_Q)),\"ERR!\",\"\"))","v":""},{"$f":"IF(O76=\"!...\",O76,IF(OR(AND(T75<>\"\",P75=\"\",P75<>J79),AND(T75<>\"\",P75<>\"\",P75=J79),AND(T75<>\"\",P75<>\"\",P75<>DISTANCE_Q,J79<>DISTANCE_Q)),\"ERR!\",\"\"))","v":""},{"$f":"IF(P76=\"!...\",P76,IF(OR(AND(T75<>\"\",Q75=\"\",Q75<>K79),AND(T75<>\"\",Q75<>\"\",Q75=K79),AND(T75<>\"\",Q75<>\"\",Q75<>DISTANCE_Q,K79<>DISTANCE_Q)),\"ERR!\",\"\"))","v":""},{"$f":"IF(Q76=\"!...\",Q76,IF(OR(AND(T75<>\"\",R75=\"\",R75<>L79),AND(T75<>\"\",R75<>\"\",R75=L79),AND(T75<>\"\",R75<>\"\",R75<>DISTANCE_Q,L79<>DISTANCE_Q)),\"ERR!\",\"\"))","v":""},{"$f":"IF(R76=\"!...\",R76,IF(OR(AND(T75<>\"\",S75=\"\",S75<>M79),AND(T75<>\"\",S75<>\"\",S75=M79),AND(T75<>\"\",S75<>\"\",S75<>DISTANCE_Q,M79<>DISTANCE_Q)),\"ERR!\",\"\"))","v":""},{"$f":"IF(T75=\"\",\"\",IF(T75=\"G\",(NB_SETS_G_Q*2)-1-COUNTIF(I79:M79,DISTANCE_Q),COUNTIF(O75:S75,DISTANCE_Q)))","v":""},{"$f":"IF(OR(COUNTIF(U75:Y75,\"\")<>COUNTIF(I83:M83,\"\"),AND(Z75=\"\",SUM(U75:Y75)<>0)),\"!...\",IF(OR(AND(Z75<>\"\",U75=\"\",U75<>I83),AND(Z75<>\"\",U75<>\"\",U75=I83),AND(Z75<>\"\",U75<>\"\",U75<>DISTANCE_Q,I83<>DISTANCE_Q)),\"ERR!\",\"\"))","v":""},{"$f":"IF(U76=\"!...\",U76,IF(OR(AND(Z75<>\"\",V75=\"\",V75<>J83),AND(Z75<>\"\",V75<>\"\",V75=J83),AND(Z75<>\"\",V75<>\"\",V75<>DISTANCE_Q,J83<>DISTANCE_Q)),\"ERR!\",\"\"))","v":""},{"$f":"IF(V76=\"!...\",V76,IF(OR(AND(Z75<>\"\",W75=\"\",W75<>K83),AND(Z75<>\"\",W75<>\"\",W75=K83),AND(Z75<>\"\",W75<>\"\",W75<>DISTANCE_Q,K83<>DISTANCE_Q)),\"ERR!\",\"\"))","v":""},{"$f":"IF(W76=\"!...\",W76,IF(OR(AND(Z75<>\"\",X75=\"\",X75<>L83),AND(Z75<>\"\",X75<>\"\",X75=L83),AND(Z75<>\"\",X75<>\"\",X75<>DISTANCE_Q,L83<>DISTANCE_Q)),\"ERR!\",\"\"))","v":""},{"$f":"IF(X76=\"!...\",X76,IF(OR(AND(Z75<>\"\",Y75=\"\",Y75<>M83),AND(Z75<>\"\",Y75<>\"\",Y75=M83),AND(Z75<>\"\",Y75<>\"\",Y75<>DISTANCE_Q,M83<>DISTANCE_Q)),\"ERR!\",\"\"))","v":""},{"$f":"IF(Z75=\"\",\"\",IF(Z75=\"G\",(NB_SETS_G_Q*2)-1-COUNTIF(I83:M83,DISTANCE_Q),COUNTIF(U75:Y75,DISTANCE_Q)))","v":""},{"$f":"IF(OR(COUNTIF(AA75:AE75,\"\")<>COUNTIF(I87:M87,\"\"),AND(AF75=\"\",SUM(AA75:AE75)<>0)),\"!...\",IF(OR(AND(AF75<>\"\",AA75=\"\",AA75<>I87),AND(AF75<>\"\",AA75<>\"\",AA75=I87),AND(AF75<>\"\",AA75<>\"\",AA75<>DISTANCE_Q,I87<>DISTANCE_Q)),\"ERR!\",\"\"))","v":""},{"$f":"IF(AA76=\"!...\",AA76,IF(OR(AND(AF75<>\"\",AB75=\"\",AB75<>J87),AND(AF75<>\"\",AB75<>\"\",AB75=J87),AND(AF75<>\"\",AB75<>\"\",AB75<>DISTANCE_Q,J87<>DISTANCE_Q)),\"ERR!\",\"\"))","v":""},{"$f":"IF(AB76=\"!...\",AB76,IF(OR(AND(AF75<>\"\",AC75=\"\",AC75<>K87),AND(AF75<>\"\",AC75<>\"\",AC75=K87),AND(AF75<>\"\",AC75<>\"\",AC75<>DISTANCE_Q,K87<>DISTANCE_Q)),\"ERR!\",\"\"))","v":""},{"$f":"IF(AC76=\"!...\",AC76,IF(OR(AND(AF75<>\"\",AD75=\"\",AD75<>L87),AND(AF75<>\"\",AD75<>\"\",AD75=L87),AND(AF75<>\"\",AD75<>\"\",AD75<>DISTANCE_Q,L87<>DISTANCE_Q)),\"ERR!\",\"\"))","v":""},{"$f":"IF(AD76=\"!...\",AD76,IF(OR(AND(AF75<>\"\",AE75=\"\",AE75<>M87),AND(AF75<>\"\",AE75<>\"\",AE75=M87),AND(AF75<>\"\",AE75<>\"\",AE75<>DISTANCE_Q,M87<>DISTANCE_Q)),\"ERR!\",\"\"))","v":""},{"$f":"IF(AF75=\"\",\"\",IF(AF75=\"G\",(NB_SETS_G_Q*2)-1-COUNTIF(I87:M87,DISTANCE_Q),COUNTIF(AA75:AE75,DISTANCE_Q)))","v":""},{"$f":"IF(OR(COUNTIF(AG75:AK75,\"\")<>COUNTIF(I91:M91,\"\"),AND(AL75=\"\",SUM(AG75:AK75)<>0)),\"!...\",IF(OR(AND(AL75<>\"\",AG75=\"\",AG75<>I91),AND(AL75<>\"\",AG75<>\"\",AG75=I91),AND(AL75<>\"\",AG75<>\"\",AG75<>DISTANCE_Q,I91<>DISTANCE_Q)),\"ERR!\",\"\"))","v":""},{"$f":"IF(AG76=\"!...\",AG76,IF(OR(AND(AL75<>\"\",AH75=\"\",AH75<>J91),AND(AL75<>\"\",AH75<>\"\",AH75=J91),AND(AL75<>\"\",AH75<>\"\",AH75<>DISTANCE_Q,J91<>DISTANCE_Q)),\"ERR!\",\"\"))","v":""},{"$f":"IF(AH76=\"!...\",AH76,IF(OR(AND(AL75<>\"\",AI75=\"\",AI75<>K91),AND(AL75<>\"\",AI75<>\"\",AI75=K91),AND(AL75<>\"\",AI75<>\"\",AI75<>DISTANCE_Q,K91<>DISTANCE_Q)),\"ERR!\",\"\"))","v":""},{"$f":"IF(AI76=\"!...\",AI76,IF(OR(AND(AL75<>\"\",AJ75=\"\",AJ75<>L91),AND(AL75<>\"\",AJ75<>\"\",AJ75=L91),AND(AL75<>\"\",AJ75<>\"\",AJ75<>DISTANCE_Q,L91<>DISTANCE_Q)),\"ERR!\",\"\"))","v":""},{"$f":"IF(AJ76=\"!...\",AJ76,IF(OR(AND(AL75<>\"\",AK75=\"\",AK75<>M91),AND(AL75<>\"\",AK75<>\"\",AK75=M91),AND(AL75<>\"\",AK75<>\"\",AK75<>DISTANCE_Q,M91<>DISTANCE_Q)),\"ERR!\",\"\"))","v":""},{"$f":"IF(AL75=\"\",\"\",IF(AL75=\"G\",(NB_SETS_G_Q*2)-1-COUNTIF(I91:M91,DISTANCE_Q),COUNTIF(AG75:AK75,DISTANCE_Q)))","v":""}]
[null,"Licence",null,null,null,null,null,{"$f":"IF(H75=\"\",\"\",IF(SUM(I71:M71)<>0,ROUNDDOWN(SUM(C75:G75)/SUM(I71:M71),3),\"\"))","v":""},null,null,null,null,null,null,null,null,null,null,null,{"$f":"IF(T75=\"\",\"\",IF(SUM(I79:M79)<>0,ROUNDDOWN(SUM(O75:S75)/SUM(I79:M79),3),\"\"))","v":""},null,null,null,null,null,{"$f":"IF(Z75=\"\",\"\",IF(SUM(I83:M83)<>0,ROUNDDOWN(SUM(U75:Y75)/SUM(I83:M83),3),\"\"))","v":""},null,null,null,null,null,{"$f":"IF(AF75=\"\",\"\",IF(SUM(I87:M87)<>0,ROUNDDOWN(SUM(AA75:AE75)/SUM(I87:M87),3),\"\"))","v":""},null,null,null,null,null,{"$f":"IF(AL75=\"\",\"\",IF(SUM(I91:M91)<>0,ROUNDDOWN(SUM(AG75:AK75)/SUM(I91:M91),3),\"\"))","v":""}]
[null,"Joueur 3","set 1","set 2","set 3","set 4","set 5","J1-J3","set 1","set 2","set 3","set 4","set 5","J2-J3",null,null,null,null,null,null,"set 1","set 2","set 3","set 4","set 5","J3-J4","set 1","set 2","set 3","set 4","set 5","J3-J5","set 1","set 2","set 3","set 4","set 5","J3-J6",null,null,null,null,null,null,null,null,null,null,null,null,null,{"$f":"IF(BH78<>\"\",RANK(BH78,BH70:BH93),\"\")","v":""},{"$f":"IF(TYPE_QUALIF=\"Poules 7J\",(COUNTIF(H79:AL79,\"G\")*VAL_PT_MATCH)+VAL_PT_MATCH,COUNTIF(H79:AL79,\"G\")*VAL_PT_MATCH)","v":0},{"$f":"IF(TYPE_QUALIF=\"Poules 7J\",(NB_SETS_G_Q*2-1)+SUM(AL80,AF80,Z80,H80,N80),SUM(AL80,AF80,Z80,H80,N80))","v":0},{"$f":"IF(BF78<>0,ROUNDDOWN(BE78/BF78,3),\"\")","v":""},{"$f":"MAX(N81,H81,Z81,AF81,AL81)","v":0},{"$f":"SUM(I79:M79,C79:G79,U79:Y79,AA79:AE79,AG79:AK79)","v":0},{"$f":"SUM(O83:S83,O87:S87,O91:S91,O75:S75,O71:S71)","v":0},null,{"$f":"IF(BC78<>\"\",(BA78*10000000)+(BB78*100000)+(BC78*10000)+BD78,\"\")","v":""}]
[null,"Nom & Prénom",null,null,null,null,null,{"$f":"IF(COUNTIF(C79:G79,DISTANCE_Q)=NB_SETS_G_Q,\"G\",IF(COUNTIF(O71:S71,DISTANCE_Q)=NB_SETS_G_Q,\"P\",\"\"))","v":""},null,null,null,null,null,{"$f":"IF(COUNTIF(I79:M79,DISTANCE_Q)=NB_SETS_G_Q,\"G\",IF(COUNTIF(O75:S75,DISTANCE_Q)=NB_SETS_G_Q,\"P\",\"\"))","v":""},null,null,null,null,null,null,null,null,null,null,null,{"$f":"IF(COUNTIF(U79:Y79,DISTANCE_Q)=NB_SETS_G_Q,\"G\",IF(COUNTIF(O83:S83,DISTANCE_Q)=NB_SETS_G_Q,\"P\",\"\"))","v":""},null,null,null,null,null,{"$f":"IF(COUNTIF(AA79:AE79,DISTANCE_Q)=NB_SETS_G_Q,\"G\",IF(COUNTIF(O87:S87,DISTANCE_Q)=NB_SETS_G_Q,\"P\",\"\"))","v":""},null,null,null,null,null,{"$f":"IF(COUNTIF(AG79:AK79,DISTANCE_Q)=NB_SETS_G_Q,\"G\",IF(COUNTIF(O91:S91,DISTANCE_Q)=NB_SETS_G_Q,\"P\",\"\"))","v":""}]
[null,"Ville ou Club",{"$f":"IF(OR(COUNTIF(C79:G79,\"\")<>COUNTIF(O71:S71,\"\"),AND(H79=\"\",SUM(C79:G79)<>0)),\"!...\",IF(OR(AND(H79<>\"\",C79=\"\",C79<>O71),AND(H79<>\"\",C79<>\"\",C79=O71),AND(H79<>\"\",C79<>\"\",C79<>DISTANCE_Q,O71<>DISTANCE_Q)),\"ERR!\",\"\"))","v":""},{"$f":"IF(C80=\"!...\",C80,IF(OR(AND(H79<>\"\",D79=\"\",D79<>P71),AND(H79<>\"\",D79<>\"\",D79=P71),AND(H79<>\"\",D79<>\"\",D79<>DISTANCE_Q,P71<>DISTANCE_Q)),\"ERR!\",\"\"))","v":""},{"$f":"IF(D80=\"!...\",D80,IF(OR(AND(H79<>\"\",E79=\"\",E79<>Q71),AND(H79<>\"\",E79<>\"\",E79=Q71),AND(H79<>\"\",E79<>\"\",E79<>DISTANCE_Q,Q71<>DISTANCE_Q)),\"ERR!\",\"\"))","v":""},{"$f":"IF(E80=\"!...\",E80,IF(OR(AND(H79<>\"\",F79=\"\",F79<>R71),AND(H79<>\"\",F79<>\"\",F79=R71),AND(H79<>\"\",F79<>\"\",F79<>DISTANCE_Q,R71<>DISTANCE_Q)),\"ERR!\",\"\"))","v":""},{"$f":"IF(F80=\"!...\",F80,IF(OR(AND(H79<>\"\",G79=\"\",G79<>S71),AND(H79<>\"\",G79<>\"\",G79=S71),AND(H79<>\"\",G79<>\"\",G79<>DISTANCE_Q,S71<>DISTANCE_Q)),\"ERR!\",\"\"))","v":""},{"$f":"IF(H79=\"\",\"\",IF(H79=\"G\",(NB_SETS_G_Q*2)-1-COUNTIF(O71:S71,DISTANCE_Q),COUNTIF(C79:G79,DISTANCE_Q)))","v":""},{"$f":"IF(OR(COUNTIF(I79:M79,\"\")<>COUNTIF(O75:S75,\"\"),AND(N79=\"\",SUM(I79:M79)<>0)),\"!...\",IF(OR(AND(N79<>\"\",I79=\"\",I79<>O75),AND(N79<>\"\",I79<>\"\",I79=O75),AND(N79<>\"\",I79<>\"\",I79<>DISTANCE_Q,O75<>DISTANCE_Q)),\"ERR!\",\"\"))","v":""},{"$f":"IF(I80=\"!...\",I80,IF(OR(AND(N79<>\"\",J79=\"\",J79<>P75),AND(N79<>\"\",J79<>\"\",J79=P75),AND(N79<>\"\",J79<>\"\",J79<>DISTANCE_Q,P75<>DISTANCE_Q)),\"ERR!\",\"\"))","v":""},{"$f":"IF(J80=\"!...\",J80,IF(OR(AND(N79<>\"\",K79=\"\",K79<>Q75),AND(N79<>\"\",K79<>\"\",K79=Q75),AND(N79<>\"\",K79<>\"\",K79<>DISTANCE_Q,Q75<>DISTANCE_Q)),\"ERR!\",\"\"))","v":""},{"$f":"IF(K80=\"!...\",K80,IF(OR(AND(N79<>\"\",L79=\"\",L79<>R75),AND(N79<>\"\",L79<>\"\",L79=R75),AND(N79<>\"\",L79<>\"\",L79<>DISTANCE_Q,R75<>DISTANCE_Q)),\"ERR!\",\"\"))","v":""},{"$f":"IF(L80=\"!...\",L80,IF(OR(AND(N79<>\"\",M79=\"\",M79<>S75),AND(N79<>\"\",M79<>\"\",M79=S75),AND(N79<>\"\",M79<>\"\",M79<>DISTANCE_Q,S75<>DISTANCE_Q)),\"ERR!\",\"\"))","v":""},{"$f":"IF(N79=\"\",\"\",IF(N79=\"G\",(NB_SETS_G_Q*2)-1-COUNTIF(O75:S75,DISTANCE_Q),COUNTIF(I79:M79,DISTANCE_Q)))","v":""},null,null,null,null,null,null,{"$f":"IF(OR(COUNTIF(U79:Y79,\"\")<>COUNTIF(O83:S83,\"\"),AND(Z79=\"\",SUM(U79:Y79)<>0)),\"!...\",IF(OR(AND(Z79<>\"\",U79=\"\",U79<>O83),AND(Z79<>\"\",U79<>\"\",U79=O83),AND(Z79<>\"\",U79<>\"\",U79<>DISTANCE_Q,O83<>DISTANCE_Q)),\"ERR!\",\"\"))","v":""},{"$f":"IF(U80=\"!...\",U80,IF(OR(AND(Z79<>\"\",V79=\"\",V79<>P83),AND(Z79<>\"\",V79<>\"\",V79=P83),AND(Z79<>\"\",V79<>\"\",V79<>DISTANCE_Q,P83<>DISTANCE_Q)),\"ERR!\",\"\"))","v":""},{"$f":"IF(V80=\"!...\",V80,IF(OR(AND(Z79<>\"\",W79=\"\",W79<>Q83),AND(Z79<>\"\",W79<>\"\",W79=Q83),AND(Z79<>\"\",W79<>\"\",W79<>DISTANCE_Q,Q83<>DISTANCE_Q)),\"ERR!\",\"\"))","v":""},{"$f":"IF(W80=\"!...\",W80,IF(OR(AND(Z79<>\"\",X79=\"\",X79<>R83),AND(Z79<>\"\",X79<>\"\",X79=R83),AND(Z79<>\"\",X79<>\"\",X79<>DISTANCE_Q,R83<>DISTANCE_Q)),\"ERR!\",\"\"))","v":""},{"$f":"IF(X80=\"!...\",X80,IF(OR(AND(Z79<>\"\",Y79=\"\",Y79<>S83),AND(Z79<>\"\",Y79<>\"\",Y79=S83),AND(Z79<>\"\",Y79<>\"\",Y79<>DISTANCE_Q,S83<>DISTANCE_Q)),\"ERR!\",\"\"))","v":""},{"$f":"IF(Z79=\"\",\"\",IF(Z79=\"G\",(NB_SETS_G_Q*2)-1-COUNTIF(O83:S83,DISTANCE_Q),COUNTIF(U79:Y79,DISTANCE_Q)))","v":""},{"$f":"IF(OR(COUNTIF(AA79:AE79,\"\")<>COUNTIF(O87:S87,\"\"),AND(AF79=\"\",SUM(AA79:AE79)<>0)),\"!...\",IF(OR(AND(AF79<>\"\",AA79=\"\",AA79<>O87),AND(AF79<>\"\",AA79<>\"\",AA79=O87),AND(AF79<>\"\",AA79<>\"\",AA79<>DISTANCE_Q,O87<>DISTANCE_Q)),\"ERR!\",\"\"))","v":""},{"$f":"IF(AA80=\"!...\",AA80,IF(OR(AND(AF79<>\"\",AB79=\"\",AB79<>P87),AND(AF79<>\"\",AB79<>\"\",AB79=P87),AND(AF79<>\"\",AB79<>\"\",AB79<>DISTANCE_Q,P87<>DISTANCE_Q)),\"ERR!\",\"\"))","v":""},{"$f":"IF(AB80=\"!...\",AB80,IF(OR(AND(AF79<>\"\",AC79=\"\",AC79<>Q87),AND(AF79<>\"\",AC79<>\"\",AC79=Q87),AND(AF79<>\"\",AC79<>\"\",AC79<>DISTANCE_Q,Q87<>DISTANCE_Q)),\"ERR!\",\"\"))","v":""},{"$f":"IF(AC80=\"!...\",AC80,IF(OR(AND(AF79<>\"\",AD79=\"\",AD79<>R87),AND(AF79<>\"\",AD79<>\"\",AD79=R87),AND(AF79<>\"\",AD79<>\"\",AD79<>DISTANCE_Q,R87<>DISTANCE_Q)),\"ERR!\",\"\"))","v":""},{"$f":"IF(AD80=\"!...\",AD80,IF(OR(AND(AF79<>\"\",AE79=\"\",AE79<>S87),AND(AF79<>\"\",AE79<>\"\",AE79=S87),AND(AF79<>\"\",AE79<>\"\",AE79<>DISTANCE_Q,S87<>DISTANCE_Q)),\"ERR!\",\"\"))","v":""},{"$f":"IF(AF79=\"\",\"\",IF(AF79=\"G\",(NB_SETS_G_Q*2)-1-COUNTIF(O87:S87,DISTANCE_Q),COUNTIF(AA79:AE79,DISTANCE_Q)))","v":""},{"$f":"IF(OR(COUNTIF(AG79:AK79,\"\")<>COUNTIF(O91:S91,\"\"),AND(AL79=\"\",SUM(AG79:AK79)<>0)),\"!...\",IF(OR(AND(AL79<>\"\",AG79=\"\",AG79<>O91),AND(AL79<>\"\",AG79<>\"\",AG79=O91),AND(AL79<>\"\",AG79<>\"\",AG79<>DISTANCE_Q,O91<>DISTANCE_Q)),\"ERR!\",\"\"))","v":""},{"$f":"IF(AG80=\"!...\",AG80,IF(OR(AND(AL79<>\"\",AH79=\"\",AH79<>P91),AND(AL79<>\"\",AH79<>\"\",AH79=P91),AND(AL79<>\"\",AH79<>\"\",AH79<>DISTANCE_Q,P91<>DISTANCE_Q)),\"ERR!\",\"\"))","v":""},{"$f":"IF(AH80=\"!...\",AH80,IF(OR(AND(AL79<>\"\",AI79=\"\",AI79<>Q91),AND(AL79<>\"\",AI79<>\"\",AI79=Q91),AND(AL79<>\"\",AI79<>\"\",AI79<>DISTANCE_Q,Q91<>DISTANCE_Q)),\"ERR!\",\"\"))","v":""},{"$f":"IF(AI80=\"!...\",AI80,IF(OR(AND(AL79<>\"\",AJ79=\"\",AJ79<>R91),AND(AL79<>\"\",AJ79<>\"\",AJ79=R91),AND(AL79<>\"\",AJ79<>\"\",AJ79<>DISTANCE_Q,R91<>DISTANCE_Q)),\"ERR!\",\"\"))","v":""},{"$f":"IF(AJ80=\"!...\",AJ80,IF(OR(AND(AL79<>\"\",AK79=\"\",AK79<>S91),AND(AL79<>\"\",AK79<>\"\",AK79=S91),AND(AL79<>\"\",AK79<>\"\",AK79<>DISTANCE_Q,S91<>DISTANCE_Q)),\"ERR!\",\"\"))","v":""},{"$f":"IF(AL79=\"\",\"\",IF(AL79=\"G\",(NB_SETS_G_Q*2)-1-COUNTIF(O91:S91,DISTANCE_Q),COUNTIF(AG79:AK79,DISTANCE_Q)))","v":""}]
[null,"Licence",null,null,null,null,null,{"$f":"IF(H79=\"\",\"\",IF(SUM(O71:S71)<>0,ROUNDDOWN(SUM(C79:G79)/SUM(O71:S71),3),\"\"))","v":""},null,null,null,null,null,{"$f":"IF(N79=\"\",\"\",IF(SUM(O75:S75)<>0,ROUNDDOWN(SUM(I79:M79)/SUM(O75:S75),3),\"\"))","v":""},null,null,null,null,null,null,null,null,null,null,null,{"$f":"IF(Z79=\"\",\"\",IF(SUM(O83:S83)<>0,ROUNDDOWN(SUM(U79:Y79)/SUM(O83:S83),3),\"\"))","v":""},null,null,null,null,null,{"$f":"IF(AF79=\"\",\"\",IF(SUM(O87:S87)<>0,ROUNDDOWN(SUM(AA79:AE79)/SUM(O87:S87),3),\"\"))","v":""},null,null,null,null,null,{"$f":"IF(AL79=\"\",\"\",IF(SUM(O91:S91)<>0,ROUNDDOWN(SUM(AG79:AK79)/SUM(O91:S91),3),\"\"))","v":""}]
[null,"Joueur 4","set 1","set 2","set 3","set 4","set 5","J1-J4","set 1","set 2","set 3","set 4","set 5","J2-J4","set 1","set 2","set 3","set 4","set 5","J3-J4",null,null,null,null,null,null,"set 1","set 2","set 3","set 4","set 5","J4-J5","set 1","set 2","set 3","set 4","set 5","J4-J6",null,null,null,null,null,null,null,null,null,null,null,null,null,{"$f":"IF(BH82<>\"\",RANK(BH82,BH70:BH93),\"\")","v":""},{"$f":"IF(TYPE_QUALIF=\"Poules 7J\",(COUNTIF(H83:AL83,\"G\")*VAL_PT_MATCH)+VAL_PT_MATCH,COUNTIF(H83:AL83,\"G\")*VAL_PT_MATCH)","v":0},{"$f":"IF(TYPE_QUALIF=\"Poules 7J\",(NB_SETS_G_Q*2-1)+SUM(AL84,AF84,H84,T84,N84),SUM(AL84,AF84,H84,T84,N84))","v":0},{"$f":"IF(BF82<>0,ROUNDDOWN(BE82/BF82,3),\"\")","v":""},{"$f":"MAX(N85,T85,H85,AF85,AL85)","v":0},{"$f":"SUM(I83:M83,O83:S83,C83:G83,AA83:AE83,AG83:AK83)","v":0},{"$f":"SUM(U87:Y87,U91:Y91,U79:Y79,U75:Y75,U71:Y71)","v":0},null,{"$f":"IF(BC82<>\"\",(BA82*10000000)+(BB82*100000)+(BC82*10000)+BD82,\"\")","v":""}]
[null,"Nom & Prénom",null,null,null,null,null,{"$f":"IF(COUNTIF(C83:G83,DISTANCE_Q)=NB_SETS_G_Q,\"G\",IF(COUNTIF(U71:Y71,DISTANCE_Q)=NB_SETS_G_Q,\"P\",\"\"))","v":""},null,null,null,null,null,{"$f":"IF(COUNTIF(I83:M83,DISTANCE_Q)=NB_SETS_G_Q,\"G\",IF(COUNTIF(U75:Y75,DISTANCE_Q)=NB_SETS_G_Q,\"P\",\"\"))","v":""},null,null,null,null,null,{"$f":"IF(COUNTIF(O83:S83,DISTANCE_Q)=NB_SETS_G_Q,\"G\",IF(COUNTIF(U79:Y79,DISTANCE_Q)=NB_SETS_G_Q,\"P\",\"\"))","v":""},null,null,null,null,null,null,null,null,null,null,null,{"$f":"IF(COUNTIF(AA83:AE83,DISTANCE_Q)=NB_SETS_G_Q,\"G\",IF(COUNTIF(U87:Y87,DISTANCE_Q)=NB_SETS_G_Q,\"P\",\"\"))","v":""},null,null,null,null,null,{"$f":"IF(COUNTIF(AG83:AK83,DISTANCE_Q)=NB_SETS_G_Q,\"G\",IF(COUNTIF(U91:Y91,DISTANCE_Q)=NB_SETS_G_Q,\"P\",\"\"))","v":""}]
[null,"Ville ou Club",{"$f":"IF(OR(COUNTIF(C83:G83,\"\")<>COUNTIF(U71:Y71,\"\"),AND(H83=\"\",SUM(C83:G83)<>0)),\"!...\",IF(OR(AND(H83<>\"\",C83=\"\",C83<>U71),AND(H83<>\"\",C83<>\"\",C83=U71),AND(H83<>\"\",C83<>\"\",C83<>DISTANCE_Q,U71<>DISTANCE_Q)),\"ERR!\",\"\"))","v":""},{"$f":"IF(C84=\"!...\",C84,IF(OR(AND(H83<>\"\",D83=\"\",D83<>V71),AND(H83<>\"\",D83<>\"\",D83=V71),AND(H83<>\"\",D83<>\"\",D83<>DISTANCE_Q,V71<>DISTANCE_Q)),\"ERR!\",\"\"))","v":""},{"$f":"IF(D84=\"!...\",D84,IF(OR(AND(H83<>\"\",E83=\"\",E83<>W71),AND(H83<>\"\",E83<>\"\",E83=W71),AND(H83<>\"\",E83<>\"\",E83<>DISTANCE_Q,W71<>DISTANCE_Q)),\"ERR!\",\"\"))","v":""},{"$f":"IF(E84=\"!...\",E84,IF(OR(AND(H83<>\"\",F83=\"\",F83<>X71),AND(H83<>\"\",F83<>\"\",F83=X71),AND(H83<>\"\",F83<>\"\",F83<>DISTANCE_Q,X71<>DISTANCE_Q)),\"ERR!\",\"\"))","v":""},{"$f":"IF(F84=\"!...\",F84,IF(OR(AND(H83<>\"\",G83=\"\",G83<>Y71),AND(H83<>\"\",G83<>\"\",G83=Y71),AND(H83<>\"\",G83<>\"\",G83<>DISTANCE_Q,Y71<>DISTANCE_Q)),\"ERR!\",\"\"))","v":""},{"$f":"IF(H83=\"\",\"\",IF(H83=\"G\",(NB_SETS_G_Q*2)-1-COUNTIF(U71:Y71,DISTANCE_Q),COUNTIF(C83:G83,DISTANCE_Q)))","v":""},{"$f":"IF(OR(COUNTIF(I83:M83,\"\")<>COUNTIF(U75:Y75,\"\"),AND(N83=\"\",SUM(I83:M83)<>0)),\"!...\",IF(OR(AND(N83<>\"\",I83=\"\",I83<>U75),AND(N83<>\"\",I83<>\"\",I83=U75),AND(N83<>\"\",I83<>\"\",I83<>DISTANCE_Q,U75<>DISTANCE_Q)),\"ERR!\",\"\"))","v":""},{"$f":"IF(I84=\"!...\",I84,IF(OR(AND(N83<>\"\",J83=\"\",J83<>V75),AND(N83<>\"\",J83<>\"\",J83=V75),AND(N83<>\"\",J83<>\"\",J83<>DISTANCE_Q,V75<>DISTANCE_Q)),\"ERR!\",\"\"))","v":""},{"$f":"IF(J84=\"!...\",J84,IF(OR(AND(N83<>\"\",K83=\"\",K83<>W75),AND(N83<>\"\",K83<>\"\",K83=W75),AND(N83<>\"\",K83<>\"\",K83<>DISTANCE_Q,W75<>DISTANCE_Q)),\"ERR!\",\"\"))","v":""},{"$f":"IF(K84=\"!...\",K84,IF(OR(AND(N83<>\"\",L83=\"\",L83<>X75),AND(N83<>\"\",L83<>\"\",L83=X75),AND(N83<>\"\",L83<>\"\",L83<>DISTANCE_Q,X75<>DISTANCE_Q)),\"ERR!\",\"\"))","v":""},{"$f":"IF(L84=\"!...\",L84,IF(OR(AND(N83<>\"\",M83=\"\",M83<>Y75),AND(N83<>\"\",M83<>\"\",M83=Y75),AND(N83<>\"\",M83<>\"\",M83<>DISTANCE_Q,Y75<>DISTANCE_Q)),\"ERR!\",\"\"))","v":""},{"$f":"IF(N83=\"\",\"\",IF(N83=\"G\",(NB_SETS_G_Q*2)-1-COUNTIF(U75:Y75,DISTANCE_Q),COUNTIF(I83:M83,DISTANCE_Q)))","v":""},{"$f":"IF(OR(COUNTIF(O83:S83,\"\")<>COUNTIF(U79:Y79,\"\"),AND(T83=\"\",SUM(O83:S83)<>0)),\"!...\",IF(OR(AND(T83<>\"\",O83=\"\",O83<>U79),AND(T83<>\"\",O83<>\"\",O83=U79),AND(T83<>\"\",O83<>\"\",O83<>DISTANCE_Q,U79<>DISTANCE_Q)),\"ERR!\",\"\"))","v":""},{"$f":"IF(O84=\"!...\",O84,IF(OR(AND(T83<>\"\",P83=\"\",P83<>V79),AND(T83<>\"\",P83<>\"\",P83=V79),AND(T83<>\"\",P83<>\"\",P83<>DISTANCE_Q,V79<>DISTANCE_Q)),\"ERR!\",\"\"))","v":""},{"$f":"IF(P84=\"!...\",P84,IF(OR(AND(T83<>\"\",Q83=\"\",Q83<>W79),AND(T83<>\"\",Q83<>\"\",Q83=W79),AND(T83<>\"\",Q83<>\"\",Q83<>DISTANCE_Q,W79<>DISTANCE_Q)),\"ERR!\",\"\"))","v":""},{"$f":"IF(Q84=\"!...\",Q84,IF(OR(AND(T83<>\"\",R83=\"\",R83<>X79),AND(T83<>\"\",R83<>\"\",R83=X79),AND(T83<>\"\",R83<>\"\",R83<>DISTANCE_Q,X79<>DISTANCE_Q)),\"ERR!\",\"\"))","v":""},{"$f":"IF(R84=\"!...\",R84,IF(OR(AND(T83<>\"\",S83=\"\",S83<>Y79),AND(T83<>\"\",S83<>\"\",S83=Y79),AND(T83<>\"\",S83<>\"\",S83<>DISTANCE_Q,Y79<>DISTANCE_Q)),\"ERR!\",\"\"))","v":""},{"$f":"IF(T83=\"\",\"\",IF(T83=\"G\",(NB_SETS_G_Q*2)-1-COUNTIF(U79:Y79,DISTANCE_Q),COUNTIF(O83:S83,DISTANCE_Q)))","v":""},null,null,null,null,null,null,{"$f":"IF(OR(COUNTIF(AA83:AE83,\"\")<>COUNTIF(U87:Y87,\"\"),AND(AF83=\"\",SUM(AA83:AE83)<>0)),\"!...\",IF(OR(AND(AF83<>\"\",AA83=\"\",AA83<>U87),AND(AF83<>\"\",AA83<>\"\",AA83=U87),AND(AF83<>\"\",AA83<>\"\",AA83<>DISTANCE_Q,U87<>DISTANCE_Q)),\"ERR!\",\"\"))","v":""},{"$f":"IF(AA84=\"!...\",AA84,IF(OR(AND(AF83<>\"\",AB83=\"\",AB83<>V87),AND(AF83<>\"\",AB83<>\"\",AB83=V87),AND(AF83<>\"\",AB83<>\"\",AB83<>DISTANCE_Q,V87<>DISTANCE_Q)),\"ERR!\",\"\"))","v":""},{"$f":"IF(AB84=\"!...\",AB84,IF(OR(AND(AF83<>\"\",AC83=\"\",AC83<>W87),AND(AF83<>\"\",AC83<>\"\",AC83=W87),AND(AF83<>\"\",AC83<>\"\",AC83<>DISTANCE_Q,W87<>DISTANCE_Q)),\"ERR!\",\"\"))","v":""},{"$f":"IF(AC84=\"!...\",AC84,IF(OR(AND(AF83<>\"\",AD83=\"\",AD83<>X87),AND(AF83<>\"\",AD83<>\"\",AD83=X87),AND(AF83<>\"\",AD83<>\"\",AD83<>DISTANCE_Q,X87<>DISTANCE_Q)),\"ERR!\",\"\"))","v":""},{"$f":"IF(AD84=\"!...\",AD84,IF(OR(AND(AF83<>\"\",AE83=\"\",AE83<>Y87),AND(AF83<>\"\",AE83<>\"\",AE83=Y87),AND(AF83<>\"\",AE83<>\"\",AE83<>DISTANCE_Q,Y87<>DISTANCE_Q)),\"ERR!\",\"\"))","v":""},{"$f":"IF(AF83=\"\",\"\",IF(AF83=\"G\",(NB_SETS_G_Q*2)-1-COUNTIF(U87:Y87,DISTANCE_Q),COUNTIF(AA83:AE83,DISTANCE_Q)))","v":""},{"$f":"IF(OR(COUNTIF(AG83:AK83,\"\")<>COUNTIF(U91:Y91,\"\"),AND(AL83=\"\",SUM(AG83:AK83)<>0)),\"!...\",IF(OR(AND(AL83<>\"\",AG83=\"\",AG83<>U91),AND(AL83<>\"\",AG83<>\"\",AG83=U91),AND(AL83<>\"\",AG83<>\"\",AG83<>DISTANCE_Q,U91<>DISTANCE_Q)),\"ERR!\",\"\"))","v":""},{"$f":"IF(AG84=\"!...\",AG84,IF(OR(AND(AL83<>\"\",AH83=\"\",AH83<>V91),AND(AL83<>\"\",AH83<>\"\",AH83=V91),AND(AL83<>\"\",AH83<>\"\",AH83<>DISTANCE_Q,V91<>DISTANCE_Q)),\"ERR!\",\"\"))","v":""},{"$f":"IF(AH84=\"!...\",AH84,IF(OR(AND(AL83<>\"\",AI83=\"\",AI83<>W91),AND(AL83<>\"\",AI83<>\"\",AI83=W91),AND(AL83<>\"\",AI83<>\"\",AI83<>DISTANCE_Q,W91<>DISTANCE_Q)),\"ERR!\",\"\"))","v":""},{"$f":"IF(AI84=\"!...\",AI84,IF(OR(AND(AL83<>\"\",AJ83=\"\",AJ83<>X91),AND(AL83<>\"\",AJ83<>\"\",AJ83=X91),AND(AL83<>\"\",AJ83<>\"\",AJ83<>DISTANCE_Q,X91<>DISTANCE_Q)),\"ERR!\",\"\"))","v":""},{"$f":"IF(AJ84=\"!...\",AJ84,IF(OR(AND(AL83<>\"\",AK83=\"\",AK83<>Y91),AND(AL83<>\"\",AK83<>\"\",AK83=Y91),AND(AL83<>\"\",AK83<>\"\",AK83<>DISTANCE_Q,Y91<>DISTANCE_Q)),\"ERR!\",\"\"))","v":""},{"$f":"IF(AL83=\"\",\"\",IF(AL83=\"G\",(NB_SETS_G_Q*2)-1-COUNTIF(U91:Y91,DISTANCE_Q),COUNTIF(AG83:AK83,DISTANCE_Q)))","v":""}]
[null,"Licence",null,null,null,null,null,{"$f":"IF(H83=\"\",\"\",IF(SUM(U71:Y71)<>0,ROUNDDOWN(SUM(C83:G83)/SUM(U71:Y71),3),\"\"))","v":""},null,null,null,null,null,{"$f":"IF(N83=\"\",\"\",IF(SUM(U75:Y75)<>0,ROUNDDOWN(SUM(I83:M83)/SUM(U75:Y75),3),\"\"))","v":""},null,null,null,null,null,{"$f":"IF(T83=\"\",\"\",IF(SUM(U79:Y79)<>0,ROUNDDOWN(SUM(O83:S83)/SUM(U79:Y79),3),\"\"))","v":""},null,null,null,null,null,null,null,null,null,null,null,{"$f":"IF(AF83=\"\",\"\",IF(SUM(U87:Y87)<>0,ROUNDDOWN(SUM(AA83:AE83)/SUM(U87:Y87),3),\"\"))","v":""},null,null,null,null,null,{"$f":"IF(AL83=\"\",\"\",IF(SUM(U91:Y91)<>0,ROUNDDOWN(SUM(AG83:AK83)/SUM(U91:Y91),3),\"\"))","v":""}]
[null,"Joueur 5","set 1","set 2","set 3","set 4","set 5","J1-J5","set 1","set 2","set 3","set 4","set 5","J2-J5","set 1","set 2","set 3","set 4","set 5","J3-J5","set 1","set 2","set 3","set 4","set 5","J4-J5",null,null,null,null,null,null,"set 1","set 2","set 3","set 4","set 5","J5-J6",null,null,null,null,null,null,null,null,null,null,null,null,null,{"$f":"IF(BH86<>\"\",RANK(BH86,BH70:BH93),\"\")","v":""},{"$f":"IF(TYPE_QUALIF=\"Poules 7J\",(COUNTIF(H87:AL87,\"G\")*VAL_PT_MATCH)+VAL_PT_MATCH,COUNTIF(H87:AL87,\"G\")*VAL_PT_MATCH)","v":0},{"$f":"IF(TYPE_QUALIF=\"Poules 7J\",(NB_SETS_G_Q*2-1)+SUM(AL88,H88,Z88,T88,N88),SUM(AL88,H88,Z88,T88,N88))","v":0},{"$f":"IF(BF86<>0,ROUNDDOWN(BE86/BF86,3),\"\")","v":""},{"$f":"MAX(N89,T89,Z89,H89,AL89)","v":0},{"$f":"SUM(I87:M87,O87:S87,U87:Y87,C87:G87,AG87:AK87)","v":0},{"$f":"SUM(AA91:AE91,AA83:AE83,AA79:AE79,AA75:AE75,AA71:AE71)","v":0},null,{"$f":"IF(BC86<>\"\",(BA86*10000000)+(BB86*100000)+(BC86*10000)+BD86,\"\")","v":""}]
[null,"Nom & Prénom",null,null,null,null,null,{"$f":"IF(COUNTIF(C87:G87,DISTANCE_Q)=NB_SETS_G_Q,\"G\",IF(COUNTIF(AA71:AE71,DISTANCE_Q)=NB_SETS_G_Q,\"P\",\"\"))","v":""},null,null,null,null,null,{"$f":"IF(COUNTIF(I87:M87,DISTANCE_Q)=NB_SETS_G_Q,\"G\",IF(COUNTIF(AA75:AE75,DISTANCE_Q)=NB_SETS_G_Q,\"P\",\"\"))","v":""},null,null,null,null,null,{"$f":"IF(COUNTIF(O87:S87,DISTANCE_Q)=NB_SETS_G_Q,\"G\",IF(COUNTIF(AA79:AE79,DISTANCE_Q)=NB_SETS_G_Q,\"P\",\"\"))","v":""},null,null,null,null,null,{"$f":"IF(COUNTIF(U87:Y87,DISTANCE_Q)=NB_SETS_G_Q,\"G\",IF(COUNTIF(AA83:AE83,DISTANCE_Q)=NB_SETS_G_Q,\"P\",\"\"))","v":""},null,null,null,null,null,null,null,null,null,null,null,{"$f":"IF(COUNTIF(AG87:AK87,DISTANCE_Q)=NB_SETS_G_Q,\"G\",IF(COUNTIF(AA91:AE91,DISTANCE_Q)=NB_SETS_G_Q,\"P\",\"\"))","v":""}]
[null,"Ville ou Club",{"$f":"IF(OR(COUNTIF(C87:G87,\"\")<>COUNTIF(AA71:AE71,\"\"),AND(H87=\"\",SUM(C87:G87)<>0)),\"!...\",IF(OR(AND(H87<>\"\",C87=\"\",C87<>AA71),AND(H87<>\"\",C87<>\"\",C87=AA71),AND(H87<>\"\",C87<>\"\",C87<>DISTANCE_Q,AA71<>DISTANCE_Q)),\"ERR!\",\"\"))","v":""},{"$f":"IF(C88=\"!...\",C88,IF(OR(AND(H87<>\"\",D87=\"\",D87<>AB71),AND(H87<>\"\",D87<>\"\",D87=AB71),AND(H87<>\"\",D87<>\"\",D87<>DISTANCE_Q,AB71<>DISTANCE_Q)),\"ERR!\",\"\"))","v":""},{"$f":"IF(D88=\"!...\",D88,IF(OR(AND(H87<>\"\",E87=\"\",E87<>AC71),AND(H87<>\"\",E87<>\"\",E87=AC71),AND(H87<>\"\",E87<>\"\",E87<>DISTANCE_Q,AC71<>DISTANCE_Q)),\"ERR!\",\"\"))","v":""},{"$f":"IF(E88=\"!...\",E88,IF(OR(AND(H87<>\"\",F87=\"\",F87<>AD71),AND(H87<>\"\",F87<>\"\",F87=AD71),AND(H87<>\"\",F87<>\"\",F87<>DISTANCE_Q,AD71<>DISTANCE_Q)),\"ERR!\",\"\"))","v":""},{"$f":"IF(F88=\"!...\",F88,IF(OR(AND(H87<>\"\",G87=\"\",G87<>AE71),AND(H87<>\"\",G87<>\"\",G87=AE71),AND(H87<>\"\",G87<>\"\",G87<>DISTANCE_Q,AE71<>DISTANCE_Q)),\"ERR!\",\"\"))","v":""},{"$f":"IF(H87=\"\",\"\",IF(H87=\"G\",(NB_SETS_G_Q*2)-1-COUNTIF(AA71:AE71,DISTANCE_Q),COUNTIF(C87:G87,DISTANCE_Q)))","v":""},{"$f":"IF(OR(COUNTIF(I87:M87,\"\")<>COUNTIF(AA75:AE75,\"\"),AND(N87=\"\",SUM(I87:M87)<>0)),\"!...\",IF(OR(AND(N87<>\"\",I87=\"\",I87<>AA75),AND(N87<>\"\",I87<>\"\",I87=AA75),AND(N87<>\"\",I87<>\"\",I87<>DISTANCE_Q,AA75<>DISTANCE_Q)),\"ERR!\",\"\"))","v":""},{"$f":"IF(I88=\"!...\",I88,IF(OR(AND(N87<>\"\",J87=\"\",J87<>AB75),AND(N87<>\"\",J87<>\"\",J87=AB75),AND(N87<>\"\",J87<>\"\",J87<>DISTANCE_Q,AB75<>DISTANCE_Q)),\"ERR!\",\"\"))","v":""},{"$f":"IF(J88=\"!...\",J88,IF(OR(AND(N87<>\"\",K87=\"\",K87<>AC75),AND(N87<>\"\",K87<>\"\",K87=AC75),AND(N87<>\"\",K87<>\"\",K87<>DISTANCE_Q,AC75<>DISTANCE_Q)),\"ERR!\",\"\"))","v":""},{"$f":"IF(K88=\"!...\",K88,IF(OR(AND(N87<>\"\",L87=\"\",L87<>AD75),AND(N87<>\"\",L87<>\"\",L87=AD75),AND(N87<>\"\",L87<>\"\",L87<>DISTANCE_Q,AD75<>DISTANCE_Q)),\"ERR!\",\"\"))","v":""},{"$f":"IF(L88=\"!...\",L88,IF(OR(AND(N87<>\"\",M87=\"\",M87<>AE75),AND(N87<>\"\",M87<>\"\",M87=AE75),AND(N87<>\"\",M87<>\"\",M87<>DISTANCE_Q,AE75<>DISTANCE_Q)),\"ERR!\",\"\"))","v":""},{"$f":"IF(N87=\"\",\"\",IF(N87=\"G\",(NB_SETS_G_Q*2)-1-COUNTIF(AA75:AE75,DISTANCE_Q),COUNTIF(I87:M87,DISTANCE_Q)))","v":""},{"$f":"IF(OR(COUNTIF(O87:S87,\"\")<>COUNTIF(AA79:AE79,\"\"),AND(T87=\"\",SUM(O87:S87)<>0)),\"!...\",IF(OR(AND(T87<>\"\",O87=\"\",O87<>AA79),AND(T87<>\"\",O87<>\"\",O87=AA79),AND(T87<>\"\",O87<>\"\",O87<>DISTANCE_Q,AA79<>DISTANCE_Q)),\"ERR!\",\"\"))","v":""},{"$f":"IF(O88=\"!...\",O88,IF(OR(AND(T87<>\"\",P87=\"\",P87<>AB79),AND(T87<>\"\",P87<>\"\",P87=AB79),AND(T87<>\"\",P87<>\"\",P87<>DISTANCE_Q,AB79<>DISTANCE_Q)),\"ERR!\",\"\"))","v":""},{"$f":"IF(P88=\"!...\",P88,IF(OR(AND(T87<>\"\",Q87=\"\",Q87<>AC79),AND(T87<>\"\",Q87<>\"\",Q87=AC79),AND(T87<>\"\",Q87<>\"\",Q87<>DISTANCE_Q,AC79<>DISTANCE_Q)),\"ERR!\",\"\"))","v":""},{"$f":"IF(Q88=\"!...\",Q88,IF(OR(AND(T87<>\"\",R87=\"\",R87<>AD79),AND(T87<>\"\",R87<>\"\",R87=AD79),AND(T87<>\"\",R87<>\"\",R87<>DISTANCE_Q,AD79<>DISTANCE_Q)),\"ERR!\",\"\"))","v":""},{"$f":"IF(R88=\"!...\",R88,IF(OR(AND(T87<>\"\",S87=\"\",S87<>AE79),AND(T87<>\"\",S87<>\"\",S87=AE79),AND(T87<>\"\",S87<>\"\",S87<>DISTANCE_Q,AE79<>DISTANCE_Q)),\"ERR!\",\"\"))","v":""},{"$f":"IF(T87=\"\",\"\",IF(T87=\"G\",(NB_SETS_G_Q*2)-1-COUNTIF(AA79:AE79,DISTANCE_Q),COUNTIF(O87:S87,DISTANCE_Q)))","v":""},{"$f":"IF(OR(COUNTIF(U87:Y87,\"\")<>COUNTIF(AA83:AE83,\"\"),AND(Z87=\"\",SUM(U87:Y87)<>0)),\"!...\",IF(OR(AND(Z87<>\"\",U87=\"\",U87<>AA83),AND(Z87<>\"\",U87<>\"\",U87=AA83),AND(Z87<>\"\",U87<>\"\",U87<>DISTANCE_Q,AA83<>DISTANCE_Q)),\"ERR!\",\"\"))","v":""},{"$f":"IF(U88=\"!...\",U88,IF(OR(AND(Z87<>\"\",V87=\"\",V87<>AB83),AND(Z87<>\"\",V87<>\"\",V87=AB83),AND(Z87<>\"\",V87<>\"\",V87<>DISTANCE_Q,AB83<>DISTANCE_Q)),\"ERR!\",\"\"))","v":""},{"$f":"IF(V88=\"!...\",V88,IF(OR(AND(Z87<>\"\",W87=\"\",W87<>AC83),AND(Z87<>\"\",W87<>\"\",W87=AC83),AND(Z87<>\"\",W87<>\"\",W87<>DISTANCE_Q,AC83<>DISTANCE_Q)),\"ERR!\",\"\"))","v":""},{"$f":"IF(W88=\"!...\",W88,IF(OR(AND(Z87<>\"\",X87=\"\",X87<>AD83),AND(Z87<>\"\",X87<>\"\",X87=AD83),AND(Z87<>\"\",X87<>\"\",X87<>DISTANCE_Q,AD83<>DISTANCE_Q)),\"ERR!\",\"\"))","v":""},{"$f":"IF(X88=\"!...\",X88,IF(OR(AND(Z87<>\"\",Y87=\"\",Y87<>AE83),AND(Z87<>\"\",Y87<>\"\",Y87=AE83),AND(Z87<>\"\",Y87<>\"\",Y87<>DISTANCE_Q,AE83<>DISTANCE_Q)),\"ERR!\",\"\"))","v":""},{"$f":"IF(Z87=\"\",\"\",IF(Z87=\"G\",(NB_SETS_G_Q*2)-1-COUNTIF(AA83:AE83,DISTANCE_Q),COUNTIF(U87:Y87,DISTANCE_Q)))","v":""},null,null,null,null,null,null,{"$f":"IF(OR(COUNTIF(AG87:AK87,\"\")<>COUNTIF(AA91:AE91,\"\"),AND(AL87=\"\",SUM(AG87:AK87)<>0)),\"!...\",IF(OR(AND(AL87<>\"\",AG87=\"\",AG87<>AA91),AND(AL87<>\"\",AG87<>\"\",AG87=AA91),AND(AL87<>\"\",AG87<>\"\",AG87<>DISTANCE_Q,AA91<>DISTANCE_Q)),\"ERR!\",\"\"))","v":""},{"$f":"IF(AG88=\"!...\",AG88,IF(OR(AND(AL87<>\"\",AH87=\"\",AH87<>AB91),AND(AL87<>\"\",AH87<>\"\",AH87=AB91),AND(AL87<>\"\",AH87<>\"\",AH87<>DISTANCE_Q,AB91<>DISTANCE_Q)),\"ERR!\",\"\"))","v":""},{"$f":"IF(AH88=\"!...\",AH88,IF(OR(AND(AL87<>\"\",AI87=\"\",AI87<>AC91),AND(AL87<>\"\",AI87<>\"\",AI87=AC91),AND(AL87<>\"\",AI87<>\"\",AI87<>DISTANCE_Q,AC91<>DISTANCE_Q)),\"ERR!\",\"\"))","v":""},{"$f":"IF(AI88=\"!...\",AI88,IF(OR(AND(AL87<>\"\",AJ87=\"\",AJ87<>AD91),AND(AL87<>\"\",AJ87<>\"\",AJ87=AD91),AND(AL87<>\"\",AJ87<>\"\",AJ87<>DISTANCE_Q,AD91<>DISTANCE_Q)),\"ERR!\",\"\"))","v":""},{"$f":"IF(AJ88=\"!...\",AJ88,IF(OR(AND(AL87<>\"\",AK87=\"\",AK87<>AE91),AND(AL87<>\"\",AK87<>\"\",AK87=AE91),AND(AL87<>\"\",AK87<>\"\",AK87<>DISTANCE_Q,AE91<>DISTANCE_Q)),\"ERR!\",\"\"))","v":""},{"$f":"IF(AL87=\"\",\"\",IF(AL87=\"G\",(NB_SETS_G_Q*2)-1-COUNTIF(AA91:AE91,DISTANCE_Q),COUNTIF(AG87:AK87,DISTANCE_Q)))","v":""}]
[null,"Licence",null,null,null,null,null,{"$f":"IF(H87=\"\",\"\",IF(SUM(AA71:AE71)<>0,ROUNDDOWN(SUM(C87:G87)/SUM(AA71:AE71),3),\"\"))","v":""},null,null,null,null,null,{"$f":"IF(N87=\"\",\"\",IF(SUM(AA75:AE75)<>0,ROUNDDOWN(SUM(I87:M87)/SUM(AA75:AE75),3),\"\"))","v":""},null,null,null,null,null,{"$f":"IF(T87=\"\",\"\",IF(SUM(AA79:AE79)<>0,ROUNDDOWN(SUM(O87:S87)/SUM(AA79:AE79),3),\"\"))","v":""},null,null,null,null,null,{"$f":"IF(Z87=\"\",\"\",IF(SUM(AA83:AE83)<>0,ROUNDDOWN(SUM(U87:Y87)/SUM(AA83:AE83),3),\"\"))","v":""},null,null,null,null,null,null,null,null,null,null,null,{"$f":"IF(AL87=\"\",\"\",IF(SUM(AA91:AE91)<>0,ROUNDDOWN(SUM(AG87:AK87)/SUM(AA91:AE91),3),\"\"))","v":""}]
[null,"Joueu 6","set 1","set 2","set 3","set 4","set 5","J1-J6","set 1","set 2","set 3","set 4","set 5","J2-J6","set 1","set 2","set 3","set 4","set 5","J3-J6","set 1","set 2","set 3","set 4","set 5","J4-J6","set 1","set 2","set 3","set 4","set 5","J5-J6",null,null,null,null,null,null,null,null,null,null,null,null,null,null,null,null,null,null,null,{"$f":"IF(BH90<>\"\",RANK(BH90,BH70:BH93),\"\")","v":""},{"$f":"IF(TYPE_QUALIF=\"Poules 7J\",(COUNTIF(H91:AL91,\"G\")*VAL_PT_MATCH)+VAL_PT_MATCH,COUNTIF(H91:AL91,\"G\")*VAL_PT_MATCH)","v":0},{"$f":"IF(TYPE_QUALIF=\"Poules 7J\",(NB_SETS_G_Q*2-1)+SUM(H92,AF92,Z92,T92,N92),SUM(H92,AF92,Z92,T92,N92))","v":0},{"$f":"IF(BF90<>0,ROUNDDOWN(BE90/BF90,3),\"\")","v":""},{"$f":"MAX(N93,T93,Z93,AF93,H93)","v":0},{"$f":"SUM(I91:M91,O91:S91,U91:Y91,AA91:AE91,C91:G91)","v":0},{"$f":"SUM(AG87:AK87,AG83:AK83,AG79:AK79,AG75:AK75,AG71:AK71)","v":0},null,{"$f":"IF(BC90<>\"\",(BA90*10000000)+(BB90*100000)+(BC90*10000)+BD90,\"\")","v":""}]
[null,"Nom & Prénom",null,null,null,null,null,{"$f":"IF(COUNTIF(C91:G91,DISTANCE_Q)=NB_SETS_G_Q,\"G\",IF(COUNTIF(AG71:AK71,DISTANCE_Q)=NB_SETS_G_Q,\"P\",\"\"))","v":""},null,null,null,null,null,{"$f":"IF(COUNTIF(I91:M91,DISTANCE_Q)=NB_SETS_G_Q,\"G\",IF(COUNTIF(AG75:AK75,DISTANCE_Q)=NB_SETS_G_Q,\"P\",\"\"))","v":""},null,null,null,null,null,{"$f":"IF(COUNTIF(O91:S91,DISTANCE_Q)=NB_SETS_G_Q,\"G\",IF(COUNTIF(AG79:AK79,DISTANCE_Q)=NB_SETS_G_Q,\"P\",\"\"))","v":""},null,null,null,null,null,{"$f":"IF(COUNTIF(U91:Y91,DISTANCE_Q)=NB_SETS_G_Q,\"G\",IF(COUNTIF(AG83:AK83,DISTANCE_Q)=NB_SETS_G_Q,\"P\",\"\"))","v":""},null,null,null,null,null,{"$f":"IF(COUNTIF(AA91:AE91,DISTANCE_Q)=NB_SETS_G_Q,\"G\",IF(COUNTIF(AG87:AK87,DISTANCE_Q)=NB_SETS_G_Q,\"P\",\"\"))","v":""}]
[null,"Ville ou Club",{"$f":"IF(OR(COUNTIF(C91:G91,\"\")<>COUNTIF(AG71:AK71,\"\"),AND(H91=\"\",SUM(C91:G91)<>0)),\"!...\",IF(OR(AND(H91<>\"\",C91=\"\",C91<>AG71),AND(H91<>\"\",C91<>\"\",C91=AG71),AND(H91<>\"\",C91<>\"\",C91<>DISTANCE_Q,AG71<>DISTANCE_Q)),\"ERR!\",\"\"))","v":""},{"$f":"IF(C92=\"!...\",C92,IF(OR(AND(H91<>\"\",D91=\"\",D91<>AH71),AND(H91<>\"\",D91<>\"\",D91=AH71),AND(H91<>\"\",D91<>\"\",D91<>DISTANCE_Q,AH71<>DISTANCE_Q)),\"ERR!\",\"\"))","v":""},{"$f":"IF(D92=\"!...\",D92,IF(OR(AND(H91<>\"\",E91=\"\",E91<>AI71),AND(H91<>\"\",E91<>\"\",E91=AI71),AND(H91<>\"\",E91<>\"\",E91<>DISTANCE_Q,AI71<>DISTANCE_Q)),\"ERR!\",\"\"))","v":""},{"$f":"IF(E92=\"!...\",E92,IF(OR(AND(H91<>\"\",F91=\"\",F91<>AJ71),AND(H91<>\"\",F91<>\"\",F91=AJ71),AND(H91<>\"\",F91<>\"\",F91<>DISTANCE_Q,AJ71<>DISTANCE_Q)),\"ERR!\",\"\"))","v":""},{"$f":"IF(F92=\"!...\",F92,IF(OR(AND(H91<>\"\",G91=\"\",G91<>AK71),AND(H91<>\"\",G91<>\"\",G91=AK71),AND(H91<>\"\",G91<>\"\",G91<>DISTANCE_Q,AK71<>DISTANCE_Q)),\"ERR!\",\"\"))","v":""},{"$f":"IF(H91=\"\",\"\",IF(H91=\"G\",(NB_SETS_G_Q*2)-1-COUNTIF(AG71:AK71,DISTANCE_Q),COUNTIF(C91:G91,DISTANCE_Q)))","v":""},{"$f":"IF(OR(COUNTIF(I91:M91,\"\")<>COUNTIF(AG75:AK75,\"\"),AND(N91=\"\",SUM(I91:M91)<>0)),\"!...\",IF(OR(AND(N91<>\"\",I91=\"\",I91<>AG75),AND(N91<>\"\",I91<>\"\",I91=AG75),AND(N91<>\"\",I91<>\"\",I91<>DISTANCE_Q,AG75<>DISTANCE_Q)),\"ERR!\",\"\"))","v":""},{"$f":"IF(I92=\"!...\",I92,IF(OR(AND(N91<>\"\",J91=\"\",J91<>AH75),AND(N91<>\"\",J91<>\"\",J91=AH75),AND(N91<>\"\",J91<>\"\",J91<>DISTANCE_Q,AH75<>DISTANCE_Q)),\"ERR!\",\"\"))","v":""},{"$f":"IF(J92=\"!...\",J92,IF(OR(AND(N91<>\"\",K91=\"\",K91<>AI75),AND(N91<>\"\",K91<>\"\",K91=AI75),AND(N91<>\"\",K91<>\"\",K91<>DISTANCE_Q,AI75<>DISTANCE_Q)),\"ERR!\",\"\"))","v":""},{"$f":"IF(K92=\"!...\",K92,IF(OR(AND(N91<>\"\",L91=\"\",L91<>AJ75),AND(N91<>\"\",L91<>\"\",L91=AJ75),AND(N91<>\"\",L91<>\"\",L91<>DISTANCE_Q,AJ75<>DISTANCE_Q)),\"ERR!\",\"\"))","v":""},{"$f":"IF(L92=\"!...\",L92,IF(OR(AND(N91<>\"\",M91=\"\",M91<>AK75),AND(N91<>\"\",M91<>\"\",M91=AK75),AND(N91<>\"\",M91<>\"\",M91<>DISTANCE_Q,AK75<>DISTANCE_Q)),\"ERR!\",\"\"))","v":""},{"$f":"IF(N91=\"\",\"\",IF(N91=\"G\",(NB_SETS_G_Q*2)-1-COUNTIF(AG75:AK75,DISTANCE_Q),COUNTIF(I91:M91,DISTANCE_Q)))","v":""},{"$f":"IF(OR(COUNTIF(O91:S91,\"\")<>COUNTIF(AG79:AK79,\"\"),AND(T91=\"\",SUM(O91:S91)<>0)),\"!...\",IF(OR(AND(T91<>\"\",O91=\"\",O91<>AG79),AND(T91<>\"\",O91<>\"\",O91=AG79),AND(T91<>\"\",O91<>\"\",O91<>DISTANCE_Q,AG79<>DISTANCE_Q)),\"ERR!\",\"\"))","v":""},{"$f":"IF(O92=\"!...\",O92,IF(OR(AND(T91<>\"\",P91=\"\",P91<>AH79),AND(T91<>\"\",P91<>\"\",P91=AH79),AND(T91<>\"\",P91<>\"\",P91<>DISTANCE_Q,AH79<>DISTANCE_Q)),\"ERR!\",\"\"))","v":""},{"$f":"IF(P92=\"!...\",P92,IF(OR(AND(T91<>\"\",Q91=\"\",Q91<>AI79),AND(T91<>\"\",Q91<>\"\",Q91=AI79),AND(T91<>\"\",Q91<>\"\",Q91<>DISTANCE_Q,AI79<>DISTANCE_Q)),\"ERR!\",\"\"))","v":""},{"$f":"IF(Q92=\"!...\",Q92,IF(OR(AND(T91<>\"\",R91=\"\",R91<>AJ79),AND(T91<>\"\",R91<>\"\",R91=AJ79),AND(T91<>\"\",R91<>\"\",R91<>DISTANCE_Q,AJ79<>DISTANCE_Q)),\"ERR!\",\"\"))","v":""},{"$f":"IF(R92=\"!...\",R92,IF(OR(AND(T91<>\"\",S91=\"\",S91<>AK79),AND(T91<>\"\",S91<>\"\",S91=AK79),AND(T91<>\"\",S91<>\"\",S91<>DISTANCE_Q,AK79<>DISTANCE_Q)),\"ERR!\",\"\"))","v":""},{"$f":"IF(T91=\"\",\"\",IF(T91=\"G\",(NB_SETS_G_Q*2)-1-COUNTIF(AG79:AK79,DISTANCE_Q),COUNTIF(O91:S91,DISTANCE_Q)))","v":""},{"$f":"IF(OR(COUNTIF(U91:Y91,\"\")<>COUNTIF(AG83:AK83,\"\"),AND(Z91=\"\",SUM(U91:Y91)<>0)),\"!...\",IF(OR(AND(Z91<>\"\",U91=\"\",U91<>AG83),AND(Z91<>\"\",U91<>\"\",U91=AG83),AND(Z91<>\"\",U91<>\"\",U91<>DISTANCE_Q,AG83<>DISTANCE_Q)),\"ERR!\",\"\"))","v":""},{"$f":"IF(U92=\"!...\",U92,IF(OR(AND(Z91<>\"\",V91=\"\",V91<>AH83),AND(Z91<>\"\",V91<>\"\",V91=AH83),AND(Z91<>\"\",V91<>\"\",V91<>DISTANCE_Q,AH83<>DISTANCE_Q)),\"ERR!\",\"\"))","v":""},{"$f":"IF(V92=\"!...\",V92,IF(OR(AND(Z91<>\"\",W91=\"\",W91<>AI83),AND(Z91<>\"\",W91<>\"\",W91=AI83),AND(Z91<>\"\",W91<>\"\",W91<>DISTANCE_Q,AI83<>DISTANCE_Q)),\"ERR!\",\"\"))","v":""},{"$f":"IF(W92=\"!...\",W92,IF(OR(AND(Z91<>\"\",X91=\"\",X91<>AJ83),AND(Z91<>\"\",X91<>\"\",X91=AJ83),AND(Z91<>\"\",X91<>\"\",X91<>DISTANCE_Q,AJ83<>DISTANCE_Q)),\"ERR!\",\"\"))","v":""},{"$f":"IF(X92=\"!...\",X92,IF(OR(AND(Z91<>\"\",Y91=\"\",Y91<>AK83),AND(Z91<>\"\",Y91<>\"\",Y91=AK83),AND(Z91<>\"\",Y91<>\"\",Y91<>DISTANCE_Q,AK83<>DISTANCE_Q)),\"ERR!\",\"\"))","v":""},{"$f":"IF(Z91=\"\",\"\",IF(Z91=\"G\",(NB_SETS_G_Q*2)-1-COUNTIF(AG83:AK83,DISTANCE_Q),COUNTIF(U91:Y91,DISTANCE_Q)))","v":""},{"$f":"IF(OR(COUNTIF(AA91:AE91,\"\")<>COUNTIF(AG87:AK87,\"\"),AND(AF91=\"\",SUM(AA91:AE91)<>0)),\"!...\",IF(OR(AND(AF91<>\"\",AA91=\"\",AA91<>AG87),AND(AF91<>\"\",AA91<>\"\",AA91=AG87),AND(AF91<>\"\",AA91<>\"\",AA91<>DISTANCE_Q,AG87<>DISTANCE_Q)),\"ERR!\",\"\"))","v":""},{"$f":"IF(AA92=\"!...\",AA92,IF(OR(AND(AF91<>\"\",AB91=\"\",AB91<>AH87),AND(AF91<>\"\",AB91<>\"\",AB91=AH87),AND(AF91<>\"\",AB91<>\"\",AB91<>DISTANCE_Q,AH87<>DISTANCE_Q)),\"ERR!\",\"\"))","v":""},{"$f":"IF(AB92=\"!...\",AB92,IF(OR(AND(AF91<>\"\",AC91=\"\",AC91<>AI87),AND(AF91<>\"\",AC91<>\"\",AC91=AI87),AND(AF91<>\"\",AC91<>\"\",AC91<>DISTANCE_Q,AI87<>DISTANCE_Q)),\"ERR!\",\"\"))","v":""},{"$f":"IF(AC92=\"!...\",AC92,IF(OR(AND(AF91<>\"\",AD91=\"\",AD91<>AJ87),AND(AF91<>\"\",AD91<>\"\",AD91=AJ87),AND(AF91<>\"\",AD91<>\"\",AD91<>DISTANCE_Q,AJ87<>DISTANCE_Q)),\"ERR!\",\"\"))","v":""},{"$f":"IF(AD92=\"!...\",AD92,IF(OR(AND(AF91<>\"\",AE91=\"\",AE91<>AK87),AND(AF91<>\"\",AE91<>\"\",AE91=AK87),AND(AF91<>\"\",AE91<>\"\",AE91<>DISTANCE_Q,AK87<>DISTANCE_Q)),\"ERR!\",\"\"))","v":""},{"$f":"IF(AF91=\"\",\"\",IF(AF91=\"G\",(NB_SETS_G_Q*2)-1-COUNTIF(AG87:AK87,DISTANCE_Q),COUNTIF(AA91:AE91,DISTANCE_Q)))","v":""}]
[null,"Licence",null,null,null,null,null,{"$f":"IF(H91=\"\",\"\",IF(SUM(AG71:AK71)<>0,ROUNDDOWN(SUM(C91:G91)/SUM(AG71:AK71),3),\"\"))","v":""},null,null,null,null,null,{"$f":"IF(N91=\"\",\"\",IF(SUM(AG75:AK75)<>0,ROUNDDOWN(SUM(I91:M91)/SUM(AG75:AK75),3),\"\"))","v":""},null,null,null,null,null,{"$f":"IF(T91=\"\",\"\",IF(SUM(AG79:AK79)<>0,ROUNDDOWN(SUM(O91:S91)/SUM(AG79:AK79),3),\"\"))","v":""},null,null,null,null,null,{"$f":"IF(Z91=\"\",\"\",IF(SUM(AG83:AK83)<>0,ROUNDDOWN(SUM(U91:Y91)/SUM(AG83:AK83),3),\"\"))","v":""},null,null,null,null,null,{"$f":"IF(AF91=\"\",\"\",IF(SUM(AG87:AK87)<>0,ROUNDDOWN(SUM(AA91:AE91)/SUM(AG87:AK87),3),\"\"))","v":""}]
[]
[]
[null,"Poule",{"$f":"\"J\" & RIGHT(B97,1) & \" \" &B98","v":"J1 Nom & Prénom"},null,null,null,null,null,{"$f":"\"J\" & RIGHT(B101,1) & \" \" &B102","v":"J2 Nom & Prénom"},null,null,null,null,null,{"$f":"\"J\" & RIGHT(B105,1) & \" \" &B106","v":"J3 Nom & Prénom"},null,null,null,null,null,{"$f":"\"J\" & RIGHT(B109,1) & \" \" &B110","v":"J4 Nom & Prénom"},null,null,null,null,null,{"$f":"\"J\" & RIGHT(B113,1) & \" \" &B114","v":"J5 Nom & Prénom"},null,null,null,null,null,null,null,null,null,null,null,null,null,null,null,null,null,null,null,null,null,null,null,null,"Clst","Pts Match","Pts Sets","Moy. Gen.","Moy. Part.","Pts marq.","Pts subis",null,"Calcul 1er"]
[null,"Joueur 1","Sets",null,null,null,null,"Match","set 1","set 2","set 3","set 4","set 5","J1-J2","set 1","set 2","set 3","set 4","set 5","J1-J3","set 1","set 2","set 3","set 4","set 5","J1-J4","set 1","set 2","set 3","set 4","set 5","J1-J5",null,null,null,null,null,null,null,null,null,null,null,null,null,null,null,null,null,null,null,{"$f":"IF(BH97<>\"\",RANK(BH97,BH97:BH116),\"\")","v":""},{"$f":"IF(TYPE_QUALIF=\"Poules 6J\",(COUNTIF(N98:AF98,\"G\")*VAL_PT_MATCH)+VAL_PT_MATCH,COUNTIF(N98:AF98,\"G\")*VAL_PT_MATCH)","v":0},{"$f":"IF(TYPE_QUALIF=\"Poules 6J\",(NB_SETS_G_Q*2-1)+SUM(AF99,Z99,T99,N99),SUM(AF99,Z99,T99,N99))","v":0},{"$f":"IF(BF97<>0,ROUNDDOWN(BE97/BF97,3),\"\")","v":""},{"$f":"MAX(N100,T100,Z100,AF100)","v":0},{"$f":"SUM(I98:M98,O98:S98,U98:Y98,AA98:AE98)","v":0},{"$f":"SUM(C102:G102,C106:G106,C110:G110,C114:G114)","v":0},null,{"$f":"IF(BC97<>\"\",(BA97*10000000)+(BB97*100000)+(BC97*10000)+BD97,\"\")","v":""}]
[null,"Nom & Prénom","Pts",null,null,null,null,"G/P",null,null,null,null,null,{"$f":"IF(COUNTIF(I98:M98,DISTANCE_Q)=NB_SETS_G_Q,\"G\",IF(COUNTIF(C102:G102,DISTANCE_Q)=NB_SETS_G_Q,\"P\",\"\"))","v":""},null,null,null,null,null,{"$f":"IF(COUNTIF(O98:S98,DISTANCE_Q)=NB_SETS_G_Q,\"G\",IF(COUNTIF(C106:G106,DISTANCE_Q)=NB_SETS_G_Q,\"P\",\"\"))","v":""},null,null,null,null,null,{"$f":"IF(COUNTIF(U98:Y98,DISTANCE_Q)=NB_SETS_G_Q,\"G\",IF(COUNTIF(C110:G110,DISTANCE_Q)=NB_SETS_G_Q,\"P\",\"\"))","v":""},null,null,null,null,null,{"$f":"IF(COUNTIF(AA98:AE98,DISTANCE_Q)=NB_SETS_G_Q,\"G\",IF(COUNTIF(C114:G114,DISTANCE_Q)=NB_SETS_G_Q,\"P\",\"\"))","v":""}]
[null,"Ville ou Club",null,null,null,null,null,"Pts de Sets",{"$f":"IF(OR(COUNTIF(I98:M98,\"\")<>COUNTIF(C102:G102,\"\"),AND(N98=\"\",SUM(I98:M98)<>0)),\"!...\",IF(OR(AND(N98<>\"\",I98=\"\",I98<>C102),AND(N98<>\"\",I98<>\"\",I98=C102),AND(N98<>\"\",I98<>\"\",I98<>DISTANCE_Q,C102<>DISTANCE_Q)),\"ERR!\",\"\"))","v":""},{"$f":"IF(I99=\"!...\",I99,IF(OR(AND(N98<>\"\",J98=\"\",J98<>D102),AND(N98<>\"\",J98<>\"\",J98=D102),AND(N98<>\"\",J98<>\"\",J98<>DISTANCE_Q,D102<>DISTANCE_Q)),\"ERR!\",\"\"))","v":""},{"$f":"IF(J99=\"!...\",J99,IF(OR(AND(N98<>\"\",K98=\"\",K98<>E102),AND(N98<>\"\",K98<>\"\",K98=E102),AND(N98<>\"\",K98<>\"\",K98<>DISTANCE_Q,E102<>DISTANCE_Q)),\"ERR!\",\"\"))","v":""},{"$f":"IF(K99=\"!...\",K99,IF(OR(AND(N98<>\"\",L98=\"\",L98<>F102),AND(N98<>\"\",L98<>\"\",L98=F102),AND(N98<>\"\",L98<>\"\",L98<>DISTANCE_Q,F102<>DISTANCE_Q)),\"ERR!\",\"\"))","v":""},{"$f":"IF(L99=\"!...\",L99,IF(OR(AND(N98<>\"\",M98=\"\",M98<>G102),AND(N98<>\"\",M98<>\"\",M98=G102),AND(N98<>\"\",M98<>\"\",M98<>DISTANCE_Q,G102<>DISTANCE_Q)),\"ERR!\",\"\"))","v":""},{"$f":"IF(N98=\"\",\"\",IF(N98=\"G\",(NB_SETS_G_Q*2)-1-COUNTIF(C102:G102,DISTANCE_Q),COUNTIF(I98:M98,DISTANCE_Q)))","v":""},{"$f":"IF(OR(COUNTIF(O98:S98,\"\")<>COUNTIF(C106:G106,\"\"),AND(T98=\"\",SUM(O98:S98)<>0)),\"!...\",IF(OR(AND(T98<>\"\",O98=\"\",O98<>C106),AND(T98<>\"\",O98<>\"\",O98=C106),AND(T98<>\"\",O98<>\"\",O98<>DISTANCE_Q,C106<>DISTANCE_Q)),\"ERR!\",\"\"))","v":""},{"$f":"IF(O99=\"!...\",O99,IF(OR(AND(T98<>\"\",P98=\"\",P98<>D106),AND(T98<>\"\",P98<>\"\",P98=D106),AND(T98<>\"\",P98<>\"\",P98<>DISTANCE_Q,D106<>DISTANCE_Q)),\"ERR!\",\"\"))","v":""},{"$f":"IF(P99=\"!...\",P99,IF(OR(AND(T98<>\"\",Q98=\"\",Q98<>E106),AND(T98<>\"\",Q98<>\"\",Q98=E106),AND(T98<>\"\",Q98<>\"\",Q98<>DISTANCE_Q,E106<>DISTANCE_Q)),\"ERR!\",\"\"))","v":""},{"$f":"IF(Q99=\"!...\",Q99,IF(OR(AND(T98<>\"\",R98=\"\",R98<>F106),AND(T98<>\"\",R98<>\"\",R98=F106),AND(T98<>\"\",R98<>\"\",R98<>DISTANCE_Q,F106<>DISTANCE_Q)),\"ERR!\",\"\"))","v":""},{"$f":"IF(R99=\"!...\",R99,IF(OR(AND(T98<>\"\",S98=\"\",S98<>G106),AND(T98<>\"\",S98<>\"\",S98=G106),AND(T98<>\"\",S98<>\"\",S98<>DISTANCE_Q,G106<>DISTANCE_Q)),\"ERR!\",\"\"))","v":""},{"$f":"IF(T98=\"\",\"\",IF(T98=\"G\",(NB_SETS_G_Q*2)-1-COUNTIF(C106:G106,DISTANCE_Q),COUNTIF(O98:S98,DISTANCE_Q)))","v":""},{"$f":"IF(OR(COUNTIF(U98:Y98,\"\")<>COUNTIF(C110:G110,\"\"),AND(Z98=\"\",SUM(U98:Y98)<>0)),\"!...\",IF(OR(AND(Z98<>\"\",U98=\"\",U98<>C110),AND(Z98<>\"\",U98<>\"\",U98=C110),AND(Z98<>\"\",U98<>\"\",U98<>DISTANCE_Q,C110<>DISTANCE_Q)),\"ERR!\",\"\"))","v":""},{"$f":"IF(U99=\"!...\",U99,IF(OR(AND(Z98<>\"\",V98=\"\",V98<>D110),AND(Z98<>\"\",V98<>\"\",V98=D110),AND(Z98<>\"\",V98<>\"\",V98<>DISTANCE_Q,D110<>DISTANCE_Q)),\"ERR!\",\"\"))","v":""},{"$f":"IF(V99=\"!...\",V99,IF(OR(AND(Z98<>\"\",W98=\"\",W98<>E110),AND(Z98<>\"\",W98<>\"\",W98=E110),AND(Z98<>\"\",W98<>\"\",W98<>DISTANCE_Q,E110<>DISTANCE_Q)),\"ERR!\",\"\"))","v":""},{"$f":"IF(W99=\"!...\",W99,IF(OR(AND(Z98<>\"\",X98=\"\",X98<>F110),AND(Z98<>\"\",X98<>\"\",X98=F110),AND(Z98<>\"\",X98<>\"\",X98<>DISTANCE_Q,F110<>DISTANCE_Q)),\"ERR!\",\"\"))","v":""},{"$f":"IF(X99=\"!...\",X99,IF(OR(AND(Z98<>\"\",Y98=\"\",Y98<>G110),AND(Z98<>\"\",Y98<>\"\",Y98=G110),AND(Z98<>\"\",Y98<>\"\",Y98<>DISTANCE_Q,G110<>DISTANCE_Q)),\"ERR!\",\"\"))","v":""},{"$f":"IF(Z98=\"\",\"\",IF(Z98=\"G\",(NB_SETS_G_Q*2)-1-COUNTIF(C110:G110,DISTANCE_Q),COUNTIF(U98:Y98,DISTANCE_Q)))","v":""},{"$f":"IF(OR(COUNTIF(AA98:AE98,\"\")<>COUNTIF(C114:G114,\"\"),AND(AF98=\"\",SUM(AA98:AE98)<>0)),\"!...\",IF(OR(AND(AF98<>\"\",AA98=\"\",AA98<>C114),AND(AF98<>\"\",AA98<>\"\",AA98=C114),AND(AF98<>\"\",AA98<>\"\",AA98<>DISTANCE_Q,C114<>DISTANCE_Q)),\"ERR!\",\"\"))","v":""},{"$f":"IF(AA99=\"!...\",AA99,IF(OR(AND(AF98<>\"\",AB98=\"\",AB98<>D114),AND(AF98<>\"\",AB98<>\"\",AB98=D114),AND(AF98<>\"\",AB98<>\"\",AB98<>DISTANCE_Q,D114<>DISTANCE_Q)),\"ERR!\",\"\"))","v":""},{"$f":"IF(AB99=\"!...\",AB99,IF(OR(AND(AF98<>\"\",AC98=\"\",AC98<>E114),AND(AF98<>\"\",AC98<>\"\",AC98=E114),AND(AF98<>\"\",AC98<>\"\",AC98<>DISTANCE_Q,E114<>DISTANCE_Q)),\"ERR!\",\"\"))","v":""},{"$f":"IF(AC99=\"!...\",AC99,IF(OR(AND(AF98<>\"\",AD98=\"\",AD98<>F114),AND(AF98<>\"\",AD98<>\"\",AD98=F114),AND(AF98<>\"\",AD98<>\"\",AD98<>DISTANCE_Q,F114<>DISTANCE_Q)),\"ERR!\",\"\"))","v":""},{"$f":"IF(AD99=\"!...\",AD99,IF(OR(AND(AF98<>\"\",AE98=\"\",AE98<>G114),AND(AF98<>\"\",AE98<>\"\",AE98=G114),AND(AF98<>\"\",AE98<>\"\",AE98<>DISTANCE_Q,G114<>DISTANCE_Q)),\"ERR!\",\"\"))","v":""},{"$f":"IF(AF98=\"\",\"\",IF(AF98=\"G\",(NB_SETS_G_Q*2)-1-COUNTIF(C114:G114,DISTANCE_Q),COUNTIF(AA98:AE98,DISTANCE_Q)))","v":""}]
[null,"Licence",null,null,null,null,null,"Moyenne",null,null,null,null,null,{"$f":"IF(N98=\"\",\"\",IF(SUM(C102:G102)<>0,ROUNDDOWN(SUM(I98:M98)/SUM(C102:G102),3),\"\"))","v":""},null,null,null,null,null,{"$f":"IF(T98=\"\",\"\",IF(SUM(C106:G106)<>0,ROUNDDOWN(SUM(O98:S98)/SUM(C106:G106),3),\"\"))","v":""},null,null,null,null,null,{"$f":"IF(Z98=\"\",\"\",IF(SUM(C110:G110)<>0,ROUNDDOWN(SUM(U98:Y98)/SUM(C110:G110),3),\"\"))","v":""},null,null,null,null,null,{"$f":"IF(AF98=\"\",\"\",IF(SUM(C114:G114)<>0,ROUNDDOWN(SUM(AA98:AE98)/SUM(C114:G114),3),\"\"))","v":""}]
[null,"Joueur 2","set 1","set 2","set 3","set 4","set 5","J1-J2",null,null,null,null,null,null,"set 1","set 2","set 3","set 4","set 5","J2-J3","set 1","set 2","set 3","set 4","set 5","J2-J4","set 1","set 2","set 3","set 4","set 5","J2-J5",null,null,null,null,null,null,null,null,null,null,null,null,null,null,null,null,null,null,null,{"$f":"IF(BH101<>\"\",RANK(BH101,BH97:BH116),\"\")","v":""},{"$f":"IF(TYPE_QUALIF=\"Poules 6J\",(COUNTIF(H102:AF102,\"G\")*VAL_PT_MATCH)+VAL_PT_MATCH,COUNTIF(H102:AF102,\"G\")*VAL_PT_MATCH)","v":0},{"$f":"IF(TYPE_QUALIF=\"Poules 6J\",(NB_SETS_G_Q*2-1)+SUM(AF103,Z103,T103,H103),SUM(AF103,Z103,T103,H103))","v":0},{"$f":"IF(BF101<>0,ROUNDDOWN(BE101/BF101,3),\"\")","v":""},{"$f":"MAX(H104,T104,Z104,AF104)","v":0},{"$f":"SUM(C102:G102,O102:S102,U102:Y102,AA102:AE102)","v":0},{"$f":"SUM(I106:M106,I110:M110,I114:M114,I98:M98)","v":0},null,{"$f":"IF(BC101<>\"\",(BA101*10000000)+(BB101*100000)+(BC101*10000)+BD101,\"\")","v":""}]
[null,"Nom & Prénom",null,null,null,null,null,{"$f":"IF(COUNTIF(C102:G102,DISTANCE_Q)=NB_SETS_G_Q,\"G\",IF(COUNTIF(I98:M98,DISTANCE_Q)=NB_SETS_G_Q,\"P\",\"\"))","v":""},null,null,null,null,null,null,null,null,null,null,null,{"$f":"IF(COUNTIF(O102:S102,DISTANCE_Q)=NB_SETS_G_Q,\"G\",IF(COUNTIF(I106:M106,DISTANCE_Q)=NB_SETS_G_Q,\"P\",\"\"))","v":""},null,null,null,null,null,{"$f":"IF(COUNTIF(U102:Y102,DISTANCE_Q)=NB_SETS_G_Q,\"G\",IF(COUNTIF(I110:M110,DISTANCE_Q)=NB_SETS_G_Q,\"P\",\"\"))","v":""},null,null,null,null,null,{"$f":"IF(COUNTIF(AA102:AE102,DISTANCE_Q)=NB_SETS_G_Q,\"G\",IF(COUNTIF(I114:M114,DISTANCE_Q)=NB_SETS_G_Q,\"P\",\"\"))","v":""}]
[null,"Ville ou Club",{"$f":"IF(OR(COUNTIF(C102:G102,\"\")<>COUNTIF(I98:M98,\"\"),AND(H102=\"\",SUM(C102:G102)<>0)),\"!...\",IF(OR(AND(H102<>\"\",C102=\"\",C102<>I98),AND(H102<>\"\",C102<>\"\",C102=I98),AND(H102<>\"\",C102<>\"\",C102<>DISTANCE_Q,I98<>DISTANCE_Q)),\"ERR!\",\"\"))","v":""},{"$f":"IF(C103=\"!...\",C103,IF(OR(AND(H102<>\"\",D102=\"\",D102<>J98),AND(H102<>\"\",D102<>\"\",D102=J98),AND(H102<>\"\",D102<>\"\",D102<>DISTANCE_Q,J98<>DISTANCE_Q)),\"ERR!\",\"\"))","v":""},{"$f":"IF(D103=\"!...\",D103,IF(OR(AND(H102<>\"\",E102=\"\",E102<>K98),AND(H102<>\"\",E102<>\"\",E102=K98),AND(H102<>\"\",E102<>\"\",E102<>DISTANCE_Q,K98<>DISTANCE_Q)),\"ERR!\",\"\"))","v":""},{"$f":"IF(E103=\"!...\",E103,IF(OR(AND(H102<>\"\",F102=\"\",F102<>L98),AND(H102<>\"\",F102<>\"\",F102=L98),AND(H102<>\"\",F102<>\"\",F102<>DISTANCE_Q,L98<>DISTANCE_Q)),\"ERR!\",\"\"))","v":""},{"$f":"IF(F103=\"!...\",F103,IF(OR(AND(H102<>\"\",G102=\"\",G102<>M98),AND(H102<>\"\",G102<>\"\",G102=M98),AND(H102<>\"\",G102<>\"\",G102<>DISTANCE_Q,M98<>DISTANCE_Q)),\"ERR!\",\"\"))","v":""},{"$f":"IF(H102=\"\",\"\",IF(H102=\"G\",(NB_SETS_G_Q*2)-1-COUNTIF(I98:M98,DISTANCE_Q),COUNTIF(C102:G102,DISTANCE_Q)))","v":""},null,null,null,null,null,null,{"$f":"IF(OR(COUNTIF(O102:S102,\"\")<>COUNTIF(I106:M106,\"\"),AND(T102=\"\",SUM(O102:S102)<>0)),\"!...\",IF(OR(AND(T102<>\"\",O102=\"\",O102<>I106),AND(T102<>\"\",O102<>\"\",O102=I106),AND(T102<>\"\",O102<>\"\",O102<>DISTANCE_Q,I106<>DISTANCE_Q)),\"ERR!\",\"\"))","v":""},{"$f":"IF(O103=\"!...\",O103,IF(OR(AND(T102<>\"\",P102=\"\",P102<>J106),AND(T102<>\"\",P102<>\"\",P102=J106),AND(T102<>\"\",P102<>\"\",P102<>DISTANCE_Q,J106<>DISTANCE_Q)),\"ERR!\",\"\"))","v":""},{"$f":"IF(P103=\"!...\",P103,IF(OR(AND(T102<>\"\",Q102=\"\",Q102<>K106),AND(T102<>\"\",Q102<>\"\",Q102=K106),AND(T102<>\"\",Q102<>\"\",Q102<>DISTANCE_Q,K106<>DISTANCE_Q)),\"ERR!\",\"\"))","v":""},{"$f":"IF(Q103=\"!...\",Q103,IF(OR(AND(T102<>\"\",R102=\"\",R102<>L106),AND(T102<>\"\",R102<>\"\",R102=L106),AND(T102<>\"\",R102<>\"\",R102<>DISTANCE_Q,L106<>DISTANCE_Q)),\"ERR!\",\"\"))","v":""},{"$f":"IF(R103=\"!...\",R103,IF(OR(AND(T102<>\"\",S102=\"\",S102<>M106),AND(T102<>\"\",S102<>\"\",S102=M106),AND(T102<>\"\",S102<>\"\",S102<>DISTANCE_Q,M106<>DISTANCE_Q)),\"ERR!\",\"\"))","v":""},{"$f":"IF(T102=\"\",\"\",IF(T102=\"G\",(NB_SETS_G_Q*2)-1-COUNTIF(I106:M106,DISTANCE_Q),COUNTIF(O102:S102,DISTANCE_Q)))","v":""},{"$f":"IF(OR(COUNTIF(U102:Y102,\"\")<>COUNTIF(I110:M110,\"\"),AND(Z102=\"\",SUM(U102:Y102)<>0)),\"!...\",IF(OR(AND(Z102<>\"\",U102=\"\",U102<>I110),AND(Z102<>\"\",U102<>\"\",U102=I110),AND(Z102<>\"\",U102<>\"\",U102<>DISTANCE_Q,I110<>DISTANCE_Q)),\"ERR!\",\"\"))","v":""},{"$f":"IF(U103=\"!...\",U103,IF(OR(AND(Z102<>\"\",V102=\"\",V102<>J110),AND(Z102<>\"\",V102<>\"\",V102=J110),AND(Z102<>\"\",V102<>\"\",V102<>DISTANCE_Q,J110<>DISTANCE_Q)),\"ERR!\",\"\"))","v":""},{"$f":"IF(V103=\"!...\",V103,IF(OR(AND(Z102<>\"\",W102=\"\",W102<>K110),AND(Z102<>\"\",W102<>\"\",W102=K110),AND(Z102<>\"\",W102<>\"\",W102<>DISTANCE_Q,K110<>DISTANCE_Q)),\"ERR!\",\"\"))","v":""},{"$f":"IF(W103=\"!...\",W103,IF(OR(AND(Z102<>\"\",X102=\"\",X102<>L110),AND(Z102<>\"\",X102<>\"\",X102=L110),AND(Z102<>\"\",X102<>\"\",X102<>DISTANCE_Q,L110<>DISTANCE_Q)),\"ERR!\",\"\"))","v":""},{"$f":"IF(X103=\"!...\",X103,IF(OR(AND(Z102<>\"\",Y102=\"\",Y102<>M110),AND(Z102<>\"\",Y102<>\"\",Y102=M110),AND(Z102<>\"\",Y102<>\"\",Y102<>DISTANCE_Q,M110<>DISTANCE_Q)),\"ERR!\",\"\"))","v":""},{"$f":"IF(Z102=\"\",\"\",IF(Z102=\"G\",(NB_SETS_G_Q*2)-1-COUNTIF(I110:M110,DISTANCE_Q),COUNTIF(U102:Y102,DISTANCE_Q)))","v":""},{"$f":"IF(OR(COUNTIF(AA102:AE102,\"\")<>COUNTIF(I114:M114,\"\"),AND(AF102=\"\",SUM(AA102:AE102)<>0)),\"!...\",IF(OR(AND(AF102<>\"\",AA102=\"\",AA102<>I114),AND(AF102<>\"\",AA102<>\"\",AA102=I114),AND(AF102<>\"\",AA102<>\"\",AA102<>DISTANCE_Q,I114<>DISTANCE_Q)),\"ERR!\",\"\"))","v":""},{"$f":"IF(AA103=\"!...\",AA103,IF(OR(AND(AF102<>\"\",AB102=\"\",AB102<>J114),AND(AF102<>\"\",AB102<>\"\",AB102=J114),AND(AF102<>\"\",AB102<>\"\",AB102<>DISTANCE_Q,J114<>DISTANCE_Q)),\"ERR!\",\"\"))","v":""},{"$f":"IF(AB103=\"!...\",AB103,IF(OR(AND(AF102<>\"\",AC102=\"\",AC102<>K114),AND(AF102<>\"\",AC102<>\"\",AC102=K114),AND(AF102<>\"\",AC102<>\"\",AC102<>DISTANCE_Q,K114<>DISTANCE_Q)),\"ERR!\",\"\"))","v":""},{"$f":"IF(AC103=\"!...\",AC103,IF(OR(AND(AF102<>\"\",AD102=\"\",AD102<>L114),AND(AF102<>\"\",AD102<>\"\",AD102=L114),AND(AF102<>\"\",AD102<>\"\",AD102<>DISTANCE_Q,L114<>DISTANCE_Q)),\"ERR!\",\"\"))","v":""},{"$f":"IF(AD103=\"!...\",AD103,IF(OR(AND(AF102<>\"\",AE102=\"\",AE102<>M114),AND(AF102<>\"\",AE102<>\"\",AE102=M114),AND(AF102<>\"\",AE102<>\"\",AE102<>DISTANCE_Q,M114<>DISTANCE_Q)),\"ERR!\",\"\"))","v":""},{"$f":"IF(AF102=\"\",\"\",IF(AF102=\"G\",(NB_SETS_G_Q*2)-1-COUNTIF(I114:M114,DISTANCE_Q),COUNTIF(AA102:AE102,DISTANCE_Q)))","v":""}]
[null,"Licence",null,null,null,null,null,{"$f":"IF(H102=\"\",\"\",IF(SUM(I98:M98)<>0,ROUNDDOWN(SUM(C102:G102)/SUM(I98:M98),3),\"\"))","v":""},null,null,null,null,null,null,null,null,null,null,null,{"$f":"IF(T102=\"\",\"\",IF(SUM(I106:M106)<>0,ROUNDDOWN(SUM(O102:S102)/SUM(I106:M106),3),\"\"))","v":""},null,null,null,null,null,{"$f":"IF(Z102=\"\",\"\",IF(SUM(I110:M110)<>0,ROUNDDOWN(SUM(U102:Y102)/SUM(I110:M110),3),\"\"))","v":""},null,null,null,null,null,{"$f":"IF(AF102=\"\",\"\",IF(SUM(I114:M114)<>0,ROUNDDOWN(SUM(AA102:AE102)/SUM(I114:M114),3),\"\"))","v":""}]
[null,"Joueur 3","set 1","set 2","set 3","set 4","set 5","J1-J3","set 1","set 2","set 3","set 4","set 5","J2-J3",null,null,null,null,null,null,"set 1","set 2","set 3","set 4","set 5","J3-J4","set 1","set 2","set 3","set 4","set 5","J3-J5",null,null,null,null,null,null,null,null,null,null,null,null,null,null,null,null,null,null,null,{"$f":"IF(BH105<>\"\",RANK(BH105,BH97:BH116),\"\")","v":""},{"$f":"IF(TYPE_QUALIF=\"Poules 6J\",(COUNTIF(H106:AF106,\"G\")*VAL_PT_MATCH)+VAL_PT_MATCH,COUNTIF(H106:AF106,\"G\")*VAL_PT_MATCH)","v":0},{"$f":"IF(TYPE_QUALIF=\"Poules 6J\",(NB_SETS_G_Q*2-1)+SUM(AF107,Z107,H107,N107),SUM(AF107,Z107,H107,N107))","v":0},{"$f":"IF(BF105<>0,ROUNDDOWN(BE105/BF105,3),\"\")","v":""},{"$f":"MAX(N108,H108,Z108,AF108)","v":0},{"$f":"SUM(I106:M106,C106:G106,U106:Y106,AA106:AE106)","v":0},{"$f":"SUM(O110:S110,O114:S114,O102:S102,O98:S98)","v":0},null,{"$f":"IF(BC105<>\"\",(BA105*10000000)+(BB105*100000)+(BC105*10000)+BD105,\"\")","v":""}]
[null,"Nom & Prénom",null,null,null,null,null,{"$f":"IF(COUNTIF(C106:G106,DISTANCE_Q)=NB_SETS_G_Q,\"G\",IF(COUNTIF(O98:S98,DISTANCE_Q)=NB_SETS_G_Q,\"P\",\"\"))","v":""},null,null,null,null,null,{"$f":"IF(COUNTIF(I106:M106,DISTANCE_Q)=NB_SETS_G_Q,\"G\",IF(COUNTIF(O102:S102,DISTANCE_Q)=NB_SETS_G_Q,\"P\",\"\"))","v":""},null,null,null,null,null,null,null,null,null,null,null,{"$f":"IF(COUNTIF(U106:Y106,DISTANCE_Q)=NB_SETS_G_Q,\"G\",IF(COUNTIF(O110:S110,DISTANCE_Q)=NB_SETS_G_Q,\"P\",\"\"))","v":""},null,null,null,null,null,{"$f":"IF(COUNTIF(AA106:AE106,DISTANCE_Q)=NB_SETS_G_Q,\"G\",IF(COUNTIF(O114:S114,DISTANCE_Q)=NB_SETS_G_Q,\"P\",\"\"))","v":""}]
[null,"Ville ou Club",{"$f":"IF(OR(COUNTIF(C106:G106,\"\")<>COUNTIF(O98:S98,\"\"),AND(H106=\"\",SUM(C106:G106)<>0)),\"!...\",IF(OR(AND(H106<>\"\",C106=\"\",C106<>O98),AND(H106<>\"\",C106<>\"\",C106=O98),AND(H106<>\"\",C106<>\"\",C106<>DISTANCE_Q,O98<>DISTANCE_Q)),\"ERR!\",\"\"))","v":""},{"$f":"IF(C107=\"!...\",C107,IF(OR(AND(H106<>\"\",D106=\"\",D106<>P98),AND(H106<>\"\",D106<>\"\",D106=P98),AND(H106<>\"\",D106<>\"\",D106<>DISTANCE_Q,P98<>DISTANCE_Q)),\"ERR!\",\"\"))","v":""},{"$f":"IF(D107=\"!...\",D107,IF(OR(AND(H106<>\"\",E106=\"\",E106<>Q98),AND(H106<>\"\",E106<>\"\",E106=Q98),AND(H106<>\"\",E106<>\"\",E106<>DISTANCE_Q,Q98<>DISTANCE_Q)),\"ERR!\",\"\"))","v":""},{"$f":"IF(E107=\"!...\",E107,IF(OR(AND(H106<>\"\",F106=\"\",F106<>R98),AND(H106<>\"\",F106<>\"\",F106=R98),AND(H106<>\"\",F106<>\"\",F106<>DISTANCE_Q,R98<>DISTANCE_Q)),\"ERR!\",\"\"))","v":""},{"$f":"IF(F107=\"!...\",F107,IF(OR(AND(H106<>\"\",G106=\"\",G106<>S98),AND(H106<>\"\",G106<>\"\",G106=S98),AND(H106<>\"\",G106<>\"\",G106<>DISTANCE_Q,S98<>DISTANCE_Q)),\"ERR!\",\"\"))","v":""},{"$f":"IF(H106=\"\",\"\",IF(H106=\"G\",(NB_SETS_G_Q*2)-1-COUNTIF(O98:S98,DISTANCE_Q),COUNTIF(C106:G106,DISTANCE_Q)))","v":""},{"$f":"IF(OR(COUNTIF(I106:M106,\"\")<>COUNTIF(O102:S102,\"\"),AND(N106=\"\",SUM(I106:M106)<>0)),\"!...\",IF(OR(AND(N106<>\"\",I106=\"\",I106<>O102),AND(N106<>\"\",I106<>\"\",I106=O102),AND(N106<>\"\",I106<>\"\",I106<>DISTANCE_Q,O102<>DISTANCE_Q)),\"ERR!\",\"\"))","v":""},{"$f":"IF(I107=\"!...\",I107,IF(OR(AND(N106<>\"\",J106=\"\",J106<>P102),AND(N106<>\"\",J106<>\"\",J106=P102),AND(N106<>\"\",J106<>\"\",J106<>DISTANCE_Q,P102<>DISTANCE_Q)),\"ERR!\",\"\"))","v":""},{"$f":"IF(J107=\"!...\",J107,IF(OR(AND(N106<>\"\",K106=\"\",K106<>Q102),AND(N106<>\"\",K106<>\"\",K106=Q102),AND(N106<>\"\",K106<>\"\",K106<>DISTANCE_Q,Q102<>DISTANCE_Q)),\"ERR!\",\"\"))","v":""},{"$f":"IF(K107=\"!...\",K107,IF(OR(AND(N106<>\"\",L106=\"\",L106<>R102),AND(N106<>\"\",L106<>\"\",L106=R102),AND(N106<>\"\",L106<>\"\",L106<>DISTANCE_Q,R102<>DISTANCE_Q)),\"ERR!\",\"\"))","v":""},{"$f":"IF(L107=\"!...\",L107,IF(OR(AND(N106<>\"\",M106=\"\",M106<>S102),AND(N106<>\"\",M106<>\"\",M106=S102),AND(N106<>\"\",M106<>\"\",M106<>DISTANCE_Q,S102<>DISTANCE_Q)),\"ERR!\",\"\"))","v":""},{"$f":"IF(N106=\"\",\"\",IF(N106=\"G\",(NB_SETS_G_Q*2)-1-COUNTIF(O102:S102,DISTANCE_Q),COUNTIF(I106:M106,DISTANCE_Q)))","v":""},null,null,null,null,null,null,{"$f":"IF(OR(COUNTIF(U106:Y106,\"\")<>COUNTIF(O110:S110,\"\"),AND(Z106=\"\",SUM(U106:Y106)<>0)),\"!...\",IF(OR(AND(Z106<>\"\",U106=\"\",U106<>O110),AND(Z106<>\"\",U106<>\"\",U106=O110),AND(Z106<>\"\",U106<>\"\",U106<>DISTANCE_Q,O110<>DISTANCE_Q)),\"ERR!\",\"\"))","v":""},{"$f":"IF(U107=\"!...\",U107,IF(OR(AND(Z106<>\"\",V106=\"\",V106<>P110),AND(Z106<>\"\",V106<>\"\",V106=P110),AND(Z106<>\"\",V106<>\"\",V106<>DISTANCE_Q,P110<>DISTANCE_Q)),\"ERR!\",\"\"))","v":""},{"$f":"IF(V107=\"!...\",V107,IF(OR(AND(Z106<>\"\",W106=\"\",W106<>Q110),AND(Z106<>\"\",W106<>\"\",W106=Q110),AND(Z106<>\"\",W106<>\"\",W106<>DISTANCE_Q,Q110<>DISTANCE_Q)),\"ERR!\",\"\"))","v":""},{"$f":"IF(W107=\"!...\",W107,IF(OR(AND(Z106<>\"\",X106=\"\",X106<>R110),AND(Z106<>\"\",X106<>\"\",X106=R110),AND(Z106<>\"\",X106<>\"\",X106<>DISTANCE_Q,R110<>DISTANCE_Q)),\"ERR!\",\"\"))","v":""},{"$f":"IF(X107=\"!...\",X107,IF(OR(AND(Z106<>\"\",Y106=\"\",Y106<>S110),AND(Z106<>\"\",Y106<>\"\",Y106=S110),AND(Z106<>\"\",Y106<>\"\",Y106<>DISTANCE_Q,S110<>DISTANCE_Q)),\"ERR!\",\"\"))","v":""},{"$f":"IF(Z106=\"\",\"\",IF(Z106=\"G\",(NB_SETS_G_Q*2)-1-COUNTIF(O110:S110,DISTANCE_Q),COUNTIF(U106:Y106,DISTANCE_Q)))","v":""},{"$f":"IF(OR(COUNTIF(AA106:AE106,\"\")<>COUNTIF(O114:S114,\"\"),AND(AF106=\"\",SUM(AA106:AE106)<>0)),\"!...\",IF(OR(AND(AF106<>\"\",AA106=\"\",AA106<>O114),AND(AF106<>\"\",AA106<>\"\",AA106=O114),AND(AF106<>\"\",AA106<>\"\",AA106<>DISTANCE_Q,O114<>DISTANCE_Q)),\"ERR!\",\"\"))","v":""},{"$f":"IF(AA107=\"!...\",AA107,IF(OR(AND(AF106<>\"\",AB106=\"\",AB106<>P114),AND(AF106<>\"\",AB106<>\"\",AB106=P114),AND(AF106<>\"\",AB106<>\"\",AB106<>DISTANCE_Q,P114<>DISTANCE_Q)),\"ERR!\",\"\"))","v":""},{"$f":"IF(AB107=\"!...\",AB107,IF(OR(AND(AF106<>\"\",AC106=\"\",AC106<>Q114),AND(AF106<>\"\",AC106<>\"\",AC106=Q114),AND(AF106<>\"\",AC106<>\"\",AC106<>DISTANCE_Q,Q114<>DISTANCE_Q)),\"ERR!\",\"\"))","v":""},{"$f":"IF(AC107=\"!...\",AC107,IF(OR(AND(AF106<>\"\",AD106=\"\",AD106<>R114),AND(AF106<>\"\",AD106<>\"\",AD106=R114),AND(AF106<>\"\",AD106<>\"\",AD106<>DISTANCE_Q,R114<>DISTANCE_Q)),\"ERR!\",\"\"))","v":""},{"$f":"IF(AD107=\"!...\",AD107,IF(OR(AND(AF106<>\"\",AE106=\"\",AE106<>S114),AND(AF106<>\"\",AE106<>\"\",AE106=S114),AND(AF106<>\"\",AE106<>\"\",AE106<>DISTANCE_Q,S114<>DISTANCE_Q)),\"ERR!\",\"\"))","v":""},{"$f":"IF(AF106=\"\",\"\",IF(AF106=\"G\",(NB_SETS_G_Q*2)-1-COUNTIF(O114:S114,DISTANCE_Q),COUNTIF(AA106:AE106,DISTANCE_Q)))","v":""}]
[null,"Licence",null,null,null,null,null,{"$f":"IF(H106=\"\",\"\",IF(SUM(O98:S98)<>0,ROUNDDOWN(SUM(C106:G106)/SUM(O98:S98),3),\"\"))","v":""},null,null,null,null,null,{"$f":"IF(N106=\"\",\"\",IF(SUM(O102:S102)<>0,ROUNDDOWN(SUM(I106:M106)/SUM(O102:S102),3),\"\"))","v":""},null,null,null,null,null,null,null,null,null,null,null,{"$f":"IF(Z106=\"\",\"\",IF(SUM(O110:S110)<>0,ROUNDDOWN(SUM(U106:Y106)/SUM(O110:S110),3),\"\"))","v":""},null,null,null,null,null,{"$f":"IF(AF106=\"\",\"\",IF(SUM(O114:S114)<>0,ROUNDDOWN(SUM(AA106:AE106)/SUM(O114:S114),3),\"\"))","v":""}]
[null,"Joueur 4","set 1","set 2","set 3","set 4","set 5","J1-J4","set 1","set 2","set 3","set 4","set 5","J2-J4","set 1","set 2","set 3","set 4","set 5","J3-J4",null,null,null,null,null,null,"set 1","set 2","set 3","set 4","set 5","J4-J5",null,null,null,null,null,null,null,null,null,null,null,null,null,null,null,null,null,null,null,{"$f":"IF(BH109<>\"\",RANK(BH109,BH97:BH116),\"\")","v":""},{"$f":"IF(TYPE_QUALIF=\"Poules 6J\",(COUNTIF(H110:AF110,\"G\")*VAL_PT_MATCH)+VAL_PT_MATCH,COUNTIF(H110:AF110,\"G\")*VAL_PT_MATCH)","v":0},{"$f":"IF(TYPE_QUALIF=\"Poules 6J\",(NB_SETS_G_Q*2-1)+SUM(AF111,H111,T111,N111),SUM(AF111,H111,T111,N111))","v":0},{"$f":"IF(BF109<>0,ROUNDDOWN(BE109/BF109,3),\"\")","v":""},{"$f":"MAX(N112,T112,H112,AF112)","v":0},{"$f":"SUM(I110:M110,O110:S110,C110:G110,AA110:AE110)","v":0},{"$f":"SUM(U114:Y114,U106:Y106,U102:Y102,U98:Y98)","v":0},null,{"$f":"IF(BC109<>\"\",(BA109*10000000)+(BB109*100000)+(BC109*10000)+BD109,\"\")","v":""}]
[null,"Nom & Prénom",null,null,null,null,null,{"$f":"IF(COUNTIF(C110:G110,DISTANCE_Q)=NB_SETS_G_Q,\"G\",IF(COUNTIF(U98:Y98,DISTANCE_Q)=NB_SETS_G_Q,\"P\",\"\"))","v":""},null,null,null,null,null,{"$f":"IF(COUNTIF(I110:M110,DISTANCE_Q)=NB_SETS_G_Q,\"G\",IF(COUNTIF(U102:Y102,DISTANCE_Q)=NB_SETS_G_Q,\"P\",\"\"))","v":""},null,null,null,null,null,{"$f":"IF(COUNTIF(O110:S110,DISTANCE_Q)=NB_SETS_G_Q,\"G\",IF(COUNTIF(U106:Y106,DISTANCE_Q)=NB_SETS_G_Q,\"P\",\"\"))","v":""},null,null,null,null,null,null,null,null,null,null,null,{"$f":"IF(COUNTIF(AA110:AE110,DISTANCE_Q)=NB_SETS_G_Q,\"G\",IF(COUNTIF(U114:Y114,DISTANCE_Q)=NB_SETS_G_Q,\"P\",\"\"))","v":""}]
[null,"Ville ou Club",{"$f":"IF(OR(COUNTIF(C110:G110,\"\")<>COUNTIF(U98:Y98,\"\"),AND(H110=\"\",SUM(C110:G110)<>0)),\"!...\",IF(OR(AND(H110<>\"\",C110=\"\",C110<>U98),AND(H110<>\"\",C110<>\"\",C110=U98),AND(H110<>\"\",C110<>\"\",C110<>DISTANCE_Q,U98<>DISTANCE_Q)),\"ERR!\",\"\"))","v":""},{"$f":"IF(C111=\"!...\",C111,IF(OR(AND(H110<>\"\",D110=\"\",D110<>V98),AND(H110<>\"\",D110<>\"\",D110=V98),AND(H110<>\"\",D110<>\"\",D110<>DISTANCE_Q,V98<>DISTANCE_Q)),\"ERR!\",\"\"))","v":""},{"$f":"IF(D111=\"!...\",D111,IF(OR(AND(H110<>\"\",E110=\"\",E110<>W98),AND(H110<>\"\",E110<>\"\",E110=W98),AND(H110<>\"\",E110<>\"\",E110<>DISTANCE_Q,W98<>DISTANCE_Q)),\"ERR!\",\"\"))","v":""},{"$f":"IF(E111=\"!...\",E111,IF(OR(AND(H110<>\"\",F110=\"\",F110<>X98),AND(H110<>\"\",F110<>\"\",F110=X98),AND(H110<>\"\",F110<>\"\",F110<>DISTANCE_Q,X98<>DISTANCE_Q)),\"ERR!\",\"\"))","v":""},{"$f":"IF(F111=\"!...\",F111,IF(OR(AND(H110<>\"\",G110=\"\",G110<>Y98),AND(H110<>\"\",G110<>\"\",G110=Y98),AND(H110<>\"\",G110<>\"\",G110<>DISTANCE_Q,Y98<>DISTANCE_Q)),\"ERR!\",\"\"))","v":""},{"$f":"IF(H110=\"\",\"\",IF(H110=\"G\",(NB_SETS_G_Q*2)-1-COUNTIF(U98:Y98,DISTANCE_Q),COUNTIF(C110:G110,DISTANCE_Q)))","v":""},{"$f":"IF(OR(COUNTIF(I110:M110,\"\")<>COUNTIF(U102:Y102,\"\"),AND(N110=\"\",SUM(I110:M110)<>0)),\"!...\",IF(OR(AND(N110<>\"\",I110=\"\",I110<>U102),AND(N110<>\"\",I110<>\"\",I110=U102),AND(N110<>\"\",I110<>\"\",I110<>DISTANCE_Q,U102<>DISTANCE_Q)),\"ERR!\",\"\"))","v":""},{"$f":"IF(I111=\"!...\",I111,IF(OR(AND(N110<>\"\",J110=\"\",J110<>V102),AND(N110<>\"\",J110<>\"\",J110=V102),AND(N110<>\"\",J110<>\"\",J110<>DISTANCE_Q,V102<>DISTANCE_Q)),\"ERR!\",\"\"))","v":""},{"$f":"IF(J111=\"!...\",J111,IF(OR(AND(N110<>\"\",K110=\"\",K110<>W102),AND(N110<>\"\",K110<>\"\",K110=W102),AND(N110<>\"\",K110<>\"\",K110<>DISTANCE_Q,W102<>DISTANCE_Q)),\"ERR!\",\"\"))","v":""},{"$f":"IF(K111=\"!...\",K111,IF(OR(AND(N110<>\"\",L110=\"\",L110<>X102),AND(N110<>\"\",L110<>\"\",L110=X102),AND(N110<>\"\",L110<>\"\",L110<>DISTANCE_Q,X102<>DISTANCE_Q)),\"ERR!\",\"\"))","v":""},{"$f":"IF(L111=\"!...\",L111,IF(OR(AND(N110<>\"\",M110=\"\",M110<>Y102),AND(N110<>\"\",M110<>\"\",M110=Y102),AND(N110<>\"\",M110<>\"\",M110<>DISTANCE_Q,Y102<>DISTANCE_Q)),\"ERR!\",\"\"))","v":""},{"$f":"IF(N110=\"\",\"\",IF(N110=\"G\",(NB_SETS_G_Q*2)-1-COUNTIF(U102:Y102,DISTANCE_Q),COUNTIF(I110:M110,DISTANCE_Q)))","v":""},{"$f":"IF(OR(COUNTIF(O110:S110,\"\")<>COUNTIF(U106:Y106,\"\"),AND(T110=\"\",SUM(O110:S110)<>0)),\"!...\",IF(OR(AND(T110<>\"\",O110=\"\",O110<>U106),AND(T110<>\"\",O110<>\"\",O110=U106),AND(T110<>\"\",O110<>\"\",O110<>DISTANCE_Q,U106<>DISTANCE_Q)),\"ERR!\",\"\"))","v":""},{"$f":"IF(O111=\"!...\",O111,IF(OR(AND(T110<>\"\",P110=\"\",P110<>V106),AND(T110<>\"\",P110<>\"\",P110=V106),AND(T110<>\"\",P110<>\"\",P110<>DISTANCE_Q,V106<>DISTANCE_Q)),\"ERR!\",\"\"))","v":""},{"$f":"IF(P111=\"!...\",P111,IF(OR(AND(T110<>\"\",Q110=\"\",Q110<>W106),AND(T110<>\"\",Q110<>\"\",Q110=W106),AND(T110<>\"\",Q110<>\"\",Q110<>DISTANCE_Q,W106<>DISTANCE_Q)),\"ERR!\",\"\"))","v":""},{"$f":"IF(Q111=\"!...\",Q111,IF(OR(AND(T110<>\"\",R110=\"\",R110<>X106),AND(T110<>\"\",R110<>\"\",R110=X106),AND(T110<>\"\",R110<>\"\",R110<>DISTANCE_Q,X106<>DISTANCE_Q)),\"ERR!\",\"\"))","v":""},{"$f":"IF(R111=\"!...\",R111,IF(OR(AND(T110<>\"\",S110=\"\",S110<>Y106),AND(T110<>\"\",S110<>\"\",S110=Y106),AND(T110<>\"\",S110<>\"\",S110<>DISTANCE_Q,Y106<>DISTANCE_Q)),\"ERR!\",\"\"))","v":""},{"$f":"IF(T110=\"\",\"\",IF(T110=\"G\",(NB_SETS_G_Q*2)-1-COUNTIF(U106:Y106,DISTANCE_Q),COUNTIF(O110:S110,DISTANCE_Q)))","v":""},null,null,null,null,null,null,{"$f":"IF(OR(COUNTIF(AA110:AE110,\"\")<>COUNTIF(U114:Y114,\"\"),AND(AF110=\"\",SUM(AA110:AE110)<>0)),\"!...\",IF(OR(AND(AF110<>\"\",AA110=\"\",AA110<>U114),AND(AF110<>\"\",AA110<>\"\",AA110=U114),AND(AF110<>\"\",AA110<>\"\",AA110<>DISTANCE_Q,U114<>DISTANCE_Q)),\"ERR!\",\"\"))","v":""},{"$f":"IF(AA111=\"!...\",AA111,IF(OR(AND(AF110<>\"\",AB110=\"\",AB110<>V114),AND(AF110<>\"\",AB110<>\"\",AB110=V114),AND(AF110<>\"\",AB110<>\"\",AB110<>DISTANCE_Q,V114<>DISTANCE_Q)),\"ERR!\",\"\"))","v":""},{"$f":"IF(AB111=\"!...\",AB111,IF(OR(AND(AF110<>\"\",AC110=\"\",AC110<>W114),AND(AF110<>\"\",AC110<>\"\",AC110=W114),AND(AF110<>\"\",AC110<>\"\",AC110<>DISTANCE_Q,W114<>DISTANCE_Q)),\"ERR!\",\"\"))","v":""},{"$f":"IF(AC111=\"!...\",AC111,IF(OR(AND(AF110<>\"\",AD110=\"\",AD110<>X114),AND(AF110<>\"\",AD110<>\"\",AD110=X114),AND(AF110<>\"\",AD110<>\"\",AD110<>DISTANCE_Q,X114<>DISTANCE_Q)),\"ERR!\",\"\"))","v":""},{"$f":"IF(AD111=\"!...\",AD111,IF(OR(AND(AF110<>\"\",AE110=\"\",AE110<>Y114),AND(AF110<>\"\",AE110<>\"\",AE110=Y114),AND(AF110<>\"\",AE110<>\"\",AE110<>DISTANCE_Q,Y114<>DISTANCE_Q)),\"ERR!\",\"\"))","v":""},{"$f":"IF(AF110=\"\",\"\",IF(AF110=\"G\",(NB_SETS_G_Q*2)-1-COUNTIF(U114:Y114,DISTANCE_Q),COUNTIF(AA110:AE110,DISTANCE_Q)))","v":""}]
[null,"Licence",null,null,null,null,null,{"$f":"IF(H110=\"\",\"\",IF(SUM(U98:Y98)<>0,ROUNDDOWN(SUM(C110:G110)/SUM(U98:Y98),3),\"\"))","v":""},null,null,null,null,null,{"$f":"IF(N110=\"\",\"\",IF(SUM(U102:Y102)<>0,ROUNDDOWN(SUM(I110:M110)/SUM(U102:Y102),3),\"\"))","v":""},null,null,null,null,null,{"$f":"IF(T110=\"\",\"\",IF(SUM(U106:Y106)<>0,ROUNDDOWN(SUM(O110:S110)/SUM(U106:Y106),3),\"\"))","v":""},null,null,null,null,null,null,null,null,null,null,null,{"$f":"IF(AF110=\"\",\"\",IF(SUM(U114:Y114)<>0,ROUNDDOWN(SUM(AA110:AE110)/SUM(U114:Y114),3),\"\"))","v":""}]
[null,"Joueur 5","set 1","set 2","set 3","set 4","set 5","J1-J5","set 1","set 2","set 3","set 4","set 5","J2-J5","set 1","set 2","set 3","set 4","set 5","J3-J5","set 1","set 2","set 3","set 4","set 5","J4-J5",null,null,null,null,null,null,null,null,null,null,null,null,null,null,null,null,null,null,null,null,null,null,null,null,null,{"$f":"IF(BH113<>\"\",RANK(BH113,BH97:BH116),\"\")","v":""},{"$f":"IF(TYPE_QUALIF=\"Poules 6J\",(COUNTIF(H114:AF114,\"G\")*VAL_PT_MATCH)+VAL_PT_MATCH,COUNTIF(H114:AF114,\"G\")*VAL_PT_MATCH)","v":0},{"$f":"IF(TYPE_QUALIF=\"Poules 6J\",(NB_SETS_G_Q*2-1)+SUM(H115,Z115,T115,N115),SUM(H115,Z115,T115,N115))","v":0},{"$f":"IF(BF113<>0,ROUNDDOWN(BE113/BF113,3),\"\")","v":""},{"$f":"MAX(N116,T116,Z116,H116)","v":0},{"$f":"SUM(I114:M114,O114:S114,U114:Y114,C114:G114)","v":0},{"$f":"SUM(AA110:AE110,AA106:AE106,AA102:AE102,AA98:AE98)","v":0},null,{"$f":"IF(BC113<>\"\",(BA113*10000000)+(BB113*100000)+(BC113*10000)+BD113,\"\")","v":""}]
[null,"Nom & Prénom",null,null,null,null,null,{"$f":"IF(COUNTIF(C114:G114,DISTANCE_Q)=NB_SETS_G_Q,\"G\",IF(COUNTIF(AA98:AE98,DISTANCE_Q)=NB_SETS_G_Q,\"P\",\"\"))","v":""},null,null,null,null,null,{"$f":"IF(COUNTIF(I114:M114,DISTANCE_Q)=NB_SETS_G_Q,\"G\",IF(COUNTIF(AA102:AE102,DISTANCE_Q)=NB_SETS_G_Q,\"P\",\"\"))","v":""},null,null,null,null,null,{"$f":"IF(COUNTIF(O114:S114,DISTANCE_Q)=NB_SETS_G_Q,\"G\",IF(COUNTIF(AA106:AE106,DISTANCE_Q)=NB_SETS_G_Q,\"P\",\"\"))","v":""},null,null,null,null,null,{"$f":"IF(COUNTIF(U114:Y114,DISTANCE_Q)=NB_SETS_G_Q,\"G\",IF(COUNTIF(AA110:AE110,DISTANCE_Q)=NB_SETS_G_Q,\"P\",\"\"))","v":""}]
[null,"Ville ou Club",{"$f":"IF(OR(COUNTIF(C114:G114,\"\")<>COUNTIF(AA98:AE98,\"\"),AND(H114=\"\",SUM(C114:G114)<>0)),\"!...\",IF(OR(AND(H114<>\"\",C114=\"\",C114<>AA98),AND(H114<>\"\",C114<>\"\",C114=AA98),AND(H114<>\"\",C114<>\"\",C114<>DISTANCE_Q,AA98<>DISTANCE_Q)),\"ERR!\",\"\"))","v":""},{"$f":"IF(C115=\"!...\",C115,IF(OR(AND(H114<>\"\",D114=\"\",D114<>AB98),AND(H114<>\"\",D114<>\"\",D114=AB98),AND(H114<>\"\",D114<>\"\",D114<>DISTANCE_Q,AB98<>DISTANCE_Q)),\"ERR!\",\"\"))","v":""},{"$f":"IF(D115=\"!...\",D115,IF(OR(AND(H114<>\"\",E114=\"\",E114<>AC98),AND(H114<>\"\",E114<>\"\",E114=AC98),AND(H114<>\"\",E114<>\"\",E114<>DISTANCE_Q,AC98<>DISTANCE_Q)),\"ERR!\",\"\"))","v":""},{"$f":"IF(E115=\"!...\",E115,IF(OR(AND(H114<>\"\",F114=\"\",F114<>AD98),AND(H114<>\"\",F114<>\"\",F114=AD98),AND(H114<>\"\",F114<>\"\",F114<>DISTANCE_Q,AD98<>DISTANCE_Q)),\"ERR!\",\"\"))","v":""},{"$f":"IF(F115=\"!...\",F115,IF(OR(AND(H114<>\"\",G114=\"\",G114<>AE98),AND(H114<>\"\",G114<>\"\",G114=AE98),AND(H114<>\"\",G114<>\"\",G114<>DISTANCE_Q,AE98<>DISTANCE_Q)),\"ERR!\",\"\"))","v":""},{"$f":"IF(H114=\"\",\"\",IF(H114=\"G\",(NB_SETS_G_Q*2)-1-COUNTIF(AA98:AE98,DISTANCE_Q),COUNTIF(C114:G114,DISTANCE_Q)))","v":""},{"$f":"IF(OR(COUNTIF(I114:M114,\"\")<>COUNTIF(AA102:AE102,\"\"),AND(N114=\"\",SUM(I114:M114)<>0)),\"!...\",IF(OR(AND(N114<>\"\",I114=\"\",I114<>AA102),AND(N114<>\"\",I114<>\"\",I114=AA102),AND(N114<>\"\",I114<>\"\",I114<>DISTANCE_Q,AA102<>DISTANCE_Q)),\"ERR!\",\"\"))","v":""},{"$f":"IF(I115=\"!...\",I115,IF(OR(AND(N114<>\"\",J114=\"\",J114<>AB102),AND(N114<>\"\",J114<>\"\",J114=AB102),AND(N114<>\"\",J114<>\"\",J114<>DISTANCE_Q,AB102<>DISTANCE_Q)),\"ERR!\",\"\"))","v":""},{"$f":"IF(J115=\"!...\",J115,IF(OR(AND(N114<>\"\",K114=\"\",K114<>AC102),AND(N114<>\"\",K114<>\"\",K114=AC102),AND(N114<>\"\",K114<>\"\",K114<>DISTANCE_Q,AC102<>DISTANCE_Q)),\"ERR!\",\"\"))","v":""},{"$f":"IF(K115=\"!...\",K115,IF(OR(AND(N114<>\"\",L114=\"\",L114<>AD102),AND(N114<>\"\",L114<>\"\",L114=AD102),AND(N114<>\"\",L114<>\"\",L114<>DISTANCE_Q,AD102<>DISTANCE_Q)),\"ERR!\",\"\"))","v":""},{"$f":"IF(L115=\"!...\",L115,IF(OR(AND(N114<>\"\",M114=\"\",M114<>AE102),AND(N114<>\"\",M114<>\"\",M114=AE102),AND(N114<>\"\",M114<>\"\",M114<>DISTANCE_Q,AE102<>DISTANCE_Q)),\"ERR!\",\"\"))","v":""},{"$f":"IF(N114=\"\",\"\",IF(N114=\"G\",(NB_SETS_G_Q*2)-1-COUNTIF(AA102:AE102,DISTANCE_Q),COUNTIF(I114:M114,DISTANCE_Q)))","v":""},{"$f":"IF(OR(COUNTIF(O114:S114,\"\")<>COUNTIF(AA106:AE106,\"\"),AND(T114=\"\",SUM(O114:S114)<>0)),\"!...\",IF(OR(AND(T114<>\"\",O114=\"\",O114<>AA106),AND(T114<>\"\",O114<>\"\",O114=AA106),AND(T114<>\"\",O114<>\"\",O114<>DISTANCE_Q,AA106<>DISTANCE_Q)),\"ERR!\",\"\"))","v":""},{"$f":"IF(O115=\"!...\",O115,IF(OR(AND(T114<>\"\",P114=\"\",P114<>AB106),AND(T114<>\"\",P114<>\"\",P114=AB106),AND(T114<>\"\",P114<>\"\",P114<>DISTANCE_Q,AB106<>DISTANCE_Q)),\"ERR!\",\"\"))","v":""},{"$f":"IF(P115=\"!...\",P115,IF(OR(AND(T114<>\"\",Q114=\"\",Q114<>AC106),AND(T114<>\"\",Q114<>\"\",Q114=AC106),AND(T114<>\"\",Q114<>\"\",Q114<>DISTANCE_Q,AC106<>DISTANCE_Q)),\"ERR!\",\"\"))","v":""},{"$f":"IF(Q115=\"!...\",Q115,IF(OR(AND(T114<>\"\",R114=\"\",R114<>AD106),AND(T114<>\"\",R114<>\"\",R114=AD106),AND(T114<>\"\",R114<>\"\",R114<>DISTANCE_Q,AD106<>DISTANCE_Q)),\"ERR!\",\"\"))","v":""},{"$f":"IF(R115=\"!...\",R115,IF(OR(AND(T114<>\"\",S114=\"\",S114<>AE106),AND(T114<>\"\",S114<>\"\",S114=AE106),AND(T114<>\"\",S114<>\"\",S114<>DISTANCE_Q,AE106<>DISTANCE_Q)),\"ERR!\",\"\"))","v":""},{"$f":"IF(T114=\"\",\"\",IF(T114=\"G\",(NB_SETS_G_Q*2)-1-COUNTIF(AA106:AE106,DISTANCE_Q),COUNTIF(O114:S114,DISTANCE_Q)))","v":""},{"$f":"IF(OR(COUNTIF(U114:Y114,\"\")<>COUNTIF(AA110:AE110,\"\"),AND(Z114=\"\",SUM(U114:Y114)<>0)),\"!...\",IF(OR(AND(Z114<>\"\",U114=\"\",U114<>AA110),AND(Z114<>\"\",U114<>\"\",U114=AA110),AND(Z114<>\"\",U114<>\"\",U114<>DISTANCE_Q,AA110<>DISTANCE_Q)),\"ERR!\",\"\"))","v":""},{"$f":"IF(U115=\"!...\",U115,IF(OR(AND(Z114<>\"\",V114=\"\",V114<>AB110),AND(Z114<>\"\",V114<>\"\",V114=AB110),AND(Z114<>\"\",V114<>\"\",V114<>DISTANCE_Q,AB110<>DISTANCE_Q)),\"ERR!\",\"\"))","v":""},{"$f":"IF(V115=\"!...\",V115,IF(OR(AND(Z114<>\"\",W114=\"\",W114<>AC110),AND(Z114<>\"\",W114<>\"\",W114=AC110),AND(Z114<>\"\",W114<>\"\",W114<>DISTANCE_Q,AC110<>DISTANCE_Q)),\"ERR!\",\"\"))","v":""},{"$f":"IF(W115=\"!...\",W115,IF(OR(AND(Z114<>\"\",X114=\"\",X114<>AD110),AND(Z114<>\"\",X114<>\"\",X114=AD110),AND(Z114<>\"\",X114<>\"\",X114<>DISTANCE_Q,AD110<>DISTANCE_Q)),\"ERR!\",\"\"))","v":""},{"$f":"IF(X115=\"!...\",X115,IF(OR(AND(Z114<>\"\",Y114=\"\",Y114<>AE110),AND(Z114<>\"\",Y114<>\"\",Y114=AE110),AND(Z114<>\"\",Y114<>\"\",Y114<>DISTANCE_Q,AE110<>DISTANCE_Q)),\"ERR!\",\"\"))","v":""},{"$f":"IF(Z114=\"\",\"\",IF(Z114=\"G\",(NB_SETS_G_Q*2)-1-COUNTIF(AA110:AE110,DISTANCE_Q),COUNTIF(U114:Y114,DISTANCE_Q)))","v":""}]
[null,"Licence",null,null,null,null,null,{"$f":"IF(H114=\"\",\"\",IF(SUM(AA98:AE98)<>0,ROUNDDOWN(SUM(C114:G114)/SUM(AA98:AE98),3),\"\"))","v":""},null,null,null,null,null,{"$f":"IF(N114=\"\",\"\",IF(SUM(AA102:AE102)<>0,ROUNDDOWN(SUM(I114:M114)/SUM(AA102:AE102),3),\"\"))","v":""},null,null,null,null,null,{"$f":"IF(T114=\"\",\"\",IF(SUM(AA106:AE106)<>0,ROUNDDOWN(SUM(O114:S114)/SUM(AA106:AE106),3),\"\"))","v":""},null,null,null,null,null,{"$f":"IF(Z114=\"\",\"\",IF(SUM(AA110:AE110)<>0,ROUNDDOWN(SUM(U114:Y114)/SUM(AA110:AE110),3),\"\"))","v":""}]
[]
[]
[null,"Poule",{"$f":"\"J\" & RIGHT(B120,1) & \" \" &B121","v":"J1 Nom & Prénom"},null,null,null,null,null,{"$f":"\"J\" & RIGHT(B124,1) & \" \" &B125","v":"J2 Nom & Prénom"},null,null,null,null,null,{"$f":"\"J\" & RIGHT(B128,1) & \" \" &B129","v":"J3 Nom & Prénom"},null,null,null,null,null,{"$f":"\"J\" & RIGHT(B132,1) & \" \" &B133","v":"J4 Nom & Prénom"},null,null,null,null,null,null,null,null,null,null,null,null,null,null,null,null,null,null,null,null,null,null,null,null,null,null,null,null,null,null,"Clst","Pts Match","Pts Sets","Moy. Gen.","Moy. Part.","Pts marq.","Pts subis",null,"Calcul 1er"]
[null,"Joueur 1","Sets",null,null,null,null,"Match","set 1","set 2","set 3","set 4","set 5","J1-J2","set 1","set 2","set 3","set 4","set 5","J1-J3","set 1","set 2","set 3","set 4","set 5","J1-J4",null,null,null,null,null,null,null,null,null,null,null,null,null,null,null,null,null,null,null,null,null,null,null,null,null,{"$f":"IF(BH120<>\"\",RANK(BH120,BH120:BH135),\"\")","v":""},{"$f":"IF(TYPE_QUALIF=\"Poules 5J\",(COUNTIF(N121:Z121,\"G\")*VAL_PT_MATCH)+VAL_PT_MATCH,COUNTIF(N121:Z121,\"G\")*VAL_PT_MATCH)","v":0},{"$f":"IF(TYPE_QUALIF=\"Poules 5J\",(NB_SETS_G_Q*2-1)+SUM(Z122,T122,N122),SUM(Z122,T122,N122))","v":0},{"$f":"IF(BF120<>0,ROUNDDOWN(BE120/BF120,3),\"\")","v":""},{"$f":"MAX(N123,T123,Z123)","v":0},{"$f":"SUM(I121:M121,O121:S121,U121:Y121)","v":0},{"$f":"SUM(C125:G125,C129:G129,C133:G133)","v":0},null,{"$f":"IF(BC120<>\"\",(BA120*10000000)+(BB120*100000)+(BC120*10000)+BD120,\"\")","v":""}]
[null,"Nom & Prénom","Pts",null,null,null,null,"G/P",null,null,null,null,null,{"$f":"IF(COUNTIF(I121:M121,DISTANCE_Q)=NB_SETS_G_Q,\"G\",IF(COUNTIF(C125:G125,DISTANCE_Q)=NB_SETS_G_Q,\"P\",\"\"))","v":""},null,null,null,null,null,{"$f":"IF(COUNTIF(O121:S121,DISTANCE_Q)=NB_SETS_G_Q,\"G\",IF(COUNTIF(C129:G129,DISTANCE_Q)=NB_SETS_G_Q,\"P\",\"\"))","v":""},null,null,null,null,null,{"$f":"IF(COUNTIF(U121:Y121,DISTANCE_Q)=NB_SETS_G_Q,\"G\",IF(COUNTIF(C133:G133,DISTANCE_Q)=NB_SETS_G_Q,\"P\",\"\"))","v":""}]
[null,"Ville ou Club",null,null,null,null,null,"Pts de Sets",{"$f":"IF(OR(COUNTIF(I121:M121,\"\")<>COUNTIF(C125:G125,\"\"),AND(N121=\"\",SUM(I121:M121)<>0)),\"!...\",IF(OR(AND(N121<>\"\",I121=\"\",I121<>C125),AND(N121<>\"\",I121<>\"\",I121=C125),AND(N121<>\"\",I121<>\"\",I121<>DISTANCE_Q,C125<>DISTANCE_Q)),\"ERR!\",\"\"))","v":""},{"$f":"IF(I122=\"!...\",I122,IF(OR(AND(N121<>\"\",J121=\"\",J121<>D125),AND(N121<>\"\",J121<>\"\",J121=D125),AND(N121<>\"\",J121<>\"\",J121<>DISTANCE_Q,D125<>DISTANCE_Q)),\"ERR!\",\"\"))","v":""},{"$f":"IF(J122=\"!...\",J122,IF(OR(AND(N121<>\"\",K121=\"\",K121<>E125),AND(N121<>\"\",K121<>\"\",K121=E125),AND(N121<>\"\",K121<>\"\",K121<>DISTANCE_Q,E125<>DISTANCE_Q)),\"ERR!\",\"\"))","v":""},{"$f":"IF(K122=\"!...\",K122,IF(OR(AND(N121<>\"\",L121=\"\",L121<>F125),AND(N121<>\"\",L121<>\"\",L121=F125),AND(N121<>\"\",L121<>\"\",L121<>DISTANCE_Q,F125<>DISTANCE_Q)),\"ERR!\",\"\"))","v":""},{"$f":"IF(L122=\"!...\",L122,IF(OR(AND(N121<>\"\",M121=\"\",M121<>G125),AND(N121<>\"\",M121<>\"\",M121=G125),AND(N121<>\"\",M121<>\"\",M121<>DISTANCE_Q,G125<>DISTANCE_Q)),\"ERR!\",\"\"))","v":""},{"$f":"IF(N121=\"\",\"\",IF(N121=\"G\",(NB_SETS_G_Q*2)-1-COUNTIF(C125:G125,DISTANCE_Q),COUNTIF(I121:M121,DISTANCE_Q)))","v":""},{"$f":"IF(OR(COUNTIF(O121:S121,\"\")<>COUNTIF(C129:G129,\"\"),AND(T121=\"\",SUM(O121:S121)<>0)),\"!...\",IF(OR(AND(T121<>\"\",O121=\"\",O121<>C129),AND(T121<>\"\",O121<>\"\",O121=C129),AND(T121<>\"\",O121<>\"\",O121<>DISTANCE_Q,C129<>DISTANCE_Q)),\"ERR!\",\"\"))","v":""},{"$f":"IF(O122=\"!...\",O122,IF(OR(AND(T121<>\"\",P121=\"\",P121<>D129),AND(T121<>\"\",P121<>\"\",P121=D129),AND(T121<>\"\",P121<>\"\",P121<>DISTANCE_Q,D129<>DISTANCE_Q)),\"ERR!\",\"\"))","v":""},{"$f":"IF(P122=\"!...\",P122,IF(OR(AND(T121<>\"\",Q121=\"\",Q121<>E129),AND(T121<>\"\",Q121<>\"\",Q121=E129),AND(T121<>\"\",Q121<>\"\",Q121<>DISTANCE_Q,E129<>DISTANCE_Q)),\"ERR!\",\"\"))","v":""},{"$f":"IF(Q122=\"!...\",Q122,IF(OR(AND(T121<>\"\",R121=\"\",R121<>F129),AND(T121<>\"\",R121<>\"\",R121=F129),AND(T121<>\"\",R121<>\"\",R121<>DISTANCE_Q,F129<>DISTANCE_Q)),\"ERR!\",\"\"))","v":""},{"$f":"IF(R122=\"!...\",R122,IF(OR(AND(T121<>\"\",S121=\"\",S121<>G129),AND(T121<>\"\",S121<>\"\",S121=G129),AND(T121<>\"\",S121<>\"\",S121<>DISTANCE_Q,G129<>DISTANCE_Q)),\"ERR!\",\"\"))","v":""},{"$f":"IF(T121=\"\",\"\",IF(T121=\"G\",(NB_SETS_G_Q*2)-1-COUNTIF(C129:G129,DISTANCE_Q),COUNTIF(O121:S121,DISTANCE_Q)))","v":""},{"$f":"IF(OR(COUNTIF(U121:Y121,\"\")<>COUNTIF(C133:G133,\"\"),AND(Z121=\"\",SUM(U121:Y121)<>0)),\"!...\",IF(OR(AND(Z121<>\"\",U121=\"\",U121<>C133),AND(Z121<>\"\",U121<>\"\",U121=C133),AND(Z121<>\"\",U121<>\"\",U121<>DISTANCE_Q,C133<>DISTANCE_Q)),\"ERR!\",\"\"))","v":""},{"$f":"IF(U122=\"!...\",U122,IF(OR(AND(Z121<>\"\",V121=\"\",V121<>D133),AND(Z121<>\"\",V121<>\"\",V121=D133),AND(Z121<>\"\",V121<>\"\",V121<>DISTANCE_Q,D133<>DISTANCE_Q)),\"ERR!\",\"\"))","v":""},{"$f":"IF(V122=\"!...\",V122,IF(OR(AND(Z121<>\"\",W121=\"\",W121<>E133),AND(Z121<>\"\",W121<>\"\",W121=E133),AND(Z121<>\"\",W121<>\"\",W121<>DISTANCE_Q,E133<>DISTANCE_Q)),\"ERR!\",\"\"))","v":""},{"$f":"IF(W122=\"!...\",W122,IF(OR(AND(Z121<>\"\",X121=\"\",X121<>F133),AND(Z121<>\"\",X121<>\"\",X121=F133),AND(Z121<>\"\",X121<>\"\",X121<>DISTANCE_Q,F133<>DISTANCE_Q)),\"ERR!\",\"\"))","v":""},{"$f":"IF(X122=\"!...\",X122,IF(OR(AND(Z121<>\"\",Y121=\"\",Y121<>G133),AND(Z121<>\"\",Y121<>\"\",Y121=G133),AND(Z121<>\"\",Y121<>\"\",Y121<>DISTANCE_Q,G133<>DISTANCE_Q)),\"ERR!\",\"\"))","v":""},{"$f":"IF(Z121=\"\",\"\",IF(Z121=\"G\",(NB_SETS_G_Q*2)-1-COUNTIF(C133:G133,DISTANCE_Q),COUNTIF(U121:Y121,DISTANCE_Q)))","v":""}]
[null,"Licence",null,null,null,null,null,"Moyenne",null,null,null,null,null,{"$f":"IF(N121=\"\",\"\",IF(SUM(C125:G125)<>0,ROUNDDOWN(SUM(I121:M121)/SUM(C125:G125),3),\"\"))","v":""},null,null,null,null,null,{"$f":"IF(T121=\"\",\"\",IF(SUM(C129:G129)<>0,ROUNDDOWN(SUM(O121:S121)/SUM(C129:G129),3),\"\"))","v":""},null,null,null,null,null,{"$f":"IF(Z121=\"\",\"\",IF(SUM(C133:G133)<>0,ROUNDDOWN(SUM(U121:Y121)/SUM(C133:G133),3),\"\"))","v":""}]
[null,"Joueur 2","set 1","set 2","set 3","set 4","set 5","J1-J2",null,null,null,null,null,null,"set 1","set 2","set 3","set 4","set 5","J2-J3","set 1","set 2","set 3","set 4","set 5","J2-J4",null,null,null,null,null,null,null,null,null,null,null,null,null,null,null,null,null,null,null,null,null,null,null,null,null,{"$f":"IF(BH124<>\"\",RANK(BH124,BH120:BH135),\"\")","v":""},{"$f":"IF(TYPE_QUALIF=\"Poules 5J\",(COUNTIF(H125:Z125,\"G\")*VAL_PT_MATCH)+VAL_PT_MATCH,COUNTIF(H125:Z125,\"G\")*VAL_PT_MATCH)","v":0},{"$f":"IF(TYPE_QUALIF=\"Poules 5J\",(NB_SETS_G_Q*2-1)+SUM(Z126,T126,H126),SUM(Z126,T126,H126))","v":0},{"$f":"IF(BF124<>0,ROUNDDOWN(BE124/BF124,3),\"\")","v":""},{"$f":"MAX(H127,T127,Z127)","v":0},{"$f":"SUM(C125:G125,O125:S125,U125:Y125)","v":0},{"$f":"SUM(I129:M129,I133:M133,I121:M121)","v":0},null,{"$f":"IF(BC124<>\"\",(BA124*10000000)+(BB124*100000)+(BC124*10000)+BD124,\"\")","v":""}]
[null,"Nom & Prénom",null,null,null,null,null,{"$f":"IF(COUNTIF(C125:G125,DISTANCE_Q)=NB_SETS_G_Q,\"G\",IF(COUNTIF(I121:M121,DISTANCE_Q)=NB_SETS_G_Q,\"P\",\"\"))","v":""},null,null,null,null,null,null,null,null,null,null,null,{"$f":"IF(COUNTIF(O125:S125,DISTANCE_Q)=NB_SETS_G_Q,\"G\",IF(COUNTIF(I129:M129,DISTANCE_Q)=NB_SETS_G_Q,\"P\",\"\"))","v":""},null,null,null,null,null,{"$f":"IF(COUNTIF(U125:Y125,DISTANCE_Q)=NB_SETS_G_Q,\"G\",IF(COUNTIF(I133:M133,DISTANCE_Q)=NB_SETS_G_Q,\"P\",\"\"))","v":""}]
[null,"Ville ou Club",{"$f":"IF(OR(COUNTIF(C125:G125,\"\")<>COUNTIF(I121:M121,\"\"),AND(H125=\"\",SUM(C125:G125)<>0)),\"!...\",IF(OR(AND(H125<>\"\",C125=\"\",C125<>I121),AND(H125<>\"\",C125<>\"\",C125=I121),AND(H125<>\"\",C125<>\"\",C125<>DISTANCE_Q,I121<>DISTANCE_Q)),\"ERR!\",\"\"))","v":""},{"$f":"IF(C126=\"!...\",C126,IF(OR(AND(H125<>\"\",D125=\"\",D125<>J121),AND(H125<>\"\",D125<>\"\",D125=J121),AND(H125<>\"\",D125<>\"\",D125<>DISTANCE_Q,J121<>DISTANCE_Q)),\"ERR!\",\"\"))","v":""},{"$f":"IF(D126=\"!...\",D126,IF(OR(AND(H125<>\"\",E125=\"\",E125<>K121),AND(H125<>\"\",E125<>\"\",E125=K121),AND(H125<>\"\",E125<>\"\",E125<>DISTANCE_Q,K121<>DISTANCE_Q)),\"ERR!\",\"\"))","v":""},{"$f":"IF(E126=\"!...\",E126,IF(OR(AND(H125<>\"\",F125=\"\",F125<>L121),AND(H125<>\"\",F125<>\"\",F125=L121),AND(H125<>\"\",F125<>\"\",F125<>DISTANCE_Q,L121<>DISTANCE_Q)),\"ERR!\",\"\"))","v":""},{"$f":"IF(F126=\"!...\",F126,IF(OR(AND(H125<>\"\",G125=\"\",G125<>M121),AND(H125<>\"\",G125<>\"\",G125=M121),AND(H125<>\"\",G125<>\"\",G125<>DISTANCE_Q,M121<>DISTANCE_Q)),\"ERR!\",\"\"))","v":""},{"$f":"IF(H125=\"\",\"\",IF(H125=\"G\",(NB_SETS_G_Q*2)-1-COUNTIF(I121:M121,DISTANCE_Q),COUNTIF(C125:G125,DISTANCE_Q)))","v":""},null,null,null,null,null,null,{"$f":"IF(OR(COUNTIF(O125:S125,\"\")<>COUNTIF(I129:M129,\"\"),AND(T125=\"\",SUM(O125:S125)<>0)),\"!...\",IF(OR(AND(T125<>\"\",O125=\"\",O125<>I129),AND(T125<>\"\",O125<>\"\",O125=I129),AND(T125<>\"\",O125<>\"\",O125<>DISTANCE_Q,I129<>DISTANCE_Q)),\"ERR!\",\"\"))","v":""},{"$f":"IF(O126=\"!...\",O126,IF(OR(AND(T125<>\"\",P125=\"\",P125<>J129),AND(T125<>\"\",P125<>\"\",P125=J129),AND(T125<>\"\",P125<>\"\",P125<>DISTANCE_Q,J129<>DISTANCE_Q)),\"ERR!\",\"\"))","v":""},{"$f":"IF(P126=\"!...\",P126,IF(OR(AND(T125<>\"\",Q125=\"\",Q125<>K129),AND(T125<>\"\",Q125<>\"\",Q125=K129),AND(T125<>\"\",Q125<>\"\",Q125<>DISTANCE_Q,K129<>DISTANCE_Q)),\"ERR!\",\"\"))","v":""},{"$f":"IF(Q126=\"!...\",Q126,IF(OR(AND(T125<>\"\",R125=\"\",R125<>L129),AND(T125<>\"\",R125<>\"\",R125=L129),AND(T125<>\"\",R125<>\"\",R125<>DISTANCE_Q,L129<>DISTANCE_Q)),\"ERR!\",\"\"))","v":""},{"$f":"IF(R126=\"!...\",R126,IF(OR(AND(T125<>\"\",S125=\"\",S125<>M129),AND(T125<>\"\",S125<>\"\",S125=M129),AND(T125<>\"\",S125<>\"\",S125<>DISTANCE_Q,M129<>DISTANCE_Q)),\"ERR!\",\"\"))","v":""},{"$f":"IF(T125=\"\",\"\",IF(T125=\"G\",(NB_SETS_G_Q*2)-1-COUNTIF(I129:M129,DISTANCE_Q),COUNTIF(O125:S125,DISTANCE_Q)))","v":""},{"$f":"IF(OR(COUNTIF(U125:Y125,\"\")<>COUNTIF(I133:M133,\"\"),AND(Z125=\"\",SUM(U125:Y125)<>0)),\"!...\",IF(OR(AND(Z125<>\"\",U125=\"\",U125<>I133),AND(Z125<>\"\",U125<>\"\",U125=I133),AND(Z125<>\"\",U125<>\"\",U125<>DISTANCE_Q,I133<>DISTANCE_Q)),\"ERR!\",\"\"))","v":""},{"$f":"IF(U126=\"!...\",U126,IF(OR(AND(Z125<>\"\",V125=\"\",V125<>J133),AND(Z125<>\"\",V125<>\"\",V125=J133),AND(Z125<>\"\",V125<>\"\",V125<>DISTANCE_Q,J133<>DISTANCE_Q)),\"ERR!\",\"\"))","v":""},{"$f":"IF(V126=\"!...\",V126,IF(OR(AND(Z125<>\"\",W125=\"\",W125<>K133),AND(Z125<>\"\",W125<>\"\",W125=K133),AND(Z125<>\"\",W125<>\"\",W125<>DISTANCE_Q,K133<>DISTANCE_Q)),\"ERR!\",\"\"))","v":""},{"$f":"IF(W126=\"!...\",W126,IF(OR(AND(Z125<>\"\",X125=\"\",X125<>L133),AND(Z125<>\"\",X125<>\"\",X125=L133),AND(Z125<>\"\",X125<>\"\",X125<>DISTANCE_Q,L133<>DISTANCE_Q)),\"ERR!\",\"\"))","v":""},{"$f":"IF(X126=\"!...\",X126,IF(OR(AND(Z125<>\"\",Y125=\"\",Y125<>M133),AND(Z125<>\"\",Y125<>\"\",Y125=M133),AND(Z125<>\"\",Y125<>\"\",Y125<>DISTANCE_Q,M133<>DISTANCE_Q)),\"ERR!\",\"\"))","v":""},{"$f":"IF(Z125=\"\",\"\",IF(Z125=\"G\",(NB_SETS_G_Q*2)-1-COUNTIF(I133:M133,DISTANCE_Q),COUNTIF(U125:Y125,DISTANCE_Q)))","v":""}]
[null,"Licence",null,null,null,null,null,{"$f":"IF(H125=\"\",\"\",IF(SUM(I121:M121)<>0,ROUNDDOWN(SUM(C125:G125)/SUM(I121:M121),3),\"\"))","v":""},null,null,null,null,null,null,null,null,null,null,null,{"$f":"IF(T125=\"\",\"\",IF(SUM(I129:M129)<>0,ROUNDDOWN(SUM(O125:S125)/SUM(I129:M129),3),\"\"))","v":""},null,null,null,null,null,{"$f":"IF(Z125=\"\",\"\",IF(SUM(I133:M133)<>0,ROUNDDOWN(SUM(U125:Y125)/SUM(I133:M133),3),\"\"))","v":""}]
[null,"Joueur 3","set 1","set 2","set 3","set 4","set 5","J1-J3","set 1","set 2","set 3","set 4","set 5","J2-J3",null,null,null,null,null,null,"set 1","set 2","set 3","set 4","set 5","J3-J4",null,null,null,null,null,null,null,null,null,null,null,null,null,null,null,null,null,null,null,null,null,null,null,null,null,{"$f":"IF(BH128<>\"\",RANK(BH128,BH120:BH135),\"\")","v":""},{"$f":"IF(TYPE_QUALIF=\"Poules 5J\",(COUNTIF(H129:Z129,\"G\")*VAL_PT_MATCH)+VAL_PT_MATCH,COUNTIF(H129:Z129,\"G\")*VAL_PT_MATCH)","v":0},{"$f":"IF(TYPE_QUALIF=\"Poules 5J\",(NB_SETS_G_Q*2-1)+SUM(Z130,H130,N130),SUM(Z130,H130,N130))","v":0},{"$f":"IF(BF128<>0,ROUNDDOWN(BE128/BF128,3),\"\")","v":""},{"$f":"MAX(N131,H131,Z131)","v":0},{"$f":"SUM(I129:M129,C129:G129,U129:Y129)","v":0},{"$f":"SUM(O133:S133,O125:S125,O121:S121)","v":0},null,{"$f":"IF(BC128<>\"\",(BA128*10000000)+(BB128*100000)+(BC128*10000)+BD128,\"\")","v":""}]
[null,"Nom & Prénom",null,null,null,null,null,{"$f":"IF(COUNTIF(C129:G129,DISTANCE_Q)=NB_SETS_G_Q,\"G\",IF(COUNTIF(O121:S121,DISTANCE_Q)=NB_SETS_G_Q,\"P\",\"\"))","v":""},null,null,null,null,null,{"$f":"IF(COUNTIF(I129:M129,DISTANCE_Q)=NB_SETS_G_Q,\"G\",IF(COUNTIF(O125:S125,DISTANCE_Q)=NB_SETS_G_Q,\"P\",\"\"))","v":""},null,null,null,null,null,null,null,null,null,null,null,{"$f":"IF(COUNTIF(U129:Y129,DISTANCE_Q)=NB_SETS_G_Q,\"G\",IF(COUNTIF(O133:S133,DISTANCE_Q)=NB_SETS_G_Q,\"P\",\"\"))","v":""}]
[null,"Ville ou Club",{"$f":"IF(OR(COUNTIF(C129:G129,\"\")<>COUNTIF(O121:S121,\"\"),AND(H129=\"\",SUM(C129:G129)<>0)),\"!...\",IF(OR(AND(H129<>\"\",C129=\"\",C129<>O121),AND(H129<>\"\",C129<>\"\",C129=O121),AND(H129<>\"\",C129<>\"\",C129<>DISTANCE_Q,O121<>DISTANCE_Q)),\"ERR!\",\"\"))","v":""},{"$f":"IF(C130=\"!...\",C130,IF(OR(AND(H129<>\"\",D129=\"\",D129<>P121),AND(H129<>\"\",D129<>\"\",D129=P121),AND(H129<>\"\",D129<>\"\",D129<>DISTANCE_Q,P121<>DISTANCE_Q)),\"ERR!\",\"\"))","v":""},{"$f":"IF(D130=\"!...\",D130,IF(OR(AND(H129<>\"\",E129=\"\",E129<>Q121),AND(H129<>\"\",E129<>\"\",E129=Q121),AND(H129<>\"\",E129<>\"\",E129<>DISTANCE_Q,Q121<>DISTANCE_Q)),\"ERR!\",\"\"))","v":""},{"$f":"IF(E130=\"!...\",E130,IF(OR(AND(H129<>\"\",F129=\"\",F129<>R121),AND(H129<>\"\",F129<>\"\",F129=R121),AND(H129<>\"\",F129<>\"\",F129<>DISTANCE_Q,R121<>DISTANCE_Q)),\"ERR!\",\"\"))","v":""},{"$f":"IF(F130=\"!...\",F130,IF(OR(AND(H129<>\"\",G129=\"\",G129<>S121),AND(H129<>\"\",G129<>\"\",G129=S121),AND(H129<>\"\",G129<>\"\",G129<>DISTANCE_Q,S121<>DISTANCE_Q)),\"ERR!\",\"\"))","v":""},{"$f":"IF(H129=\"\",\"\",IF(H129=\"G\",(NB_SETS_G_Q*2)-1-COUNTIF(O121:S121,DISTANCE_Q),COUNTIF(C129:G129,DISTANCE_Q)))","v":""},{"$f":"IF(OR(COUNTIF(I129:M129,\"\")<>COUNTIF(O125:S125,\"\"),AND(N129=\"\",SUM(I129:M129)<>0)),\"!...\",IF(OR(AND(N129<>\"\",I129=\"\",I129<>O125),AND(N129<>\"\",I129<>\"\",I129=O125),AND(N129<>\"\",I129<>\"\",I129<>DISTANCE_Q,O125<>DISTANCE_Q)),\"ERR!\",\"\"))","v":""},{"$f":"IF(I130=\"!...\",I130,IF(OR(AND(N129<>\"\",J129=\"\",J129<>P125),AND(N129<>\"\",J129<>\"\",J129=P125),AND(N129<>\"\",J129<>\"\",J129<>DISTANCE_Q,P125<>DISTANCE_Q)),\"ERR!\",\"\"))","v":""},{"$f":"IF(J130=\"!...\",J130,IF(OR(AND(N129<>\"\",K129=\"\",K129<>Q125),AND(N129<>\"\",K129<>\"\",K129=Q125),AND(N129<>\"\",K129<>\"\",K129<>DISTANCE_Q,Q125<>DISTANCE_Q)),\"ERR!\",\"\"))","v":""},{"$f":"IF(K130=\"!...\",K130,IF(OR(AND(N129<>\"\",L129=\"\",L129<>R125),AND(N129<>\"\",L129<>\"\",L129=R125),AND(N129<>\"\",L129<>\"\",L129<>DISTANCE_Q,R125<>DISTANCE_Q)),\"ERR!\",\"\"))","v":""},{"$f":"IF(L130=\"!...\",L130,IF(OR(AND(N129<>\"\",M129=\"\",M129<>S125),AND(N129<>\"\",M129<>\"\",M129=S125),AND(N129<>\"\",M129<>\"\",M129<>DISTANCE_Q,S125<>DISTANCE_Q)),\"ERR!\",\"\"))","v":""},{"$f":"IF(N129=\"\",\"\",IF(N129=\"G\",(NB_SETS_G_Q*2)-1-COUNTIF(O125:S125,DISTANCE_Q),COUNTIF(I129:M129,DISTANCE_Q)))","v":""},null,null,null,null,null,null,{"$f":"IF(OR(COUNTIF(U129:Y129,\"\")<>COUNTIF(O133:S133,\"\"),AND(Z129=\"\",SUM(U129:Y129)<>0)),\"!...\",IF(OR(AND(Z129<>\"\",U129=\"\",U129<>O133),AND(Z129<>\"\",U129<>\"\",U129=O133),AND(Z129<>\"\",U129<>\"\",U129<>DISTANCE_Q,O133<>DISTANCE_Q)),\"ERR!\",\"\"))","v":""},{"$f":"IF(U130=\"!...\",U130,IF(OR(AND(Z129<>\"\",V129=\"\",V129<>P133),AND(Z129<>\"\",V129<>\"\",V129=P133),AND(Z129<>\"\",V129<>\"\",V129<>DISTANCE_Q,P133<>DISTANCE_Q)),\"ERR!\",\"\"))","v":""},{"$f":"IF(V130=\"!...\",V130,IF(OR(AND(Z129<>\"\",W129=\"\",W129<>Q133),AND(Z129<>\"\",W129<>\"\",W129=Q133),AND(Z129<>\"\",W129<>\"\",W129<>DISTANCE_Q,Q133<>DISTANCE_Q)),\"ERR!\",\"\"))","v":""},{"$f":"IF(W130=\"!...\",W130,IF(OR(AND(Z129<>\"\",X129=\"\",X129<>R133),AND(Z129<>\"\",X129<>\"\",X129=R133),AND(Z129<>\"\",X129<>\"\",X129<>DISTANCE_Q,R133<>DISTANCE_Q)),\"ERR!\",\"\"))","v":""},{"$f":"IF(X130=\"!...\",X130,IF(OR(AND(Z129<>\"\",Y129=\"\",Y129<>S133),AND(Z129<>\"\",Y129<>\"\",Y129=S133),AND(Z129<>\"\",Y129<>\"\",Y129<>DISTANCE_Q,S133<>DISTANCE_Q)),\"ERR!\",\"\"))","v":""},{"$f":"IF(Z129=\"\",\"\",IF(Z129=\"G\",(NB_SETS_G_Q*2)-1-COUNTIF(O133:S133,DISTANCE_Q),COUNTIF(U129:Y129,DISTANCE_Q)))","v":""}]
[null,"Licence",null,null,null,null,null,{"$f":"IF(H129=\"\",\"\",IF(SUM(O121:S121)<>0,ROUNDDOWN(SUM(C129:G129)/SUM(O121:S121),3),\"\"))","v":""},null,null,null,null,null,{"$f":"IF(N129=\"\",\"\",IF(SUM(O125:S125)<>0,ROUNDDOWN(SUM(I129:M129)/SUM(O125:S125),3),\"\"))","v":""},null,null,null,null,null,null,null,null,null,null,null,{"$f":"IF(Z129=\"\",\"\",IF(SUM(O133:S133)<>0,ROUNDDOWN(SUM(U129:Y129)/SUM(O133:S133),3),\"\"))","v":""}]
[null,"Joueur 4","set 1","set 2","set 3","set 4","set 5","J1-J4","set 1","set 2","set 3","set 4","set 5","J2-J4","set 1","set 2","set 3","set 4","set 5","J3-J4",null,null,null,null,null,null,null,null,null,null,null,null,null,null,null,null,null,null,null,null,null,null,null,null,null,null,null,null,null,null,null,{"$f":"IF(BH132<>\"\",RANK(BH132,BH120:BH135),\"\")","v":""},{"$f":"IF(TYPE_QUALIF=\"Poules 5J\",(COUNTIF(H133:Z133,\"G\")*VAL_PT_MATCH)+VAL_PT_MATCH,COUNTIF(H133:Z133,\"G\")*VAL_PT_MATCH)","v":0},{"$f":"IF(TYPE_QUALIF=\"Poules 5J\",(NB_SETS_G_Q*2-1)+SUM(H134,T134,N134),SUM(H134,T134,N134))","v":0},{"$f":"IF(BF132<>0,ROUNDDOWN(BE132/BF132,3),\"\")","v":""},{"$f":"MAX(N135,T135,H135)","v":0},{"$f":"SUM(I133:M133,O133:S133,C133:G133)","v":0},{"$f":"SUM(U129:Y129,U125:Y125,U121:Y121)","v":0},null,{"$f":"IF(BC132<>\"\",(BA132*10000000)+(BB132*100000)+(BC132*10000)+BD132,\"\")","v":""}]
[null,"Nom & Prénom",null,null,null,null,null,{"$f":"IF(COUNTIF(C133:G133,DISTANCE_Q)=NB_SETS_G_Q,\"G\",IF(COUNTIF(U121:Y121,DISTANCE_Q)=NB_SETS_G_Q,\"P\",\"\"))","v":""},null,null,null,null,null,{"$f":"IF(COUNTIF(I133:M133,DISTANCE_Q)=NB_SETS_G_Q,\"G\",IF(COUNTIF(U125:Y125,DISTANCE_Q)=NB_SETS_G_Q,\"P\",\"\"))","v":""},null,null,null,null,null,{"$f":"IF(COUNTIF(O133:S133,DISTANCE_Q)=NB_SETS_G_Q,\"G\",IF(COUNTIF(U129:Y129,DISTANCE_Q)=NB_SETS_G_Q,\"P\",\"\"))","v":""}]
[null,"Ville ou Club",{"$f":"IF(OR(COUNTIF(C133:G133,\"\")<>COUNTIF(U121:Y121,\"\"),AND(H133=\"\",SUM(C133:G133)<>0)),\"!...\",IF(OR(AND(H133<>\"\",C133=\"\",C133<>U121),AND(H133<>\"\",C133<>\"\",C133=U121),AND(H133<>\"\",C133<>\"\",C133<>DISTANCE_Q,U121<>DISTANCE_Q)),\"ERR!\",\"\"))","v":""},{"$f":"IF(C134=\"!...\",C134,IF(OR(AND(H133<>\"\",D133=\"\",D133<>V121),AND(H133<>\"\",D133<>\"\",D133=V121),AND(H133<>\"\",D133<>\"\",D133<>DISTANCE_Q,V121<>DISTANCE_Q)),\"ERR!\",\"\"))","v":""},{"$f":"IF(D134=\"!...\",D134,IF(OR(AND(H133<>\"\",E133=\"\",E133<>W121),AND(H133<>\"\",E133<>\"\",E133=W121),AND(H133<>\"\",E133<>\"\",E133<>DISTANCE_Q,W121<>DISTANCE_Q)),\"ERR!\",\"\"))","v":""},{"$f":"IF(E134=\"!...\",E134,IF(OR(AND(H133<>\"\",F133=\"\",F133<>X121),AND(H133<>\"\",F133<>\"\",F133=X121),AND(H133<>\"\",F133<>\"\",F133<>DISTANCE_Q,X121<>DISTANCE_Q)),\"ERR!\",\"\"))","v":""},{"$f":"IF(F134=\"!...\",F134,IF(OR(AND(H133<>\"\",G133=\"\",G133<>Y121),AND(H133<>\"\",G133<>\"\",G133=Y121),AND(H133<>\"\",G133<>\"\",G133<>DISTANCE_Q,Y121<>DISTANCE_Q)),\"ERR!\",\"\"))","v":""},{"$f":"IF(H133=\"\",\"\",IF(H133=\"G\",(NB_SETS_G_Q*2)-1-COUNTIF(U121:Y121,DISTANCE_Q),COUNTIF(C133:G133,DISTANCE_Q)))","v":""},{"$f":"IF(OR(COUNTIF(I133:M133,\"\")<>COUNTIF(U125:Y125,\"\"),AND(N133=\"\",SUM(I133:M133)<>0)),\"!...\",IF(OR(AND(N133<>\"\",I133=\"\",I133<>U125),AND(N133<>\"\",I133<>\"\",I133=U125),AND(N133<>\"\",I133<>\"\",I133<>DISTANCE_Q,U125<>DISTANCE_Q)),\"ERR!\",\"\"))","v":""},{"$f":"IF(I134=\"!...\",I134,IF(OR(AND(N133<>\"\",J133=\"\",J133<>V125),AND(N133<>\"\",J133<>\"\",J133=V125),AND(N133<>\"\",J133<>\"\",J133<>DISTANCE_Q,V125<>DISTANCE_Q)),\"ERR!\",\"\"))","v":""},{"$f":"IF(J134=\"!...\",J134,IF(OR(AND(N133<>\"\",K133=\"\",K133<>W125),AND(N133<>\"\",K133<>\"\",K133=W125),AND(N133<>\"\",K133<>\"\",K133<>DISTANCE_Q,W125<>DISTANCE_Q)),\"ERR!\",\"\"))","v":""},{"$f":"IF(K134=\"!...\",K134,IF(OR(AND(N133<>\"\",L133=\"\",L133<>X125),AND(N133<>\"\",L133<>\"\",L133=X125),AND(N133<>\"\",L133<>\"\",L133<>DISTANCE_Q,X125<>DISTANCE_Q)),\"ERR!\",\"\"))","v":""},{"$f":"IF(L134=\"!...\",L134,IF(OR(AND(N133<>\"\",M133=\"\",M133<>Y125),AND(N133<>\"\",M133<>\"\",M133=Y125),AND(N133<>\"\",M133<>\"\",M133<>DISTANCE_Q,Y125<>DISTANCE_Q)),\"ERR!\",\"\"))","v":""},{"$f":"IF(N133=\"\",\"\",IF(N133=\"G\",(NB_SETS_G_Q*2)-1-COUNTIF(U125:Y125,DISTANCE_Q),COUNTIF(I133:M133,DISTANCE_Q)))","v":""},{"$f":"IF(OR(COUNTIF(O133:S133,\"\")<>COUNTIF(U129:Y129,\"\"),AND(T133=\"\",SUM(O133:S133)<>0)),\"!...\",IF(OR(AND(T133<>\"\",O133=\"\",O133<>U129),AND(T133<>\"\",O133<>\"\",O133=U129),AND(T133<>\"\",O133<>\"\",O133<>DISTANCE_Q,U129<>DISTANCE_Q)),\"ERR!\",\"\"))","v":""},{"$f":"IF(O134=\"!...\",O134,IF(OR(AND(T133<>\"\",P133=\"\",P133<>V129),AND(T133<>\"\",P133<>\"\",P133=V129),AND(T133<>\"\",P133<>\"\",P133<>DISTANCE_Q,V129<>DISTANCE_Q)),\"ERR!\",\"\"))","v":""},{"$f":"IF(P134=\"!...\",P134,IF(OR(AND(T133<>\"\",Q133=\"\",Q133<>W129),AND(T133<>\"\",Q133<>\"\",Q133=W129),AND(T133<>\"\",Q133<>\"\",Q133<>DISTANCE_Q,W129<>DISTANCE_Q)),\"ERR!\",\"\"))","v":""},{"$f":"IF(Q134=\"!...\",Q134,IF(OR(AND(T133<>\"\",R133=\"\",R133<>X129),AND(T133<>\"\",R133<>\"\",R133=X129),AND(T133<>\"\",R133<>\"\",R133<>DISTANCE_Q,X129<>DISTANCE_Q)),\"ERR!\",\"\"))","v":""},{"$f":"IF(R134=\"!...\",R134,IF(OR(AND(T133<>\"\",S133=\"\",S133<>Y129),AND(T133<>\"\",S133<>\"\",S133=Y129),AND(T133<>\"\",S133<>\"\",S133<>DISTANCE_Q,Y129<>DISTANCE_Q)),\"ERR!\",\"\"))","v":""},{"$f":"IF(T133=\"\",\"\",IF(T133=\"G\",(NB_SETS_G_Q*2)-1-COUNTIF(U129:Y129,DISTANCE_Q),COUNTIF(O133:S133,DISTANCE_Q)))","v":""}]
[null,"Licence",null,null,null,null,null,{"$f":"IF(H133=\"\",\"\",IF(SUM(U121:Y121)<>0,ROUNDDOWN(SUM(C133:G133)/SUM(U121:Y121),3),\"\"))","v":""},null,null,null,null,null,{"$f":"IF(N133=\"\",\"\",IF(SUM(U125:Y125)<>0,ROUNDDOWN(SUM(I133:M133)/SUM(U125:Y125),3),\"\"))","v":""},null,null,null,null,null,{"$f":"IF(T133=\"\",\"\",IF(SUM(U129:Y129)<>0,ROUNDDOWN(SUM(O133:S133)/SUM(U129:Y129),3),\"\"))","v":""}]
[]
[]
[null,"Poule",{"$f":"\"J\" & RIGHT(B139,1) & \" \" &B140","v":"J1 Nom & Prénom"},null,null,null,null,null,{"$f":"\"J\" & RIGHT(B143,1) & \" \" &B144","v":"J2 Nom & Prénom"},null,null,null,null,null,{"$f":"\"J\" & RIGHT(B147,1) & \" \" &B148","v":"J3 Nom & Prénom"},null,null,null,null,null,null,null,null,null,null,null,null,null,null,null,null,null,null,null,null,null,null,null,null,null,null,null,null,null,null,null,null,null,null,null,null,"Clst","Pts Match","Pts Sets","Moy. Gen.","Moy. Part.","Pts marq.","Pts subis",null,"Calcul 1er"]
[null,"Joueur 1","Sets",null,null,null,null,"Match","set 1","set 2","set 3","set 4","set 5","J1-J2","set 1","set 2","set 3","set 4","set 5","J1-J3",null,null,null,null,null,null,null,null,null,null,null,null,null,null,null,null,null,null,null,null,null,null,null,null,null,null,null,null,null,null,null,{"$f":"IF(BH139<>\"\",RANK(BH139,BH139:BH150),\"\")","v":""},{"$f":"IF(TYPE_QUALIF =\"Poules 4J G\",(COUNTIF(N140:T140,\"G\")*VAL_PT_MATCH)+VAL_PT_MATCH,COUNTIF(N140:T140,\"G\")*VAL_PT_MATCH)","v":0},{"$f":"IF(TYPE_QUALIF=\"Poules 4J G\",(NB_SETS_G_Q*2-1)+SUM(T141,N141),SUM(T141,N141))","v":0},{"$f":"IF(BF139<>0,ROUNDDOWN(BE139/BF139,3),\"\")","v":""},{"$f":"MAX(N142,T142)","v":0},{"$f":"SUM(I140:M140,O140:S140)","v":0},{"$f":"SUM(C144:G144,C148:G148)","v":0},null,{"$f":"IF(BC139<>\"\",(BA139*10000000)+(BB139*100000)+(BC139*10000)+BD139,\"\")","v":""}]
[null,"Nom & Prénom","Pts",null,null,null,null,"G/P",null,null,null,null,null,{"$f":"IF(COUNTIF(I140:M140,DISTANCE_Q)=NB_SETS_G_Q,\"G\",IF(COUNTIF(C144:G144,DISTANCE_Q)=NB_SETS_G_Q,\"P\",\"\"))","v":""},null,null,null,null,null,{"$f":"IF(COUNTIF(O140:S140,DISTANCE_Q)=NB_SETS_G_Q,\"G\",IF(COUNTIF(C148:G148,DISTANCE_Q)=NB_SETS_G_Q,\"P\",\"\"))","v":""}]
[null,"Ville ou Club",null,null,null,null,null,"Pts de Sets",{"$f":"IF(OR(COUNTIF(I140:M140,\"\")<>COUNTIF(C144:G144,\"\"),AND(N140=\"\",SUM(I140:M140)<>0)),\"!...\",IF(OR(AND(N140<>\"\",I140=\"\",I140<>C144),AND(N140<>\"\",I140<>\"\",I140=C144),AND(N140<>\"\",I140<>\"\",I140<>DISTANCE_Q,C144<>DISTANCE_Q)),\"ERR!\",\"\"))","v":""},{"$f":"IF(I141=\"!...\",I141,IF(OR(AND(N140<>\"\",J140=\"\",J140<>D144),AND(N140<>\"\",J140<>\"\",J140=D144),AND(N140<>\"\",J140<>\"\",J140<>DISTANCE_Q,D144<>DISTANCE_Q)),\"ERR!\",\"\"))","v":""},{"$f":"IF(J141=\"!...\",J141,IF(OR(AND(N140<>\"\",K140=\"\",K140<>E144),AND(N140<>\"\",K140<>\"\",K140=E144),AND(N140<>\"\",K140<>\"\",K140<>DISTANCE_Q,E144<>DISTANCE_Q)),\"ERR!\",\"\"))","v":""},{"$f":"IF(K141=\"!...\",K141,IF(OR(AND(N140<>\"\",L140=\"\",L140<>F144),AND(N140<>\"\",L140<>\"\",L140=F144),AND(N140<>\"\",L140<>\"\",L140<>DISTANCE_Q,F144<>DISTANCE_Q)),\"ERR!\",\"\"))","v":""},{"$f":"IF(L141=\"!...\",L141,IF(OR(AND(N140<>\"\",M140=\"\",M140<>G144),AND(N140<>\"\",M140<>\"\",M140=G144),AND(N140<>\"\",M140<>\"\",M140<>DISTANCE_Q,G144<>DISTANCE_Q)),\"ERR!\",\"\"))","v":""},{"$f":"IF(N140=\"\",\"\",IF(N140=\"G\",(NB_SETS_G_Q*2)-1-COUNTIF(C144:G144,DISTANCE_Q),COUNTIF(I140:M140,DISTANCE_Q)))","v":""},{"$f":"IF(OR(COUNTIF(O140:S140,\"\")<>COUNTIF(C148:G148,\"\"),AND(T140=\"\",SUM(O140:S140)<>0)),\"!...\",IF(OR(AND(T140<>\"\",O140=\"\",O140<>C148),AND(T140<>\"\",O140<>\"\",O140=C148),AND(T140<>\"\",O140<>\"\",O140<>DISTANCE_Q,C148<>DISTANCE_Q)),\"ERR!\",\"\"))","v":""},{"$f":"IF(O141=\"!...\",O141,IF(OR(AND(T140<>\"\",P140=\"\",P140<>D148),AND(T140<>\"\",P140<>\"\",P140=D148),AND(T140<>\"\",P140<>\"\",P140<>DISTANCE_Q,D148<>DISTANCE_Q)),\"ERR!\",\"\"))","v":""},{"$f":"IF(P141=\"!...\",P141,IF(OR(AND(T140<>\"\",Q140=\"\",Q140<>E148),AND(T140<>\"\",Q140<>\"\",Q140=E148),AND(T140<>\"\",Q140<>\"\",Q140<>DISTANCE_Q,E148<>DISTANCE_Q)),\"ERR!\",\"\"))","v":""},{"$f":"IF(Q141=\"!...\",Q141,IF(OR(AND(T140<>\"\",R140=\"\",R140<>F148),AND(T140<>\"\",R140<>\"\",R140=F148),AND(T140<>\"\",R140<>\"\",R140<>DISTANCE_Q,F148<>DISTANCE_Q)),\"ERR!\",\"\"))","v":""},{"$f":"IF(R141=\"!...\",R141,IF(OR(AND(T140<>\"\",S140=\"\",S140<>G148),AND(T140<>\"\",S140<>\"\",S140=G148),AND(T140<>\"\",S140<>\"\",S140<>DISTANCE_Q,G148<>DISTANCE_Q)),\"ERR!\",\"\"))","v":""},{"$f":"IF(T140=\"\",\"\",IF(T140=\"G\",(NB_SETS_G_Q*2)-1-COUNTIF(C148:G148,DISTANCE_Q),COUNTIF(O140:S140,DISTANCE_Q)))","v":""}]
[null,"Licence",null,null,null,null,null,"Moyenne",null,null,null,null,null,{"$f":"IF(N140=\"\",\"\",IF(SUM(C144:G144)<>0,ROUNDDOWN(SUM(I140:M140)/SUM(C144:G144),3),\"\"))","v":""},null,null,null,null,null,{"$f":"IF(T140=\"\",\"\",IF(SUM(C148:G148)<>0,ROUNDDOWN(SUM(O140:S140)/SUM(C148:G148),3),\"\"))","v":""}]
[null,"Joueur 2","set 1","set 2","set 3","set 4","set 5","J1-J2",null,null,null,null,null,null,"set 1","set 2","set 3","set 4","set 5","J2-J3",null,null,null,null,null,null,null,null,null,null,null,null,null,null,null,null,null,null,null,null,null,null,null,null,null,null,null,null,null,null,null,{"$f":"IF(BH143<>\"\",RANK(BH143,BH139:BH150),\"\")","v":""},{"$f":"IF(TYPE_QUALIF =\"Poules 4J G\",(COUNTIF(H144:T144,\"G\")*VAL_PT_MATCH)+VAL_PT_MATCH,COUNTIF(H144:T144,\"G\")*VAL_PT_MATCH)","v":0},{"$f":"IF(TYPE_QUALIF=\"Poules 4J G\",(NB_SETS_G_Q*2-1)+SUM(T145,H145),SUM(T145,H145))","v":0},{"$f":"IF(BF143<>0,ROUNDDOWN(BE143/BF143,3),\"\")","v":""},{"$f":"MAX(H146,T146)","v":0},{"$f":"SUM(C144:G144,O144:S144)","v":0},{"$f":"SUM(I148:M148,I140:M140)","v":0},null,{"$f":"IF(BC143<>\"\",(BA143*10000000)+(BB143*100000)+(BC143*10000)+BD143,\"\")","v":""}]
[null,"Nom & Prénom",null,null,null,null,null,{"$f":"IF(COUNTIF(C144:G144,DISTANCE_Q)=NB_SETS_G_Q,\"G\",IF(COUNTIF(I140:M140,DISTANCE_Q)=NB_SETS_G_Q,\"P\",\"\"))","v":""},null,null,null,null,null,null,null,null,null,null,null,{"$f":"IF(COUNTIF(O144:S144,DISTANCE_Q)=NB_SETS_G_Q,\"G\",IF(COUNTIF(I148:M148,DISTANCE_Q)=NB_SETS_G_Q,\"P\",\"\"))","v":""}]
[null,"Ville ou Club",{"$f":"IF(OR(COUNTIF(C144:G144,\"\")<>COUNTIF(I140:M140,\"\"),AND(H144=\"\",SUM(C144:G144)<>0)),\"!...\",IF(OR(AND(H144<>\"\",C144=\"\",C144<>I140),AND(H144<>\"\",C144<>\"\",C144=I140),AND(H144<>\"\",C144<>\"\",C144<>DISTANCE_Q,I140<>DISTANCE_Q)),\"ERR!\",\"\"))","v":""},{"$f":"IF(C145=\"!...\",C145,IF(OR(AND(H144<>\"\",D144=\"\",D144<>J140),AND(H144<>\"\",D144<>\"\",D144=J140),AND(H144<>\"\",D144<>\"\",D144<>DISTANCE_Q,J140<>DISTANCE_Q)),\"ERR!\",\"\"))","v":""},{"$f":"IF(D145=\"!...\",D145,IF(OR(AND(H144<>\"\",E144=\"\",E144<>K140),AND(H144<>\"\",E144<>\"\",E144=K140),AND(H144<>\"\",E144<>\"\",E144<>DISTANCE_Q,K140<>DISTANCE_Q)),\"ERR!\",\"\"))","v":""},{"$f":"IF(E145=\"!...\",E145,IF(OR(AND(H144<>\"\",F144=\"\",F144<>L140),AND(H144<>\"\",F144<>\"\",F144=L140),AND(H144<>\"\",F144<>\"\",F144<>DISTANCE_Q,L140<>DISTANCE_Q)),\"ERR!\",\"\"))","v":""},{"$f":"IF(F145=\"!...\",F145,IF(OR(AND(H144<>\"\",G144=\"\",G144<>M140),AND(H144<>\"\",G144<>\"\",G144=M140),AND(H144<>\"\",G144<>\"\",G144<>DISTANCE_Q,M140<>DISTANCE_Q)),\"ERR!\",\"\"))","v":""},{"$f":"IF(H144=\"\",\"\",IF(H144=\"G\",(NB_SETS_G_Q*2)-1-COUNTIF(I140:M140,DISTANCE_Q),COUNTIF(C144:G144,DISTANCE_Q)))","v":""},null,null,null,null,null,null,{"$f":"IF(OR(COUNTIF(O144:S144,\"\")<>COUNTIF(I148:M148,\"\"),AND(T144=\"\",SUM(O144:S144)<>0)),\"!...\",IF(OR(AND(T144<>\"\",O144=\"\",O144<>I148),AND(T144<>\"\",O144<>\"\",O144=I148),AND(T144<>\"\",O144<>\"\",O144<>DISTANCE_Q,I148<>DISTANCE_Q)),\"ERR!\",\"\"))","v":""},{"$f":"IF(O145=\"!...\",O145,IF(OR(AND(T144<>\"\",P144=\"\",P144<>J148),AND(T144<>\"\",P144<>\"\",P144=J148),AND(T144<>\"\",P144<>\"\",P144<>DISTANCE_Q,J148<>DISTANCE_Q)),\"ERR!\",\"\"))","v":""},{"$f":"IF(P145=\"!...\",P145,IF(OR(AND(T144<>\"\",Q144=\"\",Q144<>K148),AND(T144<>\"\",Q144<>\"\",Q144=K148),AND(T144<>\"\",Q144<>\"\",Q144<>DISTANCE_Q,K148<>DISTANCE_Q)),\"ERR!\",\"\"))","v":""},{"$f":"IF(Q145=\"!...\",Q145,IF(OR(AND(T144<>\"\",R144=\"\",R144<>L148),AND(T144<>\"\",R144<>\"\",R144=L148),AND(T144<>\"\",R144<>\"\",R144<>DISTANCE_Q,L148<>DISTANCE_Q)),\"ERR!\",\"\"))","v":""},{"$f":"IF(R145=\"!...\",R145,IF(OR(AND(T144<>\"\",S144=\"\",S144<>M148),AND(T144<>\"\",S144<>\"\",S144=M148),AND(T144<>\"\",S144<>\"\",S144<>DISTANCE_Q,M148<>DISTANCE_Q)),\"ERR!\",\"\"))","v":""},{"$f":"IF(T144=\"\",\"\",IF(T144=\"G\",(NB_SETS_G_Q*2)-1-COUNTIF(I148:M148,DISTANCE_Q),COUNTIF(O144:S144,DISTANCE_Q)))","v":""}]
[null,"Licence",null,null,null,null,null,{"$f":"IF(H144=\"\",\"\",IF(SUM(I140:M140)<>0,ROUNDDOWN(SUM(C144:G144)/SUM(I140:M140),3),\"\"))","v":""},null,null,null,null,null,null,null,null,null,null,null,{"$f":"IF(T144=\"\",\"\",IF(SUM(I148:M148)<>0,ROUNDDOWN(SUM(O144:S144)/SUM(I148:M148),3),\"\"))","v":""}]
[null,"Joueur 3","set 1","set 2","set 3","set 4","set 5","J1-J3","set 1","set 2","set 3","set 4","set 5","J2-J3",null,null,null,null,null,null,null,null,null,null,null,null,null,null,null,null,null,null,null,null,null,null,null,null,null,null,null,null,null,null,null,null,null,null,null,null,null,{"$f":"IF(BH147<>\"\",RANK(BH147,BH139:BH150),\"\")","v":""},{"$f":"IF(TYPE_QUALIF =\"Poules 4J G\",(COUNTIF(H148:T148,\"G\")*VAL_PT_MATCH)+VAL_PT_MATCH,COUNTIF(H148:T148,\"G\")*VAL_PT_MATCH)","v":0},{"$f":"IF(TYPE_QUALIF=\"Poules 4J G\",(NB_SETS_G_Q*2-1)+SUM(H149,N149),SUM(H149,N149))","v":0},{"$f":"IF(BF147<>0,ROUNDDOWN(BE147/BF147,3),\"\")","v":""},{"$f":"MAX(N150,H150)","v":0},{"$f":"SUM(I148:M148,C148:G148)","v":0},{"$f":"SUM(O144:S144,O140:S140)","v":0},null,{"$f":"IF(BC147<>\"\",(BA147*10000000)+(BB147*100000)+(BC147*10000)+BD147,\"\")","v":""}]
[null,"Nom & Prénom",null,null,null,null,null,{"$f":"IF(COUNTIF(C148:G148,DISTANCE_Q)=NB_SETS_G_Q,\"G\",IF(COUNTIF(O140:S140,DISTANCE_Q)=NB_SETS_G_Q,\"P\",\"\"))","v":""},null,null,null,null,null,{"$f":"IF(COUNTIF(I148:M148,DISTANCE_Q)=NB_SETS_G_Q,\"G\",IF(COUNTIF(O144:S144,DISTANCE_Q)=NB_SETS_G_Q,\"P\",\"\"))","v":""}]
[null,"Ville ou Club",{"$f":"IF(OR(COUNTIF(C148:G148,\"\")<>COUNTIF(O140:S140,\"\"),AND(H148=\"\",SUM(C148:G148)<>0)),\"!...\",IF(OR(AND(H148<>\"\",C148=\"\",C148<>O140),AND(H148<>\"\",C148<>\"\",C148=O140),AND(H148<>\"\",C148<>\"\",C148<>DISTANCE_Q,O140<>DISTANCE_Q)),\"ERR!\",\"\"))","v":""},{"$f":"IF(C149=\"!...\",C149,IF(OR(AND(H148<>\"\",D148=\"\",D148<>P140),AND(H148<>\"\",D148<>\"\",D148=P140),AND(H148<>\"\",D148<>\"\",D148<>DISTANCE_Q,P140<>DISTANCE_Q)),\"ERR!\",\"\"))","v":""},{"$f":"IF(D149=\"!...\",D149,IF(OR(AND(H148<>\"\",E148=\"\",E148<>Q140),AND(H148<>\"\",E148<>\"\",E148=Q140),AND(H148<>\"\",E148<>\"\",E148<>DISTANCE_Q,Q140<>DISTANCE_Q)),\"ERR!\",\"\"))","v":""},{"$f":"IF(E149=\"!...\",E149,IF(OR(AND(H148<>\"\",F148=\"\",F148<>R140),AND(H148<>\"\",F148<>\"\",F148=R140),AND(H148<>\"\",F148<>\"\",F148<>DISTANCE_Q,R140<>DISTANCE_Q)),\"ERR!\",\"\"))","v":""},{"$f":"IF(F149=\"!...\",F149,IF(OR(AND(H148<>\"\",G148=\"\",G148<>S140),AND(H148<>\"\",G148<>\"\",G148=S140),AND(H148<>\"\",G148<>\"\",G148<>DISTANCE_Q,S140<>DISTANCE_Q)),\"ERR!\",\"\"))","v":""},{"$f":"IF(H148=\"\",\"\",IF(H148=\"G\",(NB_SETS_G_Q*2)-1-COUNTIF(O140:S140,DISTANCE_Q),COUNTIF(C148:G148,DISTANCE_Q)))","v":""},{"$f":"IF(OR(COUNTIF(I148:M148,\"\")<>COUNTIF(O144:S144,\"\"),AND(N148=\"\",SUM(I148:M148)<>0)),\"!...\",IF(OR(AND(N148<>\"\",I148=\"\",I148<>O144),AND(N148<>\"\",I148<>\"\",I148=O144),AND(N148<>\"\",I148<>\"\",I148<>DISTANCE_Q,O144<>DISTANCE_Q)),\"ERR!\",\"\"))","v":""},{"$f":"IF(I149=\"!...\",I149,IF(OR(AND(N148<>\"\",J148=\"\",J148<>P144),AND(N148<>\"\",J148<>\"\",J148=P144),AND(N148<>\"\",J148<>\"\",J148<>DISTANCE_Q,P144<>DISTANCE_Q)),\"ERR!\",\"\"))","v":""},{"$f":"IF(J149=\"!...\",J149,IF(OR(AND(N148<>\"\",K148=\"\",K148<>Q144),AND(N148<>\"\",K148<>\"\",K148=Q144),AND(N148<>\"\",K148<>\"\",K148<>DISTANCE_Q,Q144<>DISTANCE_Q)),\"ERR!\",\"\"))","v":""},{"$f":"IF(K149=\"!...\",K149,IF(OR(AND(N148<>\"\",L148=\"\",L148<>R144),AND(N148<>\"\",L148<>\"\",L148=R144),AND(N148<>\"\",L148<>\"\",L148<>DISTANCE_Q,R144<>DISTANCE_Q)),\"ERR!\",\"\"))","v":""},{"$f":"IF(L149=\"!...\",L149,IF(OR(AND(N148<>\"\",M148=\"\",M148<>S144),AND(N148<>\"\",M148<>\"\",M148=S144),AND(N148<>\"\",M148<>\"\",M148<>DISTANCE_Q,S144<>DISTANCE_Q)),\"ERR!\",\"\"))","v":""},{"$f":"IF(N148=\"\",\"\",IF(N148=\"G\",(NB_SETS_G_Q*2)-1-COUNTIF(O144:S144,DISTANCE_Q),COUNTIF(I148:M148,DISTANCE_Q)))","v":""}]
[null,"Licence",null,null,null,null,null,{"$f":"IF(H148=\"\",\"\",IF(SUM(O140:S140)<>0,ROUNDDOWN(SUM(C148:G148)/SUM(O140:S140),3),\"\"))","v":""},null,null,null,null,null,{"$f":"IF(N148=\"\",\"\",IF(SUM(O144:S144)<>0,ROUNDDOWN(SUM(I148:M148)/SUM(O144:S144),3),\"\"))","v":""}]

{"sheet":"Qualifications","index":2,"n_rows":26,"n_cols":28,"rows_kept":26,"cut":false,"hidden":false,"merged":[[4,1,5,1],[4,12,4,18],[11,1,12,1],[11,12,11,18],[18,1,19,1],[18,12,18,18]]}
[null,{"$f":" TOURNOI & \" - \" & LIEU_TOURNOI","v":"T3 Qualification CD62 R1 - WIMILLE"}]
[null,{"$f":"DATE_TOURNOI","v":"2019-01-13"},null,null,null,null,null,null,null,null,null,null,"- Qualifications -"]
[]
[]
[null,"Poule 1","Match 1",null,null,"Match 2",null,null,"Match 3",null,null,null,"Totaux",null,null,null,null,null,null,null,"Détail Pts de matchs",null,null,"Détail Pts de sets",null,"Moy. particulières"]
[null,null,"set 1","set 2","set 3","set 1","set 2","set 3","set 1","set 2","set 3",null,"Clst","Pts Match","Pts Set","Moy. Gen.","Moy. Part.","Pts marq.","Pts subis",null,"Match 1","Match 2","Bonus 1er","Match 1","Match 2","Match 1","Match 2","Calcul\n1er"]
[null,"MONTADOR Christophe\nWIMILLE",null,null,null,null,null,null,null,null,null,null,{"$f":"IF($AB7<>0,RANK($AB7,$AB7:$AB9),\"\")","v":""},{"$f":"IF(TYPE_QUALIF=\"Poules 4J C\",U7+V7+W7+VAL_PT_MATCH,U7+V7+W7)","v":0},{"$f":"IF(TYPE_QUALIF=\"Poules 4J C\",X7+Y7+(NB_SETS_G_Q*2-1),X7+Y7)","v":0},{"$f":"IF(S7<>\"\",IF(R7<>\"\",ROUNDDOWN(R7/S7,3),\"\"),\"\")","v":""},{"$f":"IF(SUM(Z7:AA7)<>0,ROUNDDOWN(MAX(Z7:AA7),3),\"\")","v":""},{"$f":"IF(SUM(F7:H7,I7:K7)<>0,SUM(F7:H7,I7:K7),\"\")","v":""},{"$f":"IF(SUM(F9:H9,I8:K8)<>0,SUM(F9:H9,I8:K8),\"\")","v":""},null,{"$f":"IF(COUNTIF(F7:H7,DISTANCE_Q)=NB_SETS_G_Q,VAL_PT_MATCH,0)","v":0},{"$f":"IF(COUNTIF(I7:K7,DISTANCE_Q)=NB_SETS_G_Q,VAL_PT_MATCH,0)","v":0},{"$f":"IF(M7=1,BONUS,0)","v":0},{"$f":"IF(U7=VAL_PT_MATCH,(NB_SETS_G_Q*2)-1-COUNTIF(F9:H9,DISTANCE_Q),COUNTIF(F7:H7,DISTANCE_Q))","v":0},{"$f":"IF(V7=VAL_PT_MATCH,(NB_SETS_G_Q*2)-1-COUNTIF(I8:K8,DISTANCE_Q),COUNTIF(I7:K7,DISTANCE_Q))","v":0},{"$f":"IF(SUM(F9:H9)<>0,SUM(F7:H7)/SUM(F9:H9),0)","v":0},{"$f":"IF(SUM(I8:K8,)<>0,SUM(I7:K7)/SUM(I8:K8),0)","v":0},{"$f":"IF(P7<>\"\",(SUM(U7:V7)*1000000000)+(SUM(X7:Y7)*100000000)+(ROUND(P7*1000,0)*10000)+ROUND(Q7*1000,0),0)","v":0}]
[null,"FLAHAUT Ghislain\nCUCQ",null,null,null,null,null,null,null,null,null,null,{"$f":"IF($AB8<>0,RANK($AB8,$AB7:$AB9),\"\")","v":""},{"$f":"IF(TYPE_QUALIF=\"Poules 4J C\",U8+V8+W8+VAL_PT_MATCH,U8+V8+W8)","v":0},{"$f":"IF(TYPE_QUALIF=\"Poules 4J C\",X8+Y8+(NB_SETS_G_Q*2-1),X8+Y8)","v":0},{"$f":"IF(S8<>\"\",IF(R8<>\"\",ROUNDDOWN(R8/S8,3),\"\"),\"\")","v":""},{"$f":"IF(SUM(Z8:AA8)<>0,ROUNDDOWN(MAX(Z8:AA8),3),\"\")","v":""},{"$f":"IF(SUM(C8:E8,I8:K8)<>0,SUM(C8:E8,I8:K8),\"\")","v":""},{"$f":"IF(SUM(C9:E9,I7:K7)<>0,SUM(C9:E9,I7:K7),\"\")","v":""},null,{"$f":"IF(COUNTIF(C8:E8,DISTANCE_Q)=NB_SETS_G_Q,VAL_PT_MATCH,0)","v":0},{"$f":"IF(COUNTIF(I8:K8,DISTANCE_Q)=NB_SETS_G_Q,VAL_PT_MATCH,0)","v":0},{"$f":"IF(M8=1,BONUS,0)","v":0},{"$f":"IF(U8=VAL_PT_MATCH,(NB_SETS_G_Q*2)-1-COUNTIF(C9:E9,DISTANCE_Q),COUNTIF(C8:E8,DISTANCE_Q))","v":0},{"$f":"IF(V8=VAL_PT_MATCH,(NB_SETS_G_Q*2)-1-COUNTIF(I7:K7,DISTANCE_Q),COUNTIF(I8:K8,DISTANCE_Q))","v":0},{"$f":"IF(SUM(C9:E9,)<>0,SUM(C8:E8)/SUM(C9:E9),0)","v":0},{"$f":"IF(SUM(I7:K7,)<>0,SUM(I8:K8)/SUM(I7:K7),0)","v":0},{"$f":"IF(P8<>\"\",(SUM(U8:V8)*1000000000)+(SUM(X8:Y8)*100000000)+(ROUND(P8*1000,0)*10000)+ROUND(Q8*1000,0),0)","v":0}]
[null,"RAMET Jacques\nCUCQ",null,null,null,null,null,null,null,null,null,null,{"$f":"IF($AB9<>0,RANK($AB9,$AB7:$AB9),\"\")","v":""},{"$f":"IF(TYPE_QUALIF=\"Poules 4J C\",U9+V9+W9+VAL_PT_MATCH,U9+V9+W9)","v":0},{"$f":"IF(TYPE_QUALIF=\"Poules 4J C\",X9+Y9+(NB_SETS_G_Q*2-1),X9+Y9)","v":0},{"$f":"IF(S9<>\"\",IF(R9<>\"\",ROUNDDOWN(R9/S9,3),\"\"),\"\")","v":""},{"$f":"IF(SUM(Z9:AA9)<>0,ROUNDDOWN(MAX(Z9:AA9),3),\"\")","v":""},{"$f":"IF(SUM(C9:E9,F9:H9)<>0,SUM(C9:E9,F9:H9),\"\")","v":""},{"$f":"IF(SUM(C8:E8,F7:H7)<>0,SUM(C8:E8,F7:H7),\"\")","v":""},null,{"$f":"IF(COUNTIF(C9:E9,DISTANCE_Q)=NB_SETS_G_Q,VAL_PT_MATCH,0)","v":0},{"$f":"IF(COUNTIF(F9:H9,DISTANCE_Q)=NB_SETS_G_Q,VAL_PT_MATCH,0)","v":0},{"$f":"IF(M9=1,BONUS,0)","v":0},{"$f":"IF(U9=VAL_PT_MATCH,(NB_SETS_G_Q*2)-1-COUNTIF(C8:E8,DISTANCE_Q),COUNTIF(C9:E9,DISTANCE_Q))","v":0},{"$f":"IF(V9=VAL_PT_MATCH,(NB_SETS_G_Q*2)-1-COUNTIF(F7:H7,DISTANCE_Q),COUNTIF(F9:H9,DISTANCE_Q))","v":0},{"$f":"IF(SUM(C8:E8,)<>0,SUM(C9:E9)/SUM(C8:E8),0)","v":0},{"$f":"IF(SUM(F7:H7)<>0,SUM(F9:H9)/SUM(F7:H7),0)","v":0},{"$f":"IF(P9<>\"\",(SUM(U9:V9)*1000000000)+(SUM(X9:Y9)*100000000)+(ROUND(P9*1000,0)*10000)+ROUND(Q9*1000,0),0)","v":0}]
[]
[]
[null,"Poule 2","Match 1",null,null,"Match 2",null,null,"Match 3",null,null,null,"Totaux",null,null,null,null,null,null,null,"Détail Pts de matchs",null,null,"Détail Pts de sets",null,"Moy. particulières"]
[null,null,"set 1","set 2","set 3","set 1","set 2","set 3","set 1","set 2","set 3",null,"Clst","Pts Match","Pts Set","Moy. Gen.","Moy. Part.","Pts marq.","Pts subis",null,"Match 1","Match 2","Bonus 1er","Match 1","Match 2","Match 1","Match 2","Calcul\n1er"]
[null,"MONTADOR Ludovic\nWIMILLE",null,null,null,null,null,null,null,null,null,null,{"$f":"IF($AB14<>0,RANK($AB14,$AB14:$AB16),\"\")","v":""},{"$f":"IF(TYPE_QUALIF=\"Poules 4J C\",U14+V14+W14+VAL_PT_MATCH,U14+V14+W14)","v":0},{"$f":"IF(TYPE_QUALIF=\"Poules 4J C\",X14+Y14+(NB_SETS_G_Q*2-1),X14+Y14)","v":0},{"$f":"IF(S14<>\"\",IF(R14<>\"\",ROUNDDOWN(R14/S14,3),\"\"),\"\")","v":""},{"$f":"IF(SUM(Z14:AA14)<>0,ROUNDDOWN(MAX(Z14:AA14),3),\"\")","v":""},{"$f":"IF(SUM(F14:H14,I14:K14)<>0,SUM(F14:H14,I14:K14),\"\")","v":""},{"$f":"IF(SUM(F16:H16,I15:K15)<>0,SUM(F16:H16,I15:K15),\"\")","v":""},null,{"$f":"IF(COUNTIF(F14:H14,DISTANCE_Q)=NB_SETS_G_Q,VAL_PT_MATCH,0)","v":0},{"$f":"IF(COUNTIF(I14:K14,DISTANCE_Q)=NB_SETS_G_Q,VAL_PT_MATCH,0)","v":0},{"$f":"IF(M14=1,BONUS,0)","v":0},{"$f":"IF(U14=VAL_PT_MATCH,(NB_SETS_G_Q*2)-1-COUNTIF(F16:H16,DISTANCE_Q),COUNTIF(F14:H14,DISTANCE_Q))","v":0},{"$f":"IF(V14=VAL_PT_MATCH,(NB_SETS_G_Q*2)-1-COUNTIF(I15:K15,DISTANCE_Q),COUNTIF(I14:K14,DISTANCE_Q))","v":0},{"$f":"IF(SUM(F16:H16)<>0,SUM(F14:H14)/SUM(F16:H16),0)","v":0},{"$f":"IF(SUM(I15:K15,)<>0,SUM(I14:K14)/SUM(I15:K15),0)","v":0},{"$f":"IF(P14<>\"\",(SUM(U14:V14)*1000000000)+(SUM(X14:Y14)*100000000)+(ROUND(P14*1000,0)*10000)+ROUND(Q14*1000,0),0)","v":0}]
[null,"DEPLECHIN Roland\nCUCQ",null,null,null,null,null,null,null,null,null,null,{"$f":"IF($AB15<>0,RANK($AB15,$AB14:$AB16),\"\")","v":""},{"$f":"IF(TYPE_QUALIF=\"Poules 4J C\",U15+V15+W15+VAL_PT_MATCH,U15+V15+W15)","v":0},{"$f":"IF(TYPE_QUALIF=\"Poules 4J C\",X15+Y15+(NB_SETS_G_Q*2-1),X15+Y15)","v":0},{"$f":"IF(S15<>\"\",IF(R15<>\"\",ROUNDDOWN(R15/S15,3),\"\"),\"\")","v":""},{"$f":"IF(SUM(Z15:AA15)<>0,ROUNDDOWN(MAX(Z15:AA15),3),\"\")","v":""},{"$f":"IF(SUM(C15:E15,I15:K15)<>0,SUM(C15:E15,I15:K15),\"\")","v":""},{"$f":"IF(SUM(C16:E16,I14:K14)<>0,SUM(C16:E16,I14:K14),\"\")","v":""},null,{"$f":"IF(COUNTIF(C15:E15,DISTANCE_Q)=NB_SETS_G_Q,VAL_PT_MATCH,0)","v":0},{"$f":"IF(COUNTIF(I15:K15,DISTANCE_Q)=NB_SETS_G_Q,VAL_PT_MATCH,0)","v":0},{"$f":"IF(M15=1,BONUS,0)","v":0},{"$f":"IF(U15=VAL_PT_MATCH,(NB_SETS_G_Q*2)-1-COUNTIF(C16:E16,DISTANCE_Q),COUNTIF(C15:E15,DISTANCE_Q))","v":0},{"$f":"IF(V15=VAL_PT_MATCH,(NB_SETS_G_Q*2)-1-COUNTIF(I14:K14,DISTANCE_Q),COUNTIF(I15:K15,DISTANCE_Q))","v":0},{"$f":"IF(SUM(C16:E16,)<>0,SUM(C15:E15)/SUM(C16:E16),0)","v":0},{"$f":"IF(SUM(I14:K14,)<>0,SUM(I15:K15)/SUM(I14:K14),0)","v":0},{"$f":"IF(P15<>\"\",(SUM(U15:V15)*1000000000)+(SUM(X15:Y15)*100000000)+(ROUND(P15*1000,0)*10000)+ROUND(Q15*1000,0),0)","v":0}]
[null,"TIZON Alain\nCUCQ",null,null,null,null,null,null,null,null,null,null,{"$f":"IF($AB16<>0,RANK($AB16,$AB14:$AB16),\"\")","v":""},{"$f":"IF(TYPE_QUALIF=\"Poules 4J C\",U16+V16+W16+VAL_PT_MATCH,U16+V16+W16)","v":0},{"$f":"IF(TYPE_QUALIF=\"Poules 4J C\",X16+Y16+(NB_SETS_G_Q*2-1),X16+Y16)","v":0},{"$f":"IF(S16<>\"\",IF(R16<>\"\",ROUNDDOWN(R16/S16,3),\"\"),\"\")","v":""},{"$f":"IF(SUM(Z16:AA16)<>0,ROUNDDOWN(MAX(Z16:AA16),3),\"\")","v":""},{"$f":"IF(SUM(C16:E16,F16:H16)<>0,SUM(C16:E16,F16:H16),\"\")","v":""},{"$f":"IF(SUM(C15:E15,F14:H14)<>0,SUM(C15:E15,F14:H14),\"\")","v":""},null,{"$f":"IF(COUNTIF(C16:E16,DISTANCE_Q)=NB_SETS_G_Q,VAL_PT_MATCH,0)","v":0},{"$f":"IF(COUNTIF(F16:H16,DISTANCE_Q)=NB_SETS_G_Q,VAL_PT_MATCH,0)","v":0},{"$f":"IF(M16=1,BONUS,0)","v":0},{"$f":"IF(U16=VAL_PT_MATCH,(NB_SETS_G_Q*2)-1-COUNTIF(C15:E15,DISTANCE_Q),COUNTIF(C16:E16,DISTANCE_Q))","v":0},{"$f":"IF(V16=VAL_PT_MATCH,(NB_SETS_G_Q*2)-1-COUNTIF(F14:H14,DISTANCE_Q),COUNTIF(F16:H16,DISTANCE_Q))","v":0},{"$f":"IF(SUM(C15:E15,)<>0,SUM(C16:E16)/SUM(C15:E15),0)","v":0},{"$f":"IF(SUM(F14:H14)<>0,SUM(F16:H16)/SUM(F14:H14),0)","v":0},{"$f":"IF(P16<>\"\",(SUM(U16:V16)*1000000000)+(SUM(X16:Y16)*100000000)+(ROUND(P16*1000,0)*10000)+ROUND(Q16*1000,0),0)","v":0}]
[]
[]
[null,"Poule 3","Match 1",null,null,"Match 2",null,null,"Match 3",null,null,null,"Totaux",null,null,null,null,null,null,null,"Détail Pts de matchs",null,null,"Détail Pts de sets",null,"Moy. particulières"]
[null,null,"set 1","set 2","set 3","set 1","set 2","set 3","set 1","set 2","set 3",null,"Clst","Pts Match","Pts Set","Moy. Gen.","Moy. Part.","Pts marq.","Pts subis",null,"Match 1","Match 2","Bonus 1er","Match 1","Match 2","Match 1","Match 2","Calcul\n1er"]
[null,"MARTEL Bruno\nCUCQ",null,null,null,null,null,null,null,null,null,null,{"$f":"IF($AB21<>0,RANK($AB21,$AB21:$AB23),\"\")","v":""},{"$f":"IF(TYPE_QUALIF=\"Poules 4J C\",U21+V21+W21+VAL_PT_MATCH,U21+V21+W21)","v":0},{"$f":"IF(TYPE_QUALIF=\"Poules 4J C\",X21+Y21+(NB_SETS_G_Q*2-1),X21+Y21)","v":0},{"$f":"IF(S21<>\"\",IF(R21<>\"\",ROUNDDOWN(R21/S21,3),\"\"),\"\")","v":""},{"$f":"IF(SUM(Z21:AA21)<>0,ROUNDDOWN(MAX(Z21:AA21),3),\"\")","v":""},{"$f":"IF(SUM(F21:H21,I21:K21)<>0,SUM(F21:H21,I21:K21),\"\")","v":""},{"$f":"IF(SUM(F23:H23,I22:K22)<>0,SUM(F23:H23,I22:K22),\"\")","v":""},null,{"$f":"IF(COUNTIF(F21:H21,DISTANCE_Q)=NB_SETS_G_Q,VAL_PT_MATCH,0)","v":0},{"$f":"IF(COUNTIF(I21:K21,DISTANCE_Q)=NB_SETS_G_Q,VAL_PT_MATCH,0)","v":0},{"$f":"IF(M21=1,BONUS,0)","v":0},{"$f":"IF(U21=VAL_PT_MATCH,(NB_SETS_G_Q*2)-1-COUNTIF(F23:H23,DISTANCE_Q),COUNTIF(F21:H21,DISTANCE_Q))","v":0},{"$f":"IF(V21=VAL_PT_MATCH,(NB_SETS_G_Q*2)-1-COUNTIF(I22:K22,DISTANCE_Q),COUNTIF(I21:K21,DISTANCE_Q))","v":0},{"$f":"IF(SUM(F23:H23)<>0,SUM(F21:H21)/SUM(F23:H23),0)","v":0},{"$f":"IF(SUM(I22:K22,)<>0,SUM(I21:K21)/SUM(I22:K22),0)","v":0},{"$f":"IF(P21<>\"\",(SUM(U21:V21)*1000000000)+(SUM(X21:Y21)*100000000)+(ROUND(P21*1000,0)*10000)+ROUND(Q21*1000,0),0)","v":0}]
[null,"CARTIERE André\nCUCQ",null,null,null,null,null,null,null,null,null,null,{"$f":"IF($AB22<>0,RANK($AB22,$AB21:$AB23),\"\")","v":""},{"$f":"IF(TYPE_QUALIF=\"Poules 4J C\",U22+V22+W22+VAL_PT_MATCH,U22+V22+W22)","v":0},{"$f":"IF(TYPE_QUALIF=\"Poules 4J C\",X22+Y22+(NB_SETS_G_Q*2-1),X22+Y22)","v":0},{"$f":"IF(S22<>\"\",IF(R22<>\"\",ROUNDDOWN(R22/S22,3),\"\"),\"\")","v":""},{"$f":"IF(SUM(Z22:AA22)<>0,ROUNDDOWN(MAX(Z22:AA22),3),\"\")","v":""},{"$f":"IF(SUM(C22:E22,I22:K22)<>0,SUM(C22:E22,I22:K22),\"\")","v":""},{"$f":"IF(SUM(C23:E23,I21:K21)<>0,SUM(C23:E23,I21:K21),\"\")","v":""},null,{"$f":"IF(COUNTIF(C22:E22,DISTANCE_Q)=NB_SETS_G_Q,VAL_PT_MATCH,0)","v":0},{"$f":"IF(COUNTIF(I22:K22,DISTANCE_Q)=NB_SETS_G_Q,VAL_PT_MATCH,0)","v":0},{"$f":"IF(M22=1,BONUS,0)","v":0},{"$f":"IF(U22=VAL_PT_MATCH,(NB_SETS_G_Q*2)-1-COUNTIF(C23:E23,DISTANCE_Q),COUNTIF(C22:E22,DISTANCE_Q))","v":0},{"$f":"IF(V22=VAL_PT_MATCH,(NB_SETS_G_Q*2)-1-COUNTIF(I21:K21,DISTANCE_Q),COUNTIF(I22:K22,DISTANCE_Q))","v":0},{"$f":"IF(SUM(C23:E23,)<>0,SUM(C22:E22)/SUM(C23:E23),0)","v":0},{"$f":"IF(SUM(I21:K21,)<>0,SUM(I22:K22)/SUM(I21:K21),0)","v":0},{"$f":"IF(P22<>\"\",(SUM(U22:V22)*1000000000)+(SUM(X22:Y22)*100000000)+(ROUND(P22*1000,0)*10000)+ROUND(Q22*1000,0),0)","v":0}]
[null,"SAISON Bertrand\nCUCQ",null,null,null,null,null,null,null,null,null,null,{"$f":"IF($AB23<>0,RANK($AB23,$AB21:$AB23),\"\")","v":""},{"$f":"IF(TYPE_QUALIF=\"Poules 4J C\",U23+V23+W23+VAL_PT_MATCH,U23+V23+W23)","v":0},{"$f":"IF(TYPE_QUALIF=\"Poules 4J C\",X23+Y23+(NB_SETS_G_Q*2-1),X23+Y23)","v":0},{"$f":"IF(S23<>\"\",IF(R23<>\"\",ROUNDDOWN(R23/S23,3),\"\"),\"\")","v":""},{"$f":"IF(SUM(Z23:AA23)<>0,ROUNDDOWN(MAX(Z23:AA23),3),\"\")","v":""},{"$f":"IF(SUM(C23:E23,F23:H23)<>0,SUM(C23:E23,F23:H23),\"\")","v":""},{"$f":"IF(SUM(C22:E22,F21:H21)<>0,SUM(C22:E22,F21:H21),\"\")","v":""},null,{"$f":"IF(COUNTIF(C23:E23,DISTANCE_Q)=NB_SETS_G_Q,VAL_PT_MATCH,0)","v":0},{"$f":"IF(COUNTIF(F23:H23,DISTANCE_Q)=NB_SETS_G_Q,VAL_PT_MATCH,0)","v":0},{"$f":"IF(M23=1,BONUS,0)","v":0},{"$f":"IF(U23=VAL_PT_MATCH,(NB_SETS_G_Q*2)-1-COUNTIF(C22:E22,DISTANCE_Q),COUNTIF(C23:E23,DISTANCE_Q))","v":0},{"$f":"IF(V23=VAL_PT_MATCH,(NB_SETS_G_Q*2)-1-COUNTIF(F21:H21,DISTANCE_Q),COUNTIF(F23:H23,DISTANCE_Q))","v":0},{"$f":"IF(SUM(C22:E22,)<>0,SUM(C23:E23)/SUM(C22:E22),0)","v":0},{"$f":"IF(SUM(F21:H21)<>0,SUM(F23:H23)/SUM(F21:H21),0)","v":0},{"$f":"IF(P23<>\"\",(SUM(U23:V23)*1000000000)+(SUM(X23:Y23)*100000000)+(ROUND(P23*1000,0)*10000)+ROUND(Q23*1000,0),0)","v":0}]
[]
[]
[null,null,null,null,null,null,null,null,null,null,null,null,"Reclassement qualifications"]

{"sheet":"Tours de jeu","index":3,"n_rows":64,"n_cols":17,"rows_kept":64,"cut":false,"hidden":false,"merged":[]}
[null,{"$f":" TOURNOI & \" - \" & LIEU_TOURNOI","v":"T3 Qualification CD62 R1 - WIMILLE"}]
[null,{"$f":"DATE_TOURNOI","v":"2019-01-13"}]
[null,"Tours de jeu et étiquettes à imprimer pour écriture des scores"]
[]
[null,"Ordre des matchs d'une poule de 3 joueurs :"]
[null,"M1: J2-J3     M2: J1-Perdant M1    M3: J1-Gagnant M1"]
[null,"L'ordre théorique proposé est le suivant, à adpater suite au résultat du 1er match :"]
[null,"M1: J2-J3     M2: J1-J3    M3: J1-J2"]
[]
[]
[null,"Poule 1 :  J2  J3 du même club. Tous Les joueurs d'un même club doivent se rencontrer lors du ou des premiers tours de jeu."]
[null,"               Le programme a changé l'ordre des matchs pour respecter cette règle, mais il se peut que, de ce fait, des incohérences apparaissent (Enchaînement de matchs impossible, etc...)."]
[null,"               Le directeur de jeu est à même de vérifier et de rectifier si nécessaire."]
[]
[]
[]
[null,"Poule 1  Match 1 : J2-J3","set 1","set 2","set 3",null,null,"Poule 1  Match 2 : J1-J3","set 1","set 2","set 3",null,null,"Poule 1  Match 3 : J1-J2","set 1","set 2","set 3"]
[null,"FLAHAUT Ghislain\nCUCQ",null,null,null,null,null,"MONTADOR Christophe\nWIMILLE",null,null,null,null,null,"MONTADOR Christophe\nWIMILLE"]
[null,"RAMET Jacques\nCUCQ",null,null,null,null,null,"RAMET Jacques\nCUCQ",null,null,null,null,null,"FLAHAUT Ghislain\nCUCQ"]
[]
[]
[]
[]
[null,"Poule 2 :  J2  J3 du même club. Tous Les joueurs d'un même club doivent se rencontrer lors du ou des premiers tours de jeu."]
[null,"               Le programme a changé l'ordre des matchs pour respecter cette règle, mais il se peut que, de ce fait, des incohérences apparaissent (Enchaînement de matchs impossible, etc...)."]
[null,"               Le directeur de jeu est à même de vérifier et de rectifier si nécessaire."]
[]
[]
[]
[null,"Poule 2  Match 1 : J2-J3","set 1","set 2","set 3",null,null,"Poule 2  Match 2 : J1-J3","set 1","set 2","set 3",null,null,"Poule 2  Match 3 : J1-J2","set 1","set 2","set 3"]
[null,"DEPLECHIN Roland\nCUCQ",null,null,null,null,null,"MONTADOR Ludovic\nWIMILLE",null,null,null,null,null,"MONTADOR Ludovic\nWIMILLE"]
[null,"TIZON Alain\nCUCQ",null,null,null,null,null,"TIZON Alain\nCUCQ",null,null,null,null,null,"DEPLECHIN Roland\nCUCQ"]
[]
[]
[]
[]
[null," Poule 3 :"]
[]
[]
[]
[null,"Poule 3  Match 1 : J2-J3","set 1","set 2","set 3",null,null,"Poule 3  Match 2 : J1-J3","set 1","set 2","set 3",null,null,"Poule 3  Match 3 : J1-J2","set 1","set 2","set 3"]
[null,"CARTIERE André\nCUCQ",null,null,null,null,null,"MARTEL Bruno\nCUCQ",null,null,null,null,null,"MARTEL Bruno\nCUCQ"]
[null,"SAISON Bertrand\nCUCQ",null,null,null,null,null,"SAISON Bertrand\nCUCQ",null,null,null,null,null,"CARTIERE André\nCUCQ"]
[]
[]
[]
[]
[]
[]
[]
[]
[]
[null,null,null,null,null,null,"Si enchaînement des matchs dès qu'un billard est disponible, ordre de lancement des matchs en alternant les poules :"]
[]
[null,null,null,null,null,null,"N°","Match",null,null,null,null,null,null,"Billard"]
[null,null,null,null,null,null,1,"Match 1 Poule 1 :   FLAHAUT Ghislain   /   RAMET Jacques"]
[null,null,null,null,null,null,2,"Match 1 Poule 2 :   DEPLECHIN Roland   /   TIZON Alain"]
[null,null,null,null,null,null,3,"Match 1 Poule 3 :   CARTIERE André   /   SAISON Bertrand"]
[null,null,null,null,null,null,4,"Match 2 Poule 1 :   MONTADOR Christophe   /   RAMET Jacques"]
[null,null,null,null,null,null,5,"Match 2 Poule 2 :   MONTADOR Ludovic   /   TIZON Alain"]
[null,null,null,null,null,null,6,"Match 2 Poule 3 :   MARTEL Bruno   /   SAISON Bertrand"]
[null,null,null,null,null,null,7,"Match 3 Poule 1 :   MONTADOR Christophe   /   FLAHAUT Ghislain"]
[null,null,null,null,null,null,8,"Match 3 Poule 2 :   MONTADOR Ludovic   /   DEPLECHIN Roland"]
[null,null,null,null,null,null,9,"Match 3 Poule 3 :   MARTEL Bruno   /   CARTIERE André"]

{"sheet":"Feuilles de match","index":4,"n_rows":203,"n_cols":27,"rows_kept":203,"cut":false,"hidden":false,"merged":[]}
["Poule 1 M1 : FLAHAUT Ghislain  /  RAMET Jacques",null,null,null,null,null,null,null,null,null,null,null,null,null,"Poule 1 M2 : MONTADOR Christophe  /  RAMET Jacques"]
[]
["Billard n°",null,null,"2 sets gagnants  60 points",null,null,null,null,null,null,null,null,null,null,"Billard n°",null,null,"2 sets gagnants  60 points"]
["Bille blanche",null,null,null,null,null,null,"Bille Jaune",null,null,null,null,null,null,"Bille blanche",null,null,null,null,null,null,"Bille Jaune"]
["Nom du  →\njoueur",null,null,null,null,null,null,"Nom du  →\njoueur",null,null,null,null,null,null,"Nom du  →\njoueur",null,null,null,null,null,null,"Nom du  →\njoueur"]
["Set 1",null,"Set 2",null,"Set 3",null,null,"Set 1",null,"Set 2",null,"Set 3",null,null,"Set 1",null,"Set 2",null,"Set 3",null,null,"Set 1",null,"Set 2",null,"Set 3"]
["Pts","cum.","Pts","cum.","Pts","cum.",null,"Pts","cum.","Pts","cum.","Pts","cum.",null,"Pts","cum.","Pts","cum.","Pts","cum.",null,"Pts","cum.","Pts","cum.","Pts","cum."]
[]
[]
[]
[]
[]
[]
[]
[]
[]
[]
[]
[]
[]
[]
[]
[]
[]
[]
[]
[]
[]
[]
[]
[]
[]
[]
[]
[]
[]
[]
["Signature joueur",null,null,null,null,null,null,null,null,null,null,null,"Signature joueur",null,"Signature joueur",null,null,null,null,null,null,null,null,null,null,null,"Signature joueur"]
[null,null,null,null,null,null,"Signature arbitre",null,null,null,null,null,null,null,null,null,null,null,null,null,"Signature arbitre"]
[]
[]
["Poule 1 M3 : MONTADOR Christophe  /  FLAHAUT Ghislain",null,null,null,null,null,null,null,null,null,null,null,null,null,"Poule 2 M1 : DEPLECHIN Roland  /  TIZON Alain"]
[]
["Billard n°",null,null,"2 sets gagnants  60 points",null,null,null,null,null,null,null,null,null,null,"Billard n°",null,null,"2 sets gagnants  60 points"]
["Bille blanche",null,null,null,null,null,null,"Bille Jaune",null,null,null,null,null,null,"Bille blanche",null,null,null,null,null,null,"Bille Jaune"]
["Nom du  →\njoueur",null,null,null,null,null,null,"Nom du  →\njoueur",null,null,null,null,null,null,"Nom du  →\njoueur",null,null,null,null,null,null,"Nom du  →\njoueur"]
["Set 1",null,"Set 2",null,"Set 3",null,null,"Set 1",null,"Set 2",null,"Set 3",null,null,"Set 1",null,"Set 2",null,"Set 3",null,null,"Set 1",null,"Set 2",null,"Set 3"]
["Pts","cum.","Pts","cum.","Pts","cum.",null,"Pts","cum.","Pts","cum.","Pts","cum.",null,"Pts","cum.","Pts","cum.","Pts","cum.",null,"Pts","cum.","Pts","cum.","Pts","cum."]
[]
[]
[]
[]
[]
[]
[]
[]
[]
[]
[]
[]
[]
[]
[]
[]
[]
[]
[]
[]
[]
[]
[]
[]
[]
[]
[]
[]
[]
[]
["Signature joueur",null,null,null,null,null,null,null,null,null,null,null,"Signature joueur",null,"Signature joueur",null,null,null,null,null,null,null,null,null,null,null,"Signature joueur"]
[null,null,null,null,null,null,"Signature arbitre",null,null,null,null,null,null,null,null,null,null,null,null,null,"Signature arbitre"]
[]
[]
["Poule 2 M2 : MONTADOR Ludovic  /  TIZON Alain",null,null,null,null,null,null,null,null,null,null,null,null,null,"Poule 2 M3 : MONTADOR Ludovic  /  DEPLECHIN Roland"]
[]
["Billard n°",null,null,"2 sets gagnants  60 points",null,null,null,null,null,null,null,null,null,null,"Billard n°",null,null,"2 sets gagnants  60 points"]
["Bille blanche",null,null,null,null,null,null,"Bille Jaune",null,null,null,null,null,null,"Bille blanche",null,null,null,null,null,null,"Bille Jaune"]
["Nom du  →\njoueur",null,null,null,null,null,null,"Nom du  →\njoueur",null,null,null,null,null,null,"Nom du  →\njoueur",null,null,null,null,null,null,"Nom du  →\njoueur"]
["Set 1",null,"Set 2",null,"Set 3",null,null,"Set 1",null,"Set 2",null,"Set 3",null,null,"Set 1",null,"Set 2",null,"Set 3",null,null,"Set 1",null,"Set 2",null,"Set 3"]
["Pts","cum.","Pts","cum.","Pts","cum.",null,"Pts","cum.","Pts","cum.","Pts","cum.",null,"Pts","cum.","Pts","cum.","Pts","cum.",null,"Pts","cum.","Pts","cum.","Pts","cum."]
[]
[]
[]
[]
[]
[]
[]
[]
[]
[]
[]
[]
[]
[]
[]
[]
[]
[]
[]
[]
[]
[]
[]
[]
[]
[]
[]
[]
[]
[]
["Signature joueur",null,null,null,null,null,null,null,null,null,null,null,"Signature joueur",null,"Signature joueur",null,null,null,null,null,null,null,null,null,null,null,"Signature joueur"]
[null,null,null,null,null,null,"Signature arbitre",null,null,null,null,null,null,null,null,null,null,null,null,null,"Signature arbitre"]
[]
[]
["Poule 3 M1 : CARTIERE André  /  SAISON Bertrand",null,null,null,null,null,null,null,null,null,null,null,null,null,"Poule 3 M2 : MARTEL Bruno  /  SAISON Bertrand"]
[]
["Billard n°",null,null,"2 sets gagnants  60 points",null,null,null,null,null,null,null,null,null,null,"Billard n°",null,null,"2 sets gagnants  60 points"]
["Bille blanche",null,null,null,null,null,null,"Bille Jaune",null,null,null,null,null,null,"Bille blanche",null,null,null,null,null,null,"Bille Jaune"]
["Nom du  →\njoueur",null,null,null,null,null,null,"Nom du  →\njoueur",null,null,null,null,null,null,"Nom du  →\njoueur",null,null,null,null,null,null,"Nom du  →\njoueur"]
["Set 1",null,"Set 2",null,"Set 3",null,null,"Set 1",null,"Set 2",null,"Set 3",null,null,"Set 1",null,"Set 2",null,"Set 3",null,null,"Set 1",null,"Set 2",null,"Set 3"]
["Pts","cum.","Pts","cum.","Pts","cum.",null,"Pts","cum.","Pts","cum.","Pts","cum.",null,"Pts","cum.","Pts","cum.","Pts","cum.",null,"Pts","cum.","Pts","cum.","Pts","cum."]
[]
[]
[]
[]
[]
[]
[]
[]
[]
[]
[]
[]
[]
[]
[]
[]
[]
[]
[]
[]
[]
[]
[]
[]
[]
[]
[]
[]
[]
[]
["Signature joueur",null,null,null,null,null,null,null,null,null,null,null,"Signature joueur",null,"Signature joueur",null,null,null,null,null,null,null,null,null,null,null,"Signature joueur"]
[null,null,null,null,null,null,"Signature arbitre",null,null,null,null,null,null,null,null,null,null,null,null,null,"Signature arbitre"]
[]
[]
["Poule 3 M3 : MARTEL Bruno  /  CARTIERE André"]
[]
["Billard n°",null,null,"2 sets gagnants  60 points",null,null,null,null,null,null,null,null,null,null,"Billard n°"]
["Bille blanche",null,null,null,null,null,null,"Bille Jaune",null,null,null,null,null,null,"Bille blanche",null,null,null,null,null,null,"Bille Jaune"]
["Nom du  →\njoueur",null,null,null,null,null,null,"Nom du  →\njoueur",null,null,null,null,null,null,"Nom du  →\njoueur",null,null,null,null,null,null,"Nom du  →\njoueur"]
["Set 1",null,"Set 2",null,"Set 3",null,null,"Set 1",null,"Set 2",null,"Set 3",null,null,"Set 1",null,"Set 2",null,"Set 3",null,null,"Set 1",null,"Set 2",null,"Set 3"]
["Pts","cum.","Pts","cum.","Pts","cum.",null,"Pts","cum.","Pts","cum.","Pts","cum.",null,"Pts","cum.","Pts","cum.","Pts","cum.",null,"Pts","cum.","Pts","cum.","Pts","cum."]
[]
[]
[]
[]
[]
[]
[]
[]
[]
[]
[]
[]
[]
[]
[]
[]
[]
[]
[]
[]
[]
[]
[]
[]
[]
[]
[]
[]
[]
[]
["Signature joueur",null,null,null,null,null,null,null,null,null,null,null,"Signature joueur",null,"Signature joueur",null,null,null,null,null,null,null,null,null,null,null,"Signature joueur"]
[null,null,null,null,null,null,"Signature arbitre",null,null,null,null,null,null,null,null,null,null,null,null,null,"Signature arbitre"]

{"sheet":"Phase finale","index":5,"n_rows":25,"n_cols":46,"rows_kept":25,"cut":false,"hidden":false,"merged":[[6,13,6,21],[17,13,18,13],[34,7,34,9],[35,7,35,9],[35,13,36,13],[36,7,36,9]]}
[null,{"$f":" TOURNOI & \" - \" & LIEU_TOURNOI","v":"T3 Qualification CD62 R1 - WIMILLE"},null,null,null,null,null,null,null,null,null,null,null,null,null,null,null,null,null,null,null,null,null,null,"Résultats Reclassement",null,null,null,null,"Résultats 1/2 F.",null,null,null,null,"Résultats F.",null,null,null,null,"Total compétition"]
[null,{"$f":"DATE_TOURNOI","v":"2019-01-13"},null,null,null,null,null,null,null,null,null,null,null,null,null,null,null,null,null,null,null,null,null,"Joueur","Pts Match","Pts set","Moy. Part.","Pts Marq.","Pts subis","Pts Match","Pts set","Moy.","Pts Marq.","Pts subis","Pts Match","Pts set","Moy.","Pts Marq.","Pts subis","Rang final","Pts Match","Pts set","Moy. Gen.","Moy. Part.","Pts Marq.","Pts subis"]
[null,null,null,null,null,null,null,null,null,null,null,null,null,null,null,null,null,null,null,null,null,null,null,null,null,null,null,null,null,{"$f":"IF(B10=X3,IF(COUNTIF(C10:E10,DISTANCE_F)=NB_SETS_G_F,VAL_PT_MATCH,0),0)","v":0},{"$f":"IF(B10=X3,IF(AD3=VAL_PT_MATCH,(NB_SETS_G_F*2)-1-COUNTIF(C11:E11,DISTANCE_F),COUNTIF(C10:E10,DISTANCE_F)),0)","v":0},{"$f":"IF(AH3<>0,ROUNDDOWN(AG3/AH3,3),0)","v":0},{"$f":"IF(B10=X3,SUM(C10:E10),0)","v":0},{"$f":"IF(B10=X3,SUM(C11:E11),0)","v":0},{"$f":"IF(G18=X3,IF(COUNTIF(H18:J18,DISTANCE_F)=NB_SETS_G_F,VAL_PT_MATCH,0),0)","v":0},{"$f":"IF(G18=X3,IF(AI3=VAL_PT_MATCH,(NB_SETS_G_F*2)-1-COUNTIF(H19:J19,DISTANCE_F),COUNTIF(H18:J18,DISTANCE_F)),0)","v":0},{"$f":"IF(AM3<>0,ROUNDDOWN(AL3/AM3,3),0)","v":0},{"$f":"IF(G18=X3,SUM(H18:J18),0)","v":0},{"$f":"IF(G18=X3,SUM(H19:J19),0)","v":0},{"$f":"IF(AI3=VAL_PT_MATCH,1,IF(AD3=VAL_PT_MATCH,2,3))","v":3},{"$f":"Y3+AD3+AI3","v":0},0,{"$f":"IF(AT3<>0,ROUNDDOWN(AS3/AT3,3),0)","v":0},{"$f":"MAX(AA3,AF3,AK3)","v":0},{"$f":"AB3+AG3+AL3","v":0},0]
[null,null,null,null,null,null,null,null,null,null,null,null,null,null,null,null,null,null,null,null,null,null,null,null,null,null,null,null,null,{"$f":"IF(B26=X4,IF(COUNTIF(C26:E26,DISTANCE_F)=NB_SETS_G_F,VAL_PT_MATCH,0),0)","v":0},{"$f":"IF(B26=X4,IF(AD4=VAL_PT_MATCH,(NB_SETS_G_F*2)-1-COUNTIF(C27:E27,DISTANCE_F),COUNTIF(C26:E26,DISTANCE_F)),0)","v":0},{"$f":"IF(AH4<>0,ROUNDDOWN(AG4/AH4,3),0)","v":0},{"$f":"IF(B26=X4,SUM(C26:E26),0)","v":0},{"$f":"IF(B26=X4,SUM(C27:E27),0)","v":0},{"$f":"IF(G19=X4,IF(COUNTIF(H19:J19,DISTANCE_F)=NB_SETS_G_F,VAL_PT_MATCH,0),0)","v":0},{"$f":"IF(G19=X4,IF(AI4=VAL_PT_MATCH,(NB_SETS_G_F*2)-1-COUNTIF(H18:J18,DISTANCE_F),COUNTIF(H19:J19,DISTANCE_F)),0)","v":0},{"$f":"IF(AM4<>0,ROUNDDOWN(AL4/AM4,3),0)","v":0},{"$f":"IF(G19=X4,SUM(H19:J19),0)","v":0},{"$f":"IF(G19=X4,SUM(H18:J18),0)","v":0},{"$f":"IF(AI4=VAL_PT_MATCH,1,IF(AD4=VAL_PT_MATCH,2,3))","v":3},0,0,{"$f":"IF(AT4<>0,ROUNDDOWN(AS4/AT4,3),0)","v":0},{"$f":"MAX(AA4,AF4,AK4)","v":0},0,0]
[null,null,null,null,null,null,null,null,null,null,null,null,null,null,null,null,null,null,null,null,null,null,null,null,null,null,null,null,null,{"$f":"IF(B27=X5,IF(COUNTIF(C27:E27,DISTANCE_F)=NB_SETS_G_F,VAL_PT_MATCH,0),0)","v":0},{"$f":"IF(B27=X5,IF(AD5=VAL_PT_MATCH,(NB_SETS_G_F*2)-1-COUNTIF(C26:E26,DISTANCE_F),COUNTIF(C27:E27,DISTANCE_F)),0)","v":0},{"$f":"IF(AH5<>0,ROUNDDOWN(AG5/AH5,3),0)","v":0},{"$f":"IF(B27=X5,SUM(C27:E27),0)","v":0},{"$f":"IF(B27=X5,SUM(C26:E26),0)","v":0},{"$f":"IF(G19=X5,IF(COUNTIF(H19:J19,DISTANCE_F)=NB_SETS_G_F,VAL_PT_MATCH,0),0)","v":0},{"$f":"IF(G19=X5,IF(AI5=VAL_PT_MATCH,(NB_SETS_G_F*2)-1-COUNTIF(H18:J18,DISTANCE_F),COUNTIF(H19:J19,DISTANCE_F)),0)","v":0},{"$f":"IF(AM5<>0,ROUNDDOWN(AL5/AM5,3),0)","v":0},{"$f":"IF(G19=X5,SUM(H19:J19),0)","v":0},{"$f":"IF(G19=X5,SUM(H18:J18),0)","v":0},{"$f":"IF(AI5=VAL_PT_MATCH,1,IF(AD5=VAL_PT_MATCH,2,3))","v":3},0,0,{"$f":"IF(AT5<>0,ROUNDDOWN(AS5/AT5,3),0)","v":0},{"$f":"MAX(AA5,AF5,AK5)","v":0},0,0]
[null,null,null,null,null,null,null,null,null,null,null,null,null,null,null,null,null,null,null,null,null,null,null,null,null,null,null,null,null,{"$f":"IF(B11=X6,IF(COUNTIF(C11:E11,DISTANCE_F)=NB_SETS_G_F,VAL_PT_MATCH,0),0)","v":0},{"$f":"IF(B11=X6,IF(AD6=VAL_PT_MATCH,(NB_SETS_G_F*2)-1-COUNTIF(C10:E10,DISTANCE_F),COUNTIF(C11:E11,DISTANCE_F)),0)","v":0},{"$f":"IF(AH6<>0,ROUNDDOWN(AG6/AH6,3),0)","v":0},{"$f":"IF(B11=X6,SUM(C11:E11),0)","v":0},{"$f":"IF(B11=X6,SUM(C10:E10),0)","v":0},{"$f":"IF(G18=X6,IF(COUNTIF(H18:J18,DISTANCE_F)=NB_SETS_G_F,VAL_PT_MATCH,0),0)","v":0},{"$f":"IF(G18=X6,IF(AI6=VAL_PT_MATCH,(NB_SETS_G_F*2)-1-COUNTIF(H19:J19,DISTANCE_F),COUNTIF(H18:J18,DISTANCE_F)),0)","v":0},{"$f":"IF(AM6<>0,ROUNDDOWN(AL6/AM6,3),0)","v":0},{"$f":"IF(G18=X6,SUM(H18:J18),0)","v":0},{"$f":"IF(G18=X6,SUM(H19:J19),0)","v":0},{"$f":"IF(AI6=VAL_PT_MATCH,1,IF(AD6=VAL_PT_MATCH,2,3))","v":3},0,0,{"$f":"IF(AT6<>0,ROUNDDOWN(AS6/AT6,3),0)","v":0},{"$f":"MAX(AA6,AF6,AK6)","v":0},0,0]
[]
[null,"- 1/2 finale -"]
[null,"1 - 4"]
[]
[]
[]
[]
[]
[]
[null,null,null,null,null,null,"- Finale -"]
[null,null,null,null,null,null,null,null,null,null,null,null,null,{"$f":"IF(N18<>\"\",\"VAINQUEUR\",\"\")","v":""}]
[null,null,null,null,null,null,{"$f":"IF(COUNTIF(C10:E10,DISTANCE_F)=NB_SETS_G_F,B10,IF(COUNTIF(C11:E11,DISTANCE_F)=NB_SETS_G_F,B11,\"\"))","v":""},null,null,null,null,null,null,{"$f":"IF(COUNTIF(H18:J18,DISTANCE_F)=NB_SETS_G_F,G18,IF(COUNTIF(H19:J19,DISTANCE_F)=NB_SETS_G_F,G19,\"\"))","v":""}]
[null,null,null,null,null,null,{"$f":"IF(COUNTIF(C26:E26,DISTANCE_F)=NB_SETS_G_F,B26,IF(COUNTIF(C27:E27,DISTANCE_F)=NB_SETS_G_F,B27,\"\"))","v":""}]
[]
[]
[]
[]
[]
[null,"2 - 3"]

{"sheet":"Classement compétition","index":6,"n_rows":6,"n_cols":9,"rows_kept":6,"cut":false,"hidden":false,"merged":[[3,0,3,8]]}
[null,{"$f":"TOURNOI & \" - \" & LIEU_TOURNOI","v":"T3 Qualification CD62 R1 - WIMILLE"}]
[null,{"$f":"DATE_TOURNOI","v":"2019-01-13"}]
[]
["Classement final"]
[]
["Place","Joueur",{"$f":"IF(NUM_TOURNOI>0,\"Pts Tournoi\",\"\")","v":"Pts Tournoi"},"Pts Match","Pts Set","Moy. Gen.","Moy. Part.","Pts Marq.","Pts Subis"]

{"sheet":"Statistiques joueurs","index":7,"n_rows":1,"n_cols":14,"rows_kept":1,"cut":false,"hidden":false,"merged":[]}
["Joueur","Adversaire","G/P","Sets gagnés","Sets perdus","Pts marqués","Pts subis","Date","Compétition","Phase","Licence J.","Clst init. J.","Licence A.","Clst init. A."]

{"sheet":"Synthèse tournois","index":8,"n_rows":61,"n_cols":31,"rows_kept":61,"cut":false,"hidden":false,"merged":[[2,6,2,13]]}
[null,null,null,null,null,null,null,"Nb Tournois",4]
[null,null,null,null,null,null,null,"Nb T. retenus",3]
[null,null,null,null,null,null,"Classement général",null,null,null,null,null,null,null,null,null,"Détail T1",null,null,null,null,null,null,null,"Détail T2"]
["Nom","Prénom","Licence","Ville ou Club","Joueurs","Clst Init.","Place","Tournois retenus","Pts tournoi","Pts \nMatch","Pts Set","Moy. Gen.","Moy. Part","Pts Marq.","Pts Subis",null,"Pts tournoi","Pts \nMatch","Pts Set","Moy. Gen.","Moy. Part","Pts Marq.","Pts Subis",null,"Pts tournoi","Pts \nMatch","Pts Set","Moy. Gen.","Moy. Part","Pts Marq.","Pts Subis"]
["MONTADOR","Christophe","124468G","WIMILLE",{"$f":"A5 & \" \" & B5","v":"MONTADOR Christophe"},1,1,"T2 T1 ",22,9,14,1.0720000267028809,1.7389999628067017,921,859,null,8,2,5,1.01,1.7389999628067017,385,381,null,14,7,9,1.121,1.6660000085830688,536,478]
["MONTADOR","Ludovic","103019H","WIMILLE","MONTADOR Ludovic",2,2,"T1 T2 ",20,11,13,1.187000036239624,2.7899999618530273,880,741,null,14,9,10,1.4139999999999999,2.79,587,415,null,6,2,3,0.89800000190734863,1.0709999799728394,293,326]
["MARTEL","Bruno","121420A","CUCQ","MARTEL Bruno",3,3,"T1 T2 ",16,9,11,1.1369999647140503,1.6210000514984131,778,684,null,10,7,9,1.1919999999999999,1.6210000514984131,540,453,null,6,2,2,1.0299999713897705,1.4950000047683716,238,231]
["CARTIERE","André","117749V","CUCQ","CARTIERE André",4,4,"T2 T1 ",16,5,8,0.94800001382827759,1.934999942779541,699,737,null,6,0,0,0.67900002002716064,0.74099999666213989,163,240,null,10,5,8,1.0780000000000001,1.9350000000000001,536,497]
["DEPLECHIN","Roland","154167Y","CUCQ","DEPLECHIN Roland",5,5,"T1 T2 ",14,7,7,0.97699999809265137,2.9260001182556152,556,569,null,8,5,5,1.0029999999999999,2.9260001182556152,316,315,null,6,2,2,0.9440000057220459,1.253000020980835,240,254]
["FLAHAUT","Ghislain","159163D","CUCQ","FLAHAUT Ghislain",6,6,"T2 T1 ",14,4,6,1.0130000114440918,1.6660000085830688,528,521,null,6,2,3,1.0329999923706055,1.3480000495910645,216,209,null,8,2,3,1,1.6660000085830688,312,312]
["RAMET","Jacques","154166X","CUCQ","RAMET Jacques",7,7,"T2 T1 ",12,3,4,0.6470000147819519,1.25,403,622,null,4,0,0,0.45800000429153442,0.57499998807907104,110,240,null,8,3,4,0.76700000000000002,1.25,293,382]
["TIZON","Alain","121424E","CUCQ","TIZON Alain",8,8,"T2 T1 ",12,2,2,0.96700000762939453,1.343000054359436,472,488,null,6,0,0,0.80000001192092896,0.85000002384185791,192,240,null,6,2,2,1.1289999485015869,1.343000054359436,280,248]
["SAISON","Bertrand","141319J","CUCQ","SAISON Bertrand",9,9,"T1 ",6,2,4,0.94199997186660767,1.1759999990463257,261,277,null,6,2,4,0.94199997186660767,1.1759999990463257,261,277]
["RAOULT","Damien","146952F","DIVION","RAOULT Damien",2]
["DELATTRE","Christian","017030A","DIVION","DELATTRE Christian",3]
["LEGRAND","Francis","016768Y","DIVION","LEGRAND Francis",4]
["LEBECQ","Jean-Pierre","017263Y","CUCQ","LEBECQ Jean-Pierre",5]
["MARTEL","Michel","131084S","CUCQ","MARTEL Michel",9]
["TRIPLET","Eddy","145206W","CUCQ","TRIPLET Eddy",11]
["MEUROT","Bernard","136899J","CUCQ","MEUROT Bernard",13]
["COFFRE","Frédéric","154322R","CUCQ","COFFRE Frédéric",16]
["MERLIN","Christian","016887N","CUCQ","MERLIN Christian",17]
["SZUGAJEW","Casimir","101872E","CUCQ","SZUGAJEW Casimir",18]
["VADUNTHUN","Daniel","155058R","CUCQ","VADUNTHUN Daniel",19]
["BROUTIER","Bertrand","101241X","CUCQ","BROUTIER Bertrand",20]
["VANTOMME","Daniel","112741F","WIMILLE","VANTOMME Daniel",22]
["zzzz -- Fin de liste -- zzzz",null,null,null,"zzzz -- Fin de liste -- zzzz"]
[null,null,null,null,{"$f":"A28 & \" \" &B28","v":" "}]
[null,null,null,null," "]
[null,null,null,null," "]
[null,null,null,null," "]
[null,null,null,null," "]
[]
[null,null,null,null," "]
[null,null,null,null," "]
[null,null,null,null," "]
[null,null,null,null," "]
[null,null,null,null," "]
[null,null,null,null," "]
[null,null,null,null," "]
[null,null,null,null," "]
[null,null,null,null," "]
[null,null,null,null," "]
[null,null,null,null," "]
[null,null,null,null," "]
[null,null,null,null," "]
[null,null,null,null," "]
[null,null,null,null," "]
[null,null,null,null," "]
[null,null,null,null," "]
[null,null,null,null," "]
[null,null,null,null," "]
[null,null,null,null," "]
[null,null,null,null," "]
[null,null,null,null," "]
[null,null,null,null," "]
[null,null,null,null," "]
[null,null,null,null," "]
[null,null,null,null," "]
[null,null,null,null," "]
[null,null,null,null," "]

{"sheet":"Classement début de saison","index":9,"n_rows":27,"n_cols":5,"rows_kept":27,"cut":false,"hidden":false,"merged":[]}
[]
[]
[]
[]
["Classement initial de début de saison","Nom Prénom","Licence","Ville ou Club","Classement N-1 ou dernier classement connu"]
[1,"MARTEL Bruno","121420A","CUCQ","5ème Finale Ligue R1 2017 - 2018"]
[2,"RAOULT Damien","146952F","DIVION","1er Finale CD62 R1 2016 - 2017"]
[3,"DELATTRE Christian","017030A","DIVION","4ème Finale CD62 R1 2016 - 2017"]
[4,"LEGRAND Francis","016768Y","DIVION","4ème Finale CD62 R1 2014-2015"]
[5,"LEBECQ Jean-Pierre","017263Y","CUCQ","3ème Barrage Maritime CD62  2016 - 2017"]
[6,"DEPLECHIN Roland","154167Y","CUCQ","2ème qualifications CD62 R1  2017-2018"]
[7,"MONTADOR Ludovic","103019H","WIMILLE","4ème Qualifications  CD62 R1 2017 2018"]
[8,"TIZON Alain","121424E","CUCQ","5ème Qualifications CD62 R1  2017 2018"]
[9,"MARTEL Michel","131084S","CUCQ","6ème Qualifications CD62 R1 2017-2018"]
[10,"RAMET Jacques","154166X","CUCQ","7ème Qualifications CD62 R1 2017-2018"]
[11,"TRIPLET Eddy","145206W","CUCQ","7ème Qualifications Maritime CD62 2016 2017"]
[12,"CARTIERE André","117749V","CUCQ","8ème Qualifications  CD62 R1 2017 2018"]
[13,"MEUROT Bernard","136899J","CUCQ","8ème Qualifications CD62 Maritime 2015-2016"]
[14,"FLAHAUT Ghislain","159163D","CUCQ","9ème Qualifications CD62 R1 2017-2018"]
[15,"MONTADOR Christophe","124468G","WIMILLE","10ème Qualifications CD62 R1 2017 - 2018"]
[16,"COFFRE Frédéric","154322R","CUCQ","11ème Qualifications CD62 2017-2018"]
[17,"MERLIN Christian","016887N","CUCQ","11ème Qualifications Maritime CD62 2016-2017"]
[18,"SZUGAJEW Casimir","101872E","CUCQ","13ème Qualifications Maritime CD62 2016-2017"]
[19,"VADUNTHUN Daniel","155058R","CUCQ","13ème Qualifications CD62 Maritime 2015-2016"]
[20,"BROUTIER Bertrand","101241X","CUCQ","NJ"]
[21,"SAISON Bertrand","141319J","CUCQ","NJ"]
[22,"VANTOMME Daniel","112741F","WIMILLE","NJ"]

{"sheet":"Coordonnées joueurs","index":10,"n_rows":8,"n_cols":9,"rows_kept":8,"cut":false,"hidden":false,"merged":[]}
[null,null,null,null,null,null,null,"Structure du fichier .xls"]
[null,null,null,null,null,null,null,"Licence","Licence"]
[null,null,null,null,null,null,null,"Nom","Nom"]
[null,null,null,null,null,null,null,"Prénom","Prenom"]
[null,null,null,null,null,null,null,"Club/Ville","Ville"]
[null,null,null,null,null,null,null,"Mail","Email"]
[null,null,null,null,null,null,null,"Téléphone","Téléphone"]
["Nom Prénom11","Licence11","Ville ou Club11","Email11","Téléphone11"]

{"sheet":"Feuilles de match ref","index":11,"n_rows":121,"n_cols":27,"rows_kept":121,"cut":false,"hidden":true,"merged":[]}
[]
[]
["Billard n°"]
["Bille blanche",null,null,null,null,null,null,null,null,null,null,"Bille Jaune"]
["Nom du  →\njoueur",null,null,null,null,null,null,null,null,null,null,"Nom du  →\njoueur"]
["Set 1",null,"Set 2",null,"Set 3",null,"Set 4",null,"Set 5",null,null,"Set 1",null,"Set 2",null,"Set 3",null,"Set 4",null,"Set 5"]
["Pts","cum.","Pts","cum.","Pts","cum.","Pts","cum.","Pts","cum.",null,"Pts","cum.","Pts","cum.","Pts","cum.","Pts","cum.","Pts","cum."]
[]
[]
[]
[]
[]
[]
[]
[]
[]
[]
[]
[]
[]
[]
[]
[]
[]
[]
[]
[]
[]
[]
[]
[]
[]
[]
[]
[]
[]
[]
["Signature joueur",null,null,null,null,null,null,null,null,null,null,null,null,null,null,null,null,null,null,null,"Signature joueur"]
[null,null,null,null,null,null,null,null,null,null,"Signature arbitre"]
[]
[]
[]
[]
["Billard n°",null,null,null,null,null,null,null,null,null,null,null,null,null,"Billard n°"]
["Bille blanche",null,null,null,null,null,null,"Bille Jaune",null,null,null,null,null,null,"Bille blanche",null,null,null,null,null,null,"Bille Jaune"]
["Nom du  →\njoueur",null,null,null,null,null,null,"Nom du  →\njoueur",null,null,null,null,null,null,"Nom du  →\njoueur",null,null,null,null,null,null,"Nom du  →\njoueur"]
["Set 1",null,"Set 2",null,"Set 3",null,null,"Set 1",null,"Set 2",null,"Set 3",null,null,"Set 1",null,"Set 2",null,"Set 3",null,null,"Set 1",null,"Set 2",null,"Set 3"]
["Pts","cum.","Pts","cum.","Pts","cum.",null,"Pts","cum.","Pts","cum.","Pts","cum.",null,"Pts","cum.","Pts","cum.","Pts","cum.",null,"Pts","cum.","Pts","cum.","Pts","cum."]
[]
[]
[]
[]
[]
[]
[]
[]
[]
[]
[]
[]
[]
[]
[]
[]
[]
[]
[]
[]
[]
[]
[]
[]
[]
[]
[]
[]
[]
[]
["Signature joueur",null,null,null,null,null,null,null,null,null,null,null,"Signature joueur",null,"Signature joueur",null,null,null,null,null,null,null,null,null,null,null,"Signature joueur"]
[null,null,null,null,null,null,"Signature arbitre",null,null,null,null,null,null,null,null,null,null,null,null,null,"Signature arbitre"]
[]
[]
[]
[]
["Billard n°",null,null,null,null,null,null,null,null,null,null,null,null,null,"Billard n°"]
["Bille blanche",null,null,null,null,null,null,"Bille Jaune",null,null,null,null,null,null,"Bille blanche",null,null,null,null,null,null,"Bille Jaune"]
["Nom du  →\njoueur",null,null,null,null,null,null,"Nom du  →\njoueur",null,null,null,null,null,null,"Nom du  →\njoueur",null,null,null,null,null,null,"Nom du  →\njoueur"]
["Set 1",null,null,null,null,null,null,"Set 1",null,null,null,null,null,null,"Set 1",null,null,null,null,null,null,"Set 1"]
["Pts","cum.","Pts","cum.",null,null,null,"Pts","cum.","Pts","cum.",null,null,null,"Pts","cum.","Pts","cum.",null,null,null,"Pts","cum.","Pts","cum."]
[]
[]
[]
[]
[]
[]
[]
[]
[]
[]
[]
[]
[]
[]
[]
[]
[]
[]
[]
[]
[]
[]
[]
[]
[]
[]
[]
[]
[]
[]
["Signature joueur",null,null,null,null,null,null,null,null,null,"Signature joueur",null,null,null,"Signature joueur",null,null,null,null,null,null,null,null,null,"Signature joueur"]
[null,null,null,null,null,"Signature arbitre",null,null,null,null,null,null,null,null,null,null,null,null,null,"Signature arbitre"]

{"sheet":"Etiquettes poules Ref","index":12,"n_rows":10,"n_cols":23,"rows_kept":10,"cut":false,"hidden":true,"merged":[]}
[]
[null,null,"set 1","set 2","set 3","set 4","set 5",null,null,null,"set 1","set 2","set 3","set 4","set 5",null,null,null,"set 1","set 2","set 3","set 4","set 5"]
[]
[]
[]
[null,null,"set 1","set 2","set 3",null,null,null,null,null,"set 1","set 2","set 3",null,null,null,null,null,"set 1","set 2","set 3"]
[]
[]
[]
[null,null,"set 1",null,null,null,null,null,null,null,"set 1",null,null,null,null,null,null,null,"set 1"]

{"sheet":"RefStatistiques joueurs","index":13,"n_rows":1,"n_cols":14,"rows_kept":1,"cut":false,"hidden":true,"merged":[]}
["Joueur","Adversaire","G/P","Sets gagnés","Sets perdus","Pts marqués","Pts subis","Date","Compétition","Phase","Licence J.","Clst init. J.","Licence A.","Clst init. A."]

{"sheet":"QualifsRefPoules8J","index":14,"n_rows":5,"n_cols":52,"rows_kept":5,"cut":false,"hidden":true,"merged":[]}
[null,{"$f":" TOURNOI & \" - \" & LIEU_TOURNOI","v":"T3 Qualification CD62 R1 - WIMILLE"}]
[null,{"$f":"DATE_TOURNOI","v":"2019-01-13"},null,null,null,null,null,null,null,null,null,null,null,null,null,null,null,null,null,null,null,null,null,null,null,null,null,null,null,null,null,null,null,null,null,null,null,null,null,null,null,null,null,null,null,null,null,null,null,null,null,"- Qualifications -"]
[]
[]
[null,null,null,null,null,null,null,null,null,null,null,null,null,null,null,null,null,null,null,null,null,null,null,null,null,null,null,null,null,null,null,null,null,null,null,null,null,null,null,null,null,null,null,null,null,null,null,null,null,null,null,"Reclassement qualifications"]

{"sheet":"Tours de jeu Ref","index":15,"n_rows":3,"n_cols":2,"rows_kept":3,"cut":false,"hidden":true,"merged":[]}
[null,{"$f":" TOURNOI & \" - \" & LIEU_TOURNOI","v":"T3 Qualification CD62 R1 - WIMILLE"}]
[null,{"$f":"DATE_TOURNOI","v":"2019-01-13"}]
[null,"Tours de jeu et étiquettes à imprimer pour écriture des scores"]

{"sheet":"QualifsRefPoules","index":16,"n_rows":5,"n_cols":34,"rows_kept":5,"cut":false,"hidden":true,"merged":[]}
[null,{"$f":" TOURNOI & \" - \" & LIEU_TOURNOI","v":"T3 Qualification CD62 R1 - WIMILLE"}]
[null,{"$f":"DATE_TOURNOI","v":"2019-01-13"},null,null,null,null,null,null,null,null,null,null,null,null,null,null,null,null,null,null,null,null,null,null,null,null,null,null,null,null,null,null,null,"- Qualifications -"]
[]
[]
[null,null,null,null,null,null,null,null,null,null,null,null,null,null,null,null,null,null,null,null,null,null,null,null,null,null,null,null,null,null,null,null,null,"Reclassement qualifications"]

{"sheet":"QualifsRefDoubleKO","index":17,"n_rows":8,"n_cols":16,"rows_kept":8,"cut":false,"hidden":true,"merged":[]}
[null,{"$f":" TOURNOI & \" - \" & LIEU_TOURNOI","v":"T3 Qualification CD62 R1 - WIMILLE"}]
[null,{"$f":"DATE_TOURNOI","v":"2019-01-13"},null,null,null,null,null,null,null,null,null,null,null,null,null,"- Qualifications -"]
[]
[]
[]
[]
[]
[null,null,null,null,null,null,null,null,null,null,null,null,null,null,null,"Reclassement qualifications"]

{"sheet":"PouleRef 3 Sets","index":18,"n_rows":21,"n_cols":52,"rows_kept":21,"cut":false,"hidden":true,"merged":[[2,1,3,1],[2,33,2,39],[8,1,9,1],[8,33,8,39],[15,1,16,1],[15,33,15,39]]}
[]
[]
[null,"Poule","Match 1",null,null,null,null,"Match 2",null,null,null,null,null,null,null,null,null,null,null,null,null,null,null,null,null,null,null,null,null,null,null,null,null,"Totaux",null,null,null,null,null,null,null,"Détail Pts de matchs",null,null,"Détail Pts de sets",null,"Moy. particulières"]
[null,null,"set 1","set 2","set 3","set 4","set 5","set 1","set 2","set 3","set 4","set 5",null,null,null,null,null,null,null,null,null,null,null,null,null,null,null,null,null,null,null,null,null,"Clst","Pts Match","Pts Set","Moy. Gen.","Moy. Part.","Pts marq.","Pts subis",null,"Match 1","Match 2","Bonus 1er","Match 1","Match 2","Match 1","Match 2","Calcul\n1er"]
[null,null,null,null,null,null,null,null,null,null,null,null,null,null,null,null,null,null,null,null,null,null,null,null,null,null,null,null,null,null,null,null,null,{"$f":"IF($AW5<>0,RANK($AW5,$AW5:$AW6),\"\")","v":""},{"$f":"AP5+AQ5+AR5","v":0},{"$f":"AS5+AT5","v":0},{"$f":"IF(AN5<>\"\",IF(AM5<>\"\",ROUNDDOWN(AM5/AN5,3),\"\"),\"\")","v":""},{"$f":"IF(SUM(AU5:AV5)<>0,ROUNDDOWN(MAX(AU5:AV5),3),\"\")","v":""},{"$f":"IF(SUM(C5:L5,)<>0,SUM(C5:L5),\"\")","v":""},{"$f":"IF(SUM(C6:L6)<>0,SUM(C6:L6),\"\")","v":""},null,{"$f":"IF(COUNTIF(C5:G5,DISTANCE_Q)=NB_SETS_G_Q,VAL_PT_MATCH,0)","v":0},{"$f":"IF(COUNTIF(H5:L5,DISTANCE_Q)=NB_SETS_G_Q,VAL_PT_MATCH,0)","v":0},{"$f":"IF(AH5=1,BONUS,0)","v":0},{"$f":"IF(AP5=VAL_PT_MATCH,(NB_SETS_G_Q*2)-1-COUNTIF(C6:G6,DISTANCE_Q),COUNTIF(C5:G5,DISTANCE_Q))","v":0},{"$f":"IF(AQ5=VAL_PT_MATCH,(NB_SETS_G_Q*2)-1-COUNTIF(H6:L6,DISTANCE_Q),COUNTIF(H5:L5,DISTANCE_Q))","v":0},{"$f":"IF(SUM(C6:E6,)<>0,SUM(C5:E5)/SUM(C6:E6),0)","v":0},{"$f":"IF(SUM(H6:J6)<>0,SUM(H5:J5)/SUM(H6:J6),0)","v":0},{"$f":"IF(AK5<>\"\",(SUM(AP5:AQ5)*1000000000)+(SUM(AS5:AT5)*100000000)+(ROUND(AK5*1000,0)*10000)+ROUND(AL5*1000,0),0)","v":0}]
[null,null,null,null,null,null,null,null,null,null,null,null,null,null,null,null,null,null,null,null,null,null,null,null,null,null,null,null,null,null,null,null,null,{"$f":"IF($AW6<>0,RANK($AW6,$AW5:$AW6),\"\")","v":""},{"$f":"AP6+AQ6+AR6","v":0},{"$f":"AS6+AT6","v":0},{"$f":"IF(AN6<>\"\",IF(AM6<>\"\",ROUNDDOWN(AM6/AN6,3),\"\"),\"\")","v":""},{"$f":"IF(SUM(AU6:AV6)<>0,ROUNDDOWN(MAX(AU6:AV6),3),\"\")","v":""},{"$f":"IF(SUM(C6:L6)<>0,SUM(C6:L6),\"\")","v":""},{"$f":"IF(SUM(C5:L5,)<>0,SUM(C5:L5),\"\")","v":""},null,{"$f":"IF(COUNTIF(C6:G6,DISTANCE_Q)=NB_SETS_G_Q,VAL_PT_MATCH,0)","v":0},{"$f":"IF(COUNTIF(H6:L6,DISTANCE_Q)=NB_SETS_G_Q,VAL_PT_MATCH,0)","v":0},{"$f":"IF(AH6=1,BONUS,0)","v":0},{"$f":"IF(AP6=VAL_PT_MATCH,(NB_SETS_G_Q*2)-1-COUNTIF(C5:G5,DISTANCE_Q),COUNTIF(C6:G6,DISTANCE_Q))","v":0},{"$f":"IF(AQ6=VAL_PT_MATCH,(NB_SETS_G_Q*2)-1-COUNTIF(H5:L5,DISTANCE_Q),COUNTIF(H6:L6,DISTANCE_Q))","v":0},{"$f":"IF(SUM(C5:E5,)<>0,SUM(C6:E6)/SUM(C5:E5),0)","v":0},{"$f":"IF(SUM(H5:J5,)<>0,SUM(H6:J6)/SUM(H5:J5),0)","v":0},{"$f":"IF(AK6<>\"\",(SUM(AP6:AQ6)*1000000000)+(SUM(AS6:AT6)*100000000)+(ROUND(AK6*1000,0)*10000)+ROUND(AL6*1000,0),0)","v":0}]
[]
[]
[null,"Poule","Match 1",null,null,null,null,"Match 2",null,null,null,null,"Match 3",null,null,null,null,null,null,null,null,null,null,null,null,null,null,null,null,null,null,null,null,"Totaux",null,null,null,null,null,null,null,"Détail Pts de matchs",null,null,"Détail Pts de sets",null,"Moy. particulières"]
[null,null,"set 1","set 2","set 3","set 4","set 5","set 1","set 2","set 3","set 4","set 5","set 1","set 2","set 3","set 4","set 5",null,null,null,null,null,null,null,null,null,null,null,null,null,null,null,null,"Clst","Pts Match","Pts Set","Moy. Gen.","Moy. Part.","Pts marq.","Pts subis",null,"Match 1","Match 2","Bonus 1er","Match 1","Match 2","Match 1","Match 2","Calcul\n1er"]
[null,null,null,null,null,null,null,null,null,null,null,null,null,null,null,null,null,null,null,null,null,null,null,null,null,null,null,null,null,null,null,null,null,{"$f":"IF($AW11<>0,RANK($AW11,$AW11:$AW13),\"\")","v":""},{"$f":"IF(TYPE_QUALIF=\"Poules 4J C\",AP11+AQ11+AR11+VAL_PT_MATCH,AP11+AQ11+AR11)","v":0},{"$f":"IF(TYPE_QUALIF=\"Poules 4J C\",AS11+AT11+(NB_SETS_G_Q*2-1),AS11+AT11)","v":0},{"$f":"IF(AN11<>\"\",IF(AM11<>\"\",ROUNDDOWN(AM11/AN11,3),\"\"),\"\")","v":""},{"$f":"IF(SUM(AU11:AV11)<>0,ROUNDDOWN(MAX(AU11:AV11),3),\"\")","v":""},{"$f":"IF(SUM(H11:L11,M11:Q11)<>0,SUM(H11:L11,M11:Q11),\"\")","v":""},{"$f":"IF(SUM(H13:L13,M12:Q12)<>0,SUM(H13:L13,M12:Q12),\"\")","v":""},null,{"$f":"IF(COUNTIF(H11:L11,DISTANCE_Q)=NB_SETS_G_Q,VAL_PT_MATCH,0)","v":0},{"$f":"IF(COUNTIF(M11:Q11,DISTANCE_Q)=NB_SETS_G_Q,VAL_PT_MATCH,0)","v":0},{"$f":"IF(AH11=1,BONUS,0)","v":0},{"$f":"IF(AP11=VAL_PT_MATCH,(NB_SETS_G_Q*2)-1-COUNTIF(H13:L13,DISTANCE_Q),COUNTIF(H11:L11,DISTANCE_Q))","v":0},{"$f":"IF(AQ11=VAL_PT_MATCH,(NB_SETS_G_Q*2)-1-COUNTIF(M12:Q12,DISTANCE_Q),COUNTIF(M11:Q11,DISTANCE_Q))","v":0},{"$f":"IF(SUM(H13:L13)<>0,SUM(H11:L11)/SUM(H13:L13),0)","v":0},{"$f":"IF(SUM(M12:Q12,)<>0,SUM(M11:Q11)/SUM(M12:Q12),0)","v":0},{"$f":"IF(AK11<>\"\",(SUM(AP11:AQ11)*1000000000)+(SUM(AS11:AT11)*100000000)+(ROUND(AK11*1000,0)*10000)+ROUND(AL11*1000,0),0)","v":0}]
[null,null,null,null,null,null,null,null,null,null,null,null,null,null,null,null,null,null,null,null,null,null,null,null,null,null,null,null,null,null,null,null,null,{"$f":"IF($AW12<>0,RANK($AW12,$AW11:$AW13),\"\")","v":""},{"$f":"IF(TYPE_QUALIF=\"Poules 4J C\",AP12+AQ12+AR12+VAL_PT_MATCH,AP12+AQ12+AR12)","v":0},{"$f":"IF(TYPE_QUALIF=\"Poules 4J C\",AS12+AT12+(NB_SETS_G_Q*2-1),AS12+AT12)","v":0},{"$f":"IF(AN12<>\"\",IF(AM12<>\"\",ROUNDDOWN(AM12/AN12,3),\"\"),\"\")","v":""},{"$f":"IF(SUM(AU12:AV12)<>0,ROUNDDOWN(MAX(AU12:AV12),3),\"\")","v":""},{"$f":"IF(SUM(C12:E12,M12:Q12)<>0,SUM(C12:E12,M12:Q12),\"\")","v":""},{"$f":"IF(SUM(C13:E13,M11:Q11)<>0,SUM(C13:E13,M11:Q11),\"\")","v":""},null,{"$f":"IF(COUNTIF(C12:G12,DISTANCE_Q)=NB_SETS_G_Q,VAL_PT_MATCH,0)","v":0},{"$f":"IF(COUNTIF(M12:Q12,DISTANCE_Q)=NB_SETS_G_Q,VAL_PT_MATCH,0)","v":0},{"$f":"IF(AH12=1,BONUS,0)","v":0},{"$f":"IF(AP12=VAL_PT_MATCH,(NB_SETS_G_Q*2)-1-COUNTIF(C13:G13,DISTANCE_Q),COUNTIF(C12:G12,DISTANCE_Q))","v":0},{"$f":"IF(AQ12=VAL_PT_MATCH,(NB_SETS_G_Q*2)-1-COUNTIF(M11:Q11,DISTANCE_Q),COUNTIF(M12:Q12,DISTANCE_Q))","v":0},{"$f":"IF(SUM(C13:G13,)<>0,SUM(C12:G12)/SUM(C13:G13),0)","v":0},{"$f":"IF(SUM(M11:Q11,)<>0,SUM(M12:Q12)/SUM(M11:Q11),0)","v":0},{"$f":"IF(AK12<>\"\",(SUM(AP12:AQ12)*1000000000)+(SUM(AS12:AT12)*100000000)+(ROUND(AK12*1000,0)*10000)+ROUND(AL12*1000,0),0)","v":0}]
[null,null,null,null,null,null,null,null,null,null,null,null,null,null,null,null,null,null,null,null,null,null,null,null,null,null,null,null,null,null,null,null,null,{"$f":"IF($AW13<>0,RANK($AW13,$AW11:$AW13),\"\")","v":""},{"$f":"IF(TYPE_QUALIF=\"Poules 4J C\",AP13+AQ13+AR13+VAL_PT_MATCH,AP13+AQ13+AR13)","v":0},{"$f":"IF(TYPE_QUALIF=\"Poules 4J C\",AS13+AT13+(NB_SETS_G_Q*2-1),AS13+AT13)","v":0},{"$f":"IF(AN13<>\"\",IF(AM13<>\"\",ROUNDDOWN(AM13/AN13,3),\"\"),\"\")","v":""},{"$f":"IF(SUM(AU13:AV13)<>0,ROUNDDOWN(MAX(AU13:AV13),3),\"\")","v":""},{"$f":"IF(SUM(C13:E13,H13:L13)<>0,SUM(C13:E13,H13:L13),\"\")","v":""},{"$f":"IF(SUM(C12:E12,H11:L11)<>0,SUM(C12:E12,H11:L11),\"\")","v":""},null,{"$f":"IF(COUNTIF(C13:G13,DISTANCE_Q)=NB_SETS_G_Q,VAL_PT_MATCH,0)","v":0},{"$f":"IF(COUNTIF(H13:L13,DISTANCE_Q)=NB_SETS_G_Q,VAL_PT_MATCH,0)","v":0},{"$f":"IF(AH13=1,BONUS,0)","v":0},{"$f":"IF(AP13=VAL_PT_MATCH,(NB_SETS_G_Q*2)-1-COUNTIF(C12:G12,DISTANCE_Q),COUNTIF(C13:G13,DISTANCE_Q))","v":0},{"$f":"IF(AQ13=VAL_PT_MATCH,(NB_SETS_G_Q*2)-1-COUNTIF(H11:L11,DISTANCE_Q),COUNTIF(H13:L13,DISTANCE_Q))","v":0},{"$f":"IF(SUM(C12:G12,)<>0,SUM(C13:G13)/SUM(C12:G12),0)","v":0},{"$f":"IF(SUM(H11:L11)<>0,SUM(H13:L13)/SUM(H11:L11),0)","v":0},{"$f":"IF(AK13<>\"\",(SUM(AP13:AQ13)*1000000000)+(SUM(AS13:AT13)*100000000)+(ROUND(AK13*1000,0)*10000)+ROUND(AL13*1000,0),0)","v":0}]
[]
[]
[null,"Poule","Match 1",null,null,null,null,"Match 2",null,null,null,null,"Match 3",null,null,null,null,"Match 4",null,null,null,null,"Match 5",null,null,null,null,"Match 6",null,null,null,null,null,"Totaux",null,null,null,null,null,null,null,"Détail Pts de matchs",null,null,null,"Détail Pts de sets",null,null,"Moyennes particulières"]
[null,null,"set 1","set 2","set 3","set 4","set 5","set 1","set 2","set 3","set 4","set 5","set 1","set 2","set 3","set 4","set 5","set 1","set 2","set 3","set 4","set 5","set 1","set 2","set 3","set 4","set 5","set 1","set 2","set 3","set 4","set 5",null,"Clst","Pts Match","Pts Set","Moy. Gen.","Moy. Part.","Pts marq.","Pts subis",null,"Match 1","Match 2","Match 3","Bonus 1er","Match 1","Match 2","Match 3","Match 1","Match 2","Match 3","Calcul\n1er"]
[null,null,null,null,null,null,null,null,null,null,null,null,null,null,null,null,null,null,null,null,null,null,null,null,null,null,null,null,null,null,null,null,null,{"$f":"IF($AZ18<>0,RANK($AZ18,$AZ18:$AZ21),\"\")","v":""},{"$f":"AP18+AQ18+AR18+AS18","v":0},{"$f":"AT18+AU18+AV18","v":0},{"$f":"IF(AN18<>\"\",IF(AM18<>\"\",ROUNDDOWN(AM18/AN18,3),\"\"),\"\")","v":""},{"$f":"IF(SUM(AW18:AY18)<>0,ROUNDDOWN(MAX(AW18:AY18),3),\"\")","v":""},{"$f":"IF(SUM(H18:L18,R18:V18,AB18:AF18)<>0,SUM(H18:L18,R18:V18,AB18:AF18),\"\")","v":""},{"$f":"IF(SUM(H21:L21,R19:V19,AB20:AF20)<>0,SUM(H21:L21,R19:V19,AB20:AF20),\"\")","v":""},null,{"$f":"IF(COUNTIF(H18:L18,DISTANCE_Q)=NB_SETS_G_Q,VAL_PT_MATCH,0)","v":0},{"$f":"IF(COUNTIF(R18:V18,DISTANCE_Q)=NB_SETS_G_Q,VAL_PT_MATCH,0)","v":0},{"$f":"IF(COUNTIF(AB18:AF18,DISTANCE_Q)=NB_SETS_G_Q,VAL_PT_MATCH,0)","v":0},{"$f":"IF(AH18=1,BONUS,0)","v":0},{"$f":"IF(AP18=VAL_PT_MATCH,(NB_SETS_G_Q*2)-1-COUNTIF(H21:L21,DISTANCE_Q),COUNTIF(H18:L18,DISTANCE_Q))","v":0},{"$f":"IF(AQ18=VAL_PT_MATCH,(NB_SETS_G_Q*2)-1-COUNTIF(R19:V19,DISTANCE_Q),COUNTIF(R18:V18,DISTANCE_Q))","v":0},{"$f":"IF(AR18=VAL_PT_MATCH,(NB_SETS_G_Q*2)-1-COUNTIF(AB20:AF20,DISTANCE_Q),COUNTIF(AB18:AF18,DISTANCE_Q))","v":0},{"$f":"IF(SUM(H21:L21,)<>0,SUM(H18:L18)/SUM(H21:L21),0)","v":0},{"$f":"IF(SUM(R19:V19,)<>0,SUM(R18:V18)/SUM(R19:V19),0)","v":0},{"$f":"IF(SUM(AB20:AF20,)<>0,SUM(AB18:AF18)/SUM(AB20:AF20),0)","v":0},{"$f":"IF(AK18<>\"\",(SUM(AP18:AR18)*1000000000)+(SUM(AT18:AV18)*100000000)+(ROUND(AK18*1000,0)*10000)+ROUND(AL18*1000,0),0)","v":0}]
[null,null,null,null,null,null,null,null,null,null,null,null,null,null,null,null,null,null,null,null,null,null,null,null,null,null,null,null,null,null,null,null,null,{"$f":"IF($AZ19<>0,RANK($AZ19,$AZ18:$AZ21),\"\")","v":""},{"$f":"AP19+AQ19+AR19+AS19","v":0},{"$f":"AT19+AU19+AV19","v":0},{"$f":"IF(AN19<>\"\",IF(AM19<>\"\",ROUNDDOWN(AM19/AN19,3),\"\"),\"\")","v":""},{"$f":"IF(SUM(AW19:AY19)<>0,ROUNDDOWN(MAX(AW19:AY19),3),\"\")","v":""},{"$f":"IF(SUM(C19:G19,R19:V19,W19:AA19)<>0,SUM(C19:G19,R19:V19,W19:AA19),\"\")","v":""},{"$f":"IF(SUM(C20:G20,R18:V18,W21:AA21)<>0,SUM(C20:G20,R18:V18,W21:AA21),\"\")","v":""},null,{"$f":"IF(COUNTIF(C19:G19,DISTANCE_Q)=NB_SETS_G_Q,VAL_PT_MATCH,0)","v":0},{"$f":"IF(COUNTIF(R19:V19,DISTANCE_Q)=NB_SETS_G_Q,VAL_PT_MATCH,0)","v":0},{"$f":"IF(COUNTIF(W19:AA19,DISTANCE_Q)=NB_SETS_G_Q,VAL_PT_MATCH,0)","v":0},{"$f":"IF(AH19=1,BONUS,0)","v":0},{"$f":"IF(AP19=VAL_PT_MATCH,(NB_SETS_G_Q*2)-1-COUNTIF(C20:G20,DISTANCE_Q),COUNTIF(C19:G19,DISTANCE_Q))","v":0},{"$f":"IF(AQ19=VAL_PT_MATCH,(NB_SETS_G_Q*2)-1-COUNTIF(R18:V18,DISTANCE_Q),COUNTIF(R19:V19,DISTANCE_Q))","v":0},{"$f":"IF(AR19=VAL_PT_MATCH,(NB_SETS_G_Q*2)-1-COUNTIF(W21:AA21,DISTANCE_Q),COUNTIF(W19:AA19,DISTANCE_Q))","v":0},{"$f":"IF(SUM(C20:G20,)<>0,SUM(C19:G19)/SUM(C20:G20),0)","v":0},{"$f":"IF(SUM(R18:V18,)<>0,SUM(R19:V19)/SUM(R18:V18),0)","v":0},{"$f":"IF(SUM(W21:AA21,)<>0,SUM(W19:AA19)/SUM(W21:AA21),0)","v":0},{"$f":"IF(AK19<>\"\",(SUM(AP19:AR19)*1000000000)+(SUM(AT19:AV19)*100000000)+(ROUND(AK19*1000,0)*10000)+ROUND(AL19*1000,0),0)","v":0}]
[null,null,null,null,null,null,null,null,null,null,null,null,null,null,null,null,null,null,null,null,null,null,null,null,null,null,null,null,null,null,null,null,null,{"$f":"IF($AZ20<>0,RANK($AZ20,$AZ18:$AZ21),\"\")","v":""},{"$f":"AP20+AQ20+AR20+AS20","v":0},{"$f":"AT20+AU20+AV20","v":0},{"$f":"IF(AN20<>\"\",IF(AM20<>\"\",ROUNDDOWN(AM20/AN20,3),\"\"),\"\")","v":""},{"$f":"IF(SUM(AW20:AY20)<>0,ROUNDDOWN(MAX(AW20:AY20),3),\"\")","v":""},{"$f":"IF(SUM(C20:G20,M20:Q20,AB20:AF20)<>0,SUM(C20:G20,M20:Q20,AB20:AF20),\"\")","v":""},{"$f":"IF(SUM(C19:G19,M21:Q21,AB18:AF18)<>0,SUM(C19:G19,M21:Q21,AB18:AF18),\"\")","v":""},null,{"$f":"IF(COUNTIF(C20:G20,DISTANCE_Q)=NB_SETS_G_Q,VAL_PT_MATCH,0)","v":0},{"$f":"IF(COUNTIF(M20:Q20,DISTANCE_Q)=NB_SETS_G_Q,VAL_PT_MATCH,0)","v":0},{"$f":"IF(COUNTIF(AB20:AF20,DISTANCE_Q)=NB_SETS_G_Q,VAL_PT_MATCH,0)","v":0},{"$f":"IF(AH20=1,BONUS,0)","v":0},{"$f":"IF(AP20=VAL_PT_MATCH,(NB_SETS_G_Q*2)-1-COUNTIF(C19:G19,DISTANCE_Q),COUNTIF(C20:G20,DISTANCE_Q))","v":0},{"$f":"IF(AQ20=VAL_PT_MATCH,(NB_SETS_G_Q*2)-1-COUNTIF(M21:Q21,DISTANCE_Q),COUNTIF(M20:Q20,DISTANCE_Q))","v":0},{"$f":"IF(AR20=VAL_PT_MATCH,(NB_SETS_G_Q*2)-1-COUNTIF(AB18:AF18,DISTANCE_Q),COUNTIF(AB20:AF20,DISTANCE_Q))","v":0},{"$f":"IF(SUM(C19:G19,)<>0,SUM(C20:G20)/SUM(C19:G19),0)","v":0},{"$f":"IF(SUM(M21:Q21,)<>0,SUM(M20:Q20)/SUM(M21:Q21),0)","v":0},{"$f":"IF(SUM(AB18:AF18,)<>0,SUM(AB20:AF20)/SUM(AB18:AF18),0)","v":0},{"$f":"IF(AK20<>\"\",(SUM(AP20:AR20)*1000000000)+(SUM(AT20:AV20)*100000000)+(ROUND(AK20*1000,0)*10000)+ROUND(AL20*1000,0),0)","v":0}]
[null,null,null,null,null,null,null,null,null,null,null,null,null,null,null,null,null,null,null,null,null,null,null,null,null,null,null,null,null,null,null,null,null,{"$f":"IF($AZ21<>0,RANK($AZ21,$AZ18:$AZ21),\"\")","v":""},{"$f":"AP21+AQ21+AR21+AS21","v":0},{"$f":"AT21+AU21+AV21","v":0},{"$f":"IF(AN21<>\"\",IF(AM21<>\"\",ROUNDDOWN(AM21/AN21,3),\"\"),\"\")","v":""},{"$f":"IF(SUM(AW21:AY21)<>0,ROUNDDOWN(MAX(AW21:AY21),3),\"\")","v":""},{"$f":"IF(SUM(H21:L21,M21:Q21,W21:AA21)<>0,SUM(H21:L21,M21:Q21,W21:AA21),\"\")","v":""},{"$f":"IF(SUM(H18:L18,M20:Q20,W19:AA19)<>0,SUM(H18:L18,M20:Q20,W19:AA19),\"\")","v":""},null,{"$f":"IF(COUNTIF(H21:L21,DISTANCE_Q)=NB_SETS_G_Q,VAL_PT_MATCH,0)","v":0},{"$f":"IF(COUNTIF(M21:Q21,DISTANCE_Q)=NB_SETS_G_Q,VAL_PT_MATCH,0)","v":0},{"$f":"IF(COUNTIF(W21:AA21,DISTANCE_Q)=NB_SETS_G_Q,VAL_PT_MATCH,0)","v":0},{"$f":"IF(AH21=1,BONUS,0)","v":0},{"$f":"IF(AP21=VAL_PT_MATCH,(NB_SETS_G_Q*2)-1-COUNTIF(H18:L18,DISTANCE_Q),COUNTIF(H21:L21,DISTANCE_Q))","v":0},{"$f":"IF(AQ21=VAL_PT_MATCH,(NB_SETS_G_Q*2)-1-COUNTIF(M20:Q20,DISTANCE_Q),COUNTIF(M21:Q21,DISTANCE_Q))","v":0},{"$f":"IF(AR21=VAL_PT_MATCH,(NB_SETS_G_Q*2)-1-COUNTIF(W19:AA19,DISTANCE_Q),COUNTIF(W21:AA21,DISTANCE_Q))","v":0},{"$f":"IF(SUM(H18:L18,)<>0,SUM(H21:L21)/SUM(H18:L18),0)","v":0},{"$f":"IF(SUM(M20:Q20,)<>0,SUM(M21:Q21)/SUM(M20:Q20),0)","v":0},{"$f":"IF(SUM(W19:AA19)<>0,SUM(W21:AA21)/SUM(W19:AA19),0)","v":0},{"$f":"IF(AK21<>\"\",(SUM(AP21:AR21)*1000000000)+(SUM(AT21:AV21)*100000000)+(ROUND(AK21*1000,0)*10000)+ROUND(AL21*1000,0),0)","v":0}]

{"sheet":"DoubleKORef","index":19,"n_rows":57,"n_cols":22,"rows_kept":57,"cut":false,"hidden":true,"merged":[]}
[]
[]
[]
[null,"GROUPE"]
[null,"Match 1 (1 - 8)",null,null,null,null,null,null,"Match 7 (Gagnants M1 M2)"]
[null,null,null,null,null,null,null,null,{"$f":"IF(COUNTIF(C6:C6,DISTANCE_Q)=NB_SETS_G_Q,B6,IF(COUNTIF(C7:C7,DISTANCE_Q)=NB_SETS_G_Q,B7,\"\"))","v":""},null,{"$f":"IF(J6=DISTANCE_Q,\"Qualifié\",\"\")","v":""}]
[null,null,null,null,null,null,null,null,{"$f":"IF(COUNTIF(C10:C10,DISTANCE_Q)=NB_SETS_G_Q,B10,IF(COUNTIF(C11:C11,DISTANCE_Q)=NB_SETS_G_Q,B11,\"\"))","v":""},null,{"$f":"IF(J7=DISTANCE_Q,\"Qualifié\",\"\")","v":""}]
[]
[null,"Match 2 (4 - 5)",null,null,null,null,null,null,"Match 5 (Perdants M1 M2)",null,null,null,null,null,null,"Match 9 (Perdant M7 Gagnant M6)"]
[null,null,null,null,null,null,null,null,{"$f":"IF(COUNTIF(C6:C6,DISTANCE_Q)=NB_SETS_G_Q,B7,IF(COUNTIF(C7:C7,DISTANCE_Q)=NB_SETS_G_Q,B6,\"\"))","v":""},null,{"$f":"IF(J11=DISTANCE_Q,\"Eliminé\",\"\")","v":""},null,null,null,null,{"$f":"IF(COUNTIF(J6:J6,DISTANCE_Q)=NB_SETS_G_Q,I7,IF(COUNTIF(J7:J7,DISTANCE_Q)=NB_SETS_G_Q,I6,\"\"))","v":""},null,{"$f":"IF(Q10=DISTANCE_Q,\"Qualifié\",IF(Q11=DISTANCE_Q,\"Eliminé\",\"\"))","v":""}]
[null,null,null,null,null,null,null,null,{"$f":"IF(COUNTIF(C10:C10,DISTANCE_Q)=NB_SETS_G_Q,B11,IF(COUNTIF(C11:C11,DISTANCE_Q)=NB_SETS_G_Q,B10,\"\"))","v":""},null,{"$f":"IF(J10=DISTANCE_Q,\"Eliminé\",\"\")","v":""},null,null,null,null,{"$f":"IF(COUNTIF(J14:J14,DISTANCE_Q)=NB_SETS_G_Q,I14,IF(COUNTIF(J15:J15,DISTANCE_Q)=NB_SETS_G_Q,I15,\"\"))","v":""},null,{"$f":"IF(Q11=DISTANCE_Q,\"Qualifié\",IF(Q10=DISTANCE_Q,\"Eliminé\",\"\"))","v":""}]
[]
[null,"Match 3 (3 - 6)",null,null,null,null,null,null,"Match 6 (Perdants M3 M4)",null,null,null,null,null,null,"Match 10 (Gagnant M5 Perdant M8)"]
[null,null,null,null,null,null,null,null,{"$f":"IF(COUNTIF(C14:C14,DISTANCE_Q)=NB_SETS_G_Q,B15,IF(COUNTIF(C15:C15,DISTANCE_Q)=NB_SETS_G_Q,B14,\"\"))","v":""},null,{"$f":"IF(J15=DISTANCE_Q,\"Eliminé\",\"\")","v":""},null,null,null,null,{"$f":"IF(COUNTIF(J10:J10,DISTANCE_Q)=NB_SETS_G_Q,I10,IF(COUNTIF(J11:J11,DISTANCE_Q)=NB_SETS_G_Q,I11,\"\"))","v":""},null,{"$f":"IF(Q14=DISTANCE_Q,\"Qualifié\",IF(Q15=DISTANCE_Q,\"Eliminé\",\"\"))","v":""}]
[null,null,null,null,null,null,null,null,{"$f":"IF(COUNTIF(C18:C18,DISTANCE_Q)=NB_SETS_G_Q,B19,IF(COUNTIF(C19:C19,DISTANCE_Q)=NB_SETS_G_Q,B18,\"\"))","v":""},null,{"$f":"IF(J14=DISTANCE_Q,\"Eliminé\",\"\")","v":""},null,null,null,null,{"$f":"IF(COUNTIF(J18:J18,DISTANCE_Q)=NB_SETS_G_Q,I19,IF(COUNTIF(J19:J19,DISTANCE_Q)=NB_SETS_G_Q,I18,\"\"))","v":""},null,{"$f":"IF(Q15=DISTANCE_Q,\"Qualifié\",IF(Q14=DISTANCE_Q,\"Eliminé\",\"\"))","v":""}]
[]
[null,"Match 4 (2 - 7)",null,null,null,null,null,null,"Match 8 (Gagnants M3 M4)"]
[null,null,null,null,null,null,null,null,{"$f":"IF(COUNTIF(C14:C14,DISTANCE_Q)=NB_SETS_G_Q,B14,IF(COUNTIF(C15:C15,DISTANCE_Q)=NB_SETS_G_Q,B15,\"\"))","v":""},null,{"$f":"IF(J18=DISTANCE_Q,\"Qualifié\",\"\")","v":""}]
[null,null,null,null,null,null,null,null,{"$f":"IF(COUNTIF(C18:C18,DISTANCE_Q)=NB_SETS_G_Q,B18,IF(COUNTIF(C19:C19,DISTANCE_Q)=NB_SETS_G_Q,B19,\"\"))","v":""},null,{"$f":"IF(J19=DISTANCE_Q,\"Qualifié\",\"\")","v":""}]
[]
[]
[]
[null,"GROUPE"]
[null,"Match 1 (1 - 8)",null,null,null,null,null,null,"Match 7 (Gagnants M1 M2)"]
[null,null,null,null,null,null,null,null,{"$f":"IF(COUNTIF(C25:E25,DISTANCE_Q)=NB_SETS_G_Q,B25,IF(COUNTIF(C26:E26,DISTANCE_Q)=NB_SETS_G_Q,B26,\"\"))","v":""},null,null,null,{"$f":"IF(COUNTIF(J25:L25,DISTANCE_Q)=NB_SETS_G_Q,\"Qualifié\",\"\")","v":""}]
[null,null,null,null,null,null,null,null,{"$f":"IF(COUNTIF(C29:E29,DISTANCE_Q)=NB_SETS_G_Q,B29,IF(COUNTIF(C30:E30,DISTANCE_Q)=NB_SETS_G_Q,B30,\"\"))","v":""},null,null,null,{"$f":"IF(COUNTIF(J26:L26,DISTANCE_Q)=NB_SETS_G_Q,\"Qualifié\",\"\")","v":""}]
[]
[null,"Match 2 (4 - 5)",null,null,null,null,null,null,"Match 5 (Perdants M1 M2)",null,null,null,null,null,null,"Match 9 (Perdant M7 Gagnant M6)"]
[null,null,null,null,null,null,null,null,{"$f":"IF(COUNTIF(C25:E25,DISTANCE_Q)=NB_SETS_G_Q,B26,IF(COUNTIF(C26:E26,DISTANCE_Q)=NB_SETS_G_Q,B25,\"\"))","v":""},null,null,null,{"$f":"IF(COUNTIF(J30:L30,DISTANCE_Q)=NB_SETS_G_Q,\"Eliminé\",\"\")","v":""},null,null,{"$f":"IF(COUNTIF(J25:L25,DISTANCE_Q)=NB_SETS_G_Q,I26,IF(COUNTIF(J26:L26,DISTANCE_Q)=NB_SETS_G_Q,I25,\"\"))","v":""},null,null,null,{"$f":"IF(COUNTIF(Q29:S29,DISTANCE_Q)=NB_SETS_G_Q,\"Qualifié\",IF(COUNTIF(Q30:S30,DISTANCE_Q)=NB_SETS_G_Q,\"Eliminé\",\"\"))","v":""}]
[null,null,null,null,null,null,null,null,{"$f":"IF(COUNTIF(C29:E29,DISTANCE_Q)=NB_SETS_G_Q,B30,IF(COUNTIF(C30:E30,DISTANCE_Q)=NB_SETS_G_Q,B29,\"\"))","v":""},null,null,null,{"$f":"IF(COUNTIF(J29:L29,DISTANCE_Q)=NB_SETS_G_Q,\"Eliminé\",\"\")","v":""},null,null,{"$f":"IF(COUNTIF(J33:L33,DISTANCE_Q)=NB_SETS_G_Q,I33,IF(COUNTIF(J34:L34,DISTANCE_Q)=NB_SETS_G_Q,I34,\"\"))","v":""},null,null,null,{"$f":"IF(COUNTIF(Q30:S30,DISTANCE_Q)=NB_SETS_G_Q,\"Qualifié\",IF(COUNTIF(Q29:S29,DISTANCE_Q)=NB_SETS_G_Q,\"Eliminé\",\"\"))","v":""}]
[]
[null,"Match 3 (3 - 6)",null,null,null,null,null,null,"Match 6 (Perdants M3 M4)",null,null,null,null,null,null,"Match 10 (Gagnant M5 Perdant M8)"]
[null,null,null,null,null,null,null,null,{"$f":"IF(COUNTIF(C33:E33,DISTANCE_Q)=NB_SETS_G_Q,B34,IF(COUNTIF(C34:E34,DISTANCE_Q)=NB_SETS_G_Q,B33,\"\"))","v":""},null,null,null,{"$f":"IF(COUNTIF(J34:L34,DISTANCE_Q)=NB_SETS_G_Q,\"Eliminé\",\"\")","v":""},null,null,{"$f":"IF(COUNTIF(J29:L29,DISTANCE_Q)=NB_SETS_G_Q,I29,IF(COUNTIF(J30:L30,DISTANCE_Q)=NB_SETS_G_Q,I30,\"\"))","v":""},null,null,null,{"$f":"IF(COUNTIF(Q33:S33,DISTANCE_Q)=NB_SETS_G_Q,\"Qualifié\",IF(COUNTIF(Q34:S34,DISTANCE_Q)=NB_SETS_G_Q,\"Eliminé\",\"\"))","v":""}]
[null,null,null,null,null,null,null,null,{"$f":"IF(COUNTIF(C37:E37,DISTANCE_Q)=NB_SETS_G_Q,B38,IF(COUNTIF(C38:E38,DISTANCE_Q)=NB_SETS_G_Q,B37,\"\"))","v":""},null,null,null,{"$f":"IF(COUNTIF(J33:L33,DISTANCE_Q)=NB_SETS_G_Q,\"Eliminé\",\"\")","v":""},null,null,{"$f":"IF(COUNTIF(J37:L37,DISTANCE_Q)=NB_SETS_G_Q,I38,IF(COUNTIF(J38:L38,DISTANCE_Q)=NB_SETS_G_Q,I37,\"\"))","v":""},null,null,null,{"$f":"IF(COUNTIF(Q34:S34,DISTANCE_Q)=NB_SETS_G_Q,\"Qualifié\",IF(COUNTIF(Q33:S33,DISTANCE_Q)=NB_SETS_G_Q,\"Eliminé\",\"\"))","v":""}]
[]
[null,"Match 4 (2 - 7)",null,null,null,null,null,null,"Match 8 (Gagnants M3 M4)"]
[null,null,null,null,null,null,null,null,{"$f":"IF(COUNTIF(C33:E33,DISTANCE_Q)=NB_SETS_G_Q,B33,IF(COUNTIF(C34:E34,DISTANCE_Q)=NB_SETS_G_Q,B34,\"\"))","v":""},null,null,null,{"$f":"IF(COUNTIF(J37:L37,DISTANCE_Q)=NB_SETS_G_Q,\"Qualifié\",\"\")","v":""}]
[null,null,null,null,null,null,null,null,{"$f":"IF(COUNTIF(C37:E37,DISTANCE_Q)=NB_SETS_G_Q,B37,IF(COUNTIF(C38:E38,DISTANCE_Q)=NB_SETS_G_Q,B38,\"\"))","v":""},null,null,null,{"$f":"IF(COUNTIF(J38:L38,DISTANCE_Q)=NB_SETS_G_Q,\"Qualifié\",\"\")","v":""}]
[]
[]
[]
[null,"GROUPE"]
[null,"Match 1 (1 - 8)",null,null,null,null,null,null,"Match 7 (Gagnants M1 M2)"]
[null,null,null,null,null,null,null,null,{"$f":"IF(COUNTIF(C44:G44,DISTANCE_Q)=NB_SETS_G_Q,B44,IF(COUNTIF(C45:G45,DISTANCE_Q)=NB_SETS_G_Q,B45,\"\"))","v":""},null,null,null,null,null,{"$f":"IF(COUNTIF(J44:N44,DISTANCE_Q)=NB_SETS_G_Q,\"Qualifié\",\"\")","v":""}]
[null,null,null,null,null,null,null,null,{"$f":"IF(COUNTIF(C48:G48,DISTANCE_Q)=NB_SETS_G_Q,B48,IF(COUNTIF(C49:G49,DISTANCE_Q)=NB_SETS_G_Q,B49,\"\"))","v":""},null,null,null,null,null,{"$f":"IF(COUNTIF(J45:N45,DISTANCE_Q)=NB_SETS_G_Q,\"Qualifié\",\"\")","v":""}]
[]
[null,"Match 2 (4 - 5)",null,null,null,null,null,null,"Match 5 (Perdants M1 M2)",null,null,null,null,null,null,"Match 9 (Perdant M7 Gagnant M6)"]
[null,null,null,null,null,null,null,null,{"$f":"IF(COUNTIF(C44:G44,DISTANCE_Q)=NB_SETS_G_Q,B45,IF(COUNTIF(C45:G45,DISTANCE_Q)=NB_SETS_G_Q,B44,\"\"))","v":""},null,null,null,null,null,{"$f":"IF(COUNTIF(J49:N49,DISTANCE_Q)=NB_SETS_G_Q,\"Eliminé\",\"\")","v":""},{"$f":"IF(COUNTIF(J44:N44,DISTANCE_Q)=NB_SETS_G_Q,I45,IF(COUNTIF(J45:N45,DISTANCE_Q)=NB_SETS_G_Q,I44,\"\"))","v":""},null,null,null,null,null,{"$f":"IF(COUNTIF(Q48:U48,DISTANCE_Q)=NB_SETS_G_Q,\"Qualifié\",IF(COUNTIF(Q49:U49,DISTANCE_Q)=NB_SETS_G_Q,\"Eliminé\",\"\"))","v":""}]
[null,null,null,null,null,null,null,null,{"$f":"IF(COUNTIF(C48:G48,DISTANCE_Q)=NB_SETS_G_Q,B49,IF(COUNTIF(C49:G49,DISTANCE_Q)=NB_SETS_G_Q,B48,\"\"))","v":""},null,null,null,null,null,{"$f":"IF(COUNTIF(J48:N48,DISTANCE_Q)=NB_SETS_G_Q,\"Eliminé\",\"\")","v":""},{"$f":"IF(COUNTIF(J52:N52,DISTANCE_Q)=NB_SETS_G_Q,I52,IF(COUNTIF(J53:N53,DISTANCE_Q)=NB_SETS_G_Q,I53,\"\"))","v":""},null,null,null,null,null,{"$f":"IF(COUNTIF(Q49:U49,DISTANCE_Q)=NB_SETS_G_Q,\"Qualifié\",IF(COUNTIF(Q48:U48,DISTANCE_Q)=NB_SETS_G_Q,\"Eliminé\",\"\"))","v":""}]
[]
[null,"Match 3 (3 - 6)",null,null,null,null,null,null,"Match 6 (Perdants M3 M4)",null,null,null,null,null,null,"Match 10 (Gagnant M5 Perdant M8)"]
[null,null,null,null,null,null,null,null,{"$f":"IF(COUNTIF(C52:G52,DISTANCE_Q)=NB_SETS_G_Q,B53,IF(COUNTIF(C53:G53,DISTANCE_Q)=NB_SETS_G_Q,B52,\"\"))","v":""},null,null,null,null,null,{"$f":"IF(COUNTIF(J53:N53,DISTANCE_Q)=NB_SETS_G_Q,\"Eliminé\",\"\")","v":""},{"$f":"IF(COUNTIF(J48:N48,DISTANCE_Q)=NB_SETS_G_Q,I48,IF(COUNTIF(J49:N49,DISTANCE_Q)=NB_SETS_G_Q,I49,\"\"))","v":""},null,null,null,null,null,{"$f":"IF(COUNTIF(Q52:U52,DISTANCE_Q)=NB_SETS_G_Q,\"Qualifié\",IF(COUNTIF(Q53:U53,DISTANCE_Q)=NB_SETS_G_Q,\"Eliminé\",\"\"))","v":""}]
[null,null,null,null,null,null,null,null,{"$f":"IF(COUNTIF(C56:G56,DISTANCE_Q)=NB_SETS_G_Q,B57,IF(COUNTIF(C57:G57,DISTANCE_Q)=NB_SETS_G_Q,B56,\"\"))","v":""},null,null,null,null,null,{"$f":"IF(COUNTIF(J52:N52,DISTANCE_Q)=NB_SETS_G_Q,\"Eliminé\",\"\")","v":""},{"$f":"IF(COUNTIF(J56:N56,DISTANCE_Q)=NB_SETS_G_Q,I57,IF(COUNTIF(J57:N57,DISTANCE_Q)=NB_SETS_G_Q,I56,\"\"))","v":""},null,null,null,null,null,{"$f":"IF(COUNTIF(Q53:U53,DISTANCE_Q)=NB_SETS_G_Q,\"Qualifié\",IF(COUNTIF(Q52:U52,DISTANCE_Q)=NB_SETS_G_Q,\"Eliminé\",\"\"))","v":""}]
[]
[null,"Match 4 (2 - 7)",null,null,null,null,null,null,"Match 8 (Gagnants M3 M4)"]
[null,null,null,null,null,null,null,null,{"$f":"IF(COUNTIF(C52:G52,DISTANCE_Q)=NB_SETS_G_Q,B52,IF(COUNTIF(C53:G53,DISTANCE_Q)=NB_SETS_G_Q,B53,\"\"))","v":""},null,null,null,null,null,{"$f":"IF(COUNTIF(J56:N56,DISTANCE_Q)=NB_SETS_G_Q,\"Qualifié\",\"\")","v":""}]
[null,null,null,null,null,null,null,null,{"$f":"IF(COUNTIF(C56:G56,DISTANCE_Q)=NB_SETS_G_Q,B56,IF(COUNTIF(C57:G57,DISTANCE_Q)=NB_SETS_G_Q,B57,\"\"))","v":""},null,null,null,null,null,{"$f":"IF(COUNTIF(J57:N57,DISTANCE_Q)=NB_SETS_G_Q,\"Qualifié\",\"\")","v":""}]

{"sheet":"8èmesRef3Sets","index":20,"n_rows":19,"n_cols":45,"rows_kept":19,"cut":false,"hidden":true,"merged":[[1,1,1,4]]}
[null,{"$f":" TOURNOI & \" - \" & LIEU_TOURNOI","v":"T3 Qualification CD62 R1 - WIMILLE"}]
[null,{"$f":"DATE_TOURNOI","v":"2019-01-13"},null,null,null,null,null,null,"- 1/8 finale -",null,null,null,null,null,null,null,null,null,null,null,null,null,null,null,null,null,null,null,null,"Reclassement",null,null,null,null,"1/8 Finale",null,null,null,null,"Total après 8èmes"]
[null,"1 - 16",null,null,null,null,null,null,"2 - 15",null,null,null,null,null,null,null,"Reclassement 8èmes","Pts Match","Pts Set","Moy. 8èmes","Moy. Gen.","Moy. Part.",null,null,null,null,null,null,"Joueur","Pts Match","Pts set","Moy. Part.","Pts Marq.","Pts subis","Pts Match","Pts set","Moy. 8ème","Pts Marq.","Pts subis","Pts Match","Pts set","Moy. Gen.","Moy. Part.","Pts Marq.","Pts subis"]
[null,null,null,null,null,null,null,null,null,null,null,null,null,null,null,null,null,null,null,null,null,null,null,null,null,null,null,null,null,null,null,null,null,null,{"$f":"IF(COUNTIF(C4:G4,DISTANCE_8)=NB_SETS_G_8,VAL_PT_MATCH,0)","v":0},{"$f":"IF(AI4=VAL_PT_MATCH,(NB_SETS_G_8*2)-1-COUNTIF(C5:G5,DISTANCE_8),COUNTIF(C4:G4,DISTANCE_8))","v":0},{"$f":"IF(AM4<>0,ROUNDDOWN(AL4/AM4,3),0)","v":0},{"$f":"SUM(C4:G4)","v":0},{"$f":"SUM(C5:G5)","v":0},{"$f":"AD4+AI4","v":0},{"$f":"AE4+AJ4","v":0},{"$f":"IF(AS4<>0,ROUNDDOWN(AR4/AS4,3),0)","v":0},{"$f":"MAX(AK4,AF4)","v":0},{"$f":"AG4+AL4","v":0},{"$f":"AH4+AM4","v":0}]
[null,null,null,null,null,null,null,null,null,null,null,null,null,null,null,null,null,null,null,null,null,null,null,null,null,null,null,null,null,null,null,null,null,null,{"$f":"IF(COUNTIF(J4:N4,DISTANCE_8)=NB_SETS_G_8,VAL_PT_MATCH,0)","v":0},{"$f":"IF(AI5=VAL_PT_MATCH,(NB_SETS_G_8*2)-1-COUNTIF(J5:N5,DISTANCE_8),COUNTIF(J4:N4,DISTANCE_8))","v":0},{"$f":"IF(AM5<>0,ROUNDDOWN(AL5/AM5,3),0)","v":0},{"$f":"SUM(J4:N4)","v":0},{"$f":"SUM(J5:N5)","v":0},{"$f":"AD5+AI5","v":0},0,{"$f":"IF(AS5<>0,ROUNDDOWN(AR5/AS5,3),0)","v":0},{"$f":"MAX(AK5,AF5)","v":0},{"$f":"AG5+AL5","v":0},0]
[null,null,null,null,null,null,null,null,null,null,null,null,null,null,null,null,null,null,null,null,null,null,null,null,null,null,null,null,null,null,null,null,null,null,{"$f":"IF(COUNTIF(C8:G8,DISTANCE_8)=NB_SETS_G_8,VAL_PT_MATCH,0)","v":0},{"$f":"IF(AI6=VAL_PT_MATCH,(NB_SETS_G_8*2)-1-COUNTIF(C9:G9,DISTANCE_8),COUNTIF(C8:G8,DISTANCE_8))","v":0},0,{"$f":"SUM(C8:G8)","v":0},{"$f":"SUM(C9:G9)","v":0},0,0,0,0,0,0]
[null,"3 - 14",null,null,null,null,null,null,"4 - 13",null,null,null,null,null,null,null,null,null,null,null,null,null,null,null,null,null,null,null,null,null,null,null,null,null,{"$f":"IF(COUNTIF(J8:N8,DISTANCE_8)=NB_SETS_G_8,VAL_PT_MATCH,0)","v":0},{"$f":"IF(AI7=VAL_PT_MATCH,(NB_SETS_G_8*2)-1-COUNTIF(J9:N9,DISTANCE_8),COUNTIF(J8:N8,DISTANCE_8))","v":0},0,{"$f":"SUM(J8:N8)","v":0},{"$f":"SUM(J9:N9)","v":0},0,0,0,0,0,0]
[null,null,null,null,null,null,null,null,null,null,null,null,null,null,null,null,null,null,null,null,null,null,null,null,null,null,null,null,null,null,null,null,null,null,{"$f":"IF(COUNTIF(C12:G12,DISTANCE_8)=NB_SETS_G_8,VAL_PT_MATCH,0)","v":0},{"$f":"IF(AI8=VAL_PT_MATCH,(NB_SETS_G_8*2)-1-COUNTIF(C13:G13,DISTANCE_8),COUNTIF(C12:G12,DISTANCE_8))","v":0},0,{"$f":"SUM(C12:G12)","v":0},{"$f":"SUM(C13:G13)","v":0},0,0,0,0,0,0]
[null,null,null,null,null,null,null,null,null,null,null,null,null,null,null,null,null,null,null,null,null,null,null,null,null,null,null,null,null,null,null,null,null,null,{"$f":"IF(COUNTIF(J12:N12,DISTANCE_8)=NB_SETS_G_8,VAL_PT_MATCH,0)","v":0},{"$f":"IF(AI9=VAL_PT_MATCH,(NB_SETS_G_8*2)-1-COUNTIF(J13:N13,DISTANCE_8),COUNTIF(J12:N12,DISTANCE_8))","v":0},0,{"$f":"SUM(J12:N12)","v":0},{"$f":"SUM(J13:N13)","v":0},0,0,0,0,0,0]
[null,null,null,null,null,null,null,null,null,null,null,null,null,null,null,null,null,null,null,null,null,null,null,null,null,null,null,null,null,null,null,null,null,null,{"$f":"IF(COUNTIF(C16:G16,DISTANCE_8)=NB_SETS_G_8,VAL_PT_MATCH,0)","v":0},{"$f":"IF(AI10=VAL_PT_MATCH,(NB_SETS_G_8*2)-1-COUNTIF(C17:G17,DISTANCE_8),COUNTIF(C16:G16,DISTANCE_8))","v":0},0,{"$f":"SUM(C16:G16)","v":0},{"$f":"SUM(C17:G17)","v":0},0,0,0,0,0,0]
[null,"5 - 12",null,null,null,null,null,null,"6 - 11",null,null,null,null,null,null,null,null,null,null,null,null,null,null,null,null,null,null,null,null,null,null,null,null,null,{"$f":"IF(COUNTIF(J16:N16,DISTANCE_8)=NB_SETS_G_8,VAL_PT_MATCH,0)","v":0},{"$f":"IF(AI11=VAL_PT_MATCH,(NB_SETS_G_8*2)-1-COUNTIF(J17:N17,DISTANCE_8),COUNTIF(J16:N16,DISTANCE_8))","v":0},0,{"$f":"SUM(J16:N16)","v":0},{"$f":"SUM(J17:N17)","v":0},0,0,0,0,0,0]
[null,null,null,null,null,null,null,null,null,null,null,null,null,null,null,null,null,null,null,null,null,null,null,null,null,null,null,null,null,null,null,null,null,null,{"$f":"IF(COUNTIF(J17:N17,DISTANCE_8)=NB_SETS_G_8,VAL_PT_MATCH,0)","v":0},{"$f":"IF(AI12=VAL_PT_MATCH,(NB_SETS_G_8*2)-1-COUNTIF(J16:N16,DISTANCE_8),COUNTIF(J17:N17,DISTANCE_8))","v":0},0,{"$f":"SUM(J17:N17)","v":0},{"$f":"SUM(J16:N16)","v":0},0,0,0,0,0,0]
[null,null,null,null,null,null,null,null,null,null,null,null,null,null,null,null,null,null,null,null,null,null,null,null,null,null,null,null,null,null,null,null,null,null,{"$f":"IF(COUNTIF(C17:G17,DISTANCE_8)=NB_SETS_G_8,VAL_PT_MATCH,0)","v":0},{"$f":"IF(AI13=VAL_PT_MATCH,(NB_SETS_G_8*2)-1-COUNTIF(C16:G16,DISTANCE_8),COUNTIF(C17:G17,DISTANCE_8))","v":0},0,{"$f":"SUM(C17:G17)","v":0},{"$f":"SUM(C16:G16)","v":0},0,0,0,0,0,0]
[null,null,null,null,null,null,null,null,null,null,null,null,null,null,null,null,null,null,null,null,null,null,null,null,null,null,null,null,null,null,null,null,null,null,{"$f":"IF(COUNTIF(J13:N13,DISTANCE_8)=NB_SETS_G_8,VAL_PT_MATCH,0)","v":0},{"$f":"IF(AI14=VAL_PT_MATCH,(NB_SETS_G_8*2)-1-COUNTIF(J12:N12,DISTANCE_8),COUNTIF(J13:N13,DISTANCE_8))","v":0},0,{"$f":"SUM(J13:N13)","v":0},{"$f":"SUM(J12:N12)","v":0},0,0,0,0,0,0]
[null,"7 - 10",null,null,null,null,null,null,"8 - 9",null,null,null,null,null,null,null,null,null,null,null,null,null,null,null,null,null,null,null,null,null,null,null,null,null,{"$f":"IF(COUNTIF(C13:G13,DISTANCE_8)=NB_SETS_G_8,VAL_PT_MATCH,0)","v":0},{"$f":"IF(AI15=VAL_PT_MATCH,(NB_SETS_G_8*2)-1-COUNTIF(C12:G12,DISTANCE_8),COUNTIF(C13:G13,DISTANCE_8))","v":0},0,{"$f":"SUM(C13:G13)","v":0},{"$f":"SUM(C12:G12)","v":0},0,0,0,0,0,0]
[null,null,null,null,null,null,null,null,null,null,null,null,null,null,null,null,null,null,null,null,null,null,null,null,null,null,null,null,null,null,null,null,null,null,{"$f":"IF(COUNTIF(J9:N9,DISTANCE_8)=NB_SETS_G_8,VAL_PT_MATCH,0)","v":0},{"$f":"IF(AI16=VAL_PT_MATCH,(NB_SETS_G_8*2)-1-COUNTIF(J8:N8,DISTANCE_8),COUNTIF(J9:N9,DISTANCE_8))","v":0},0,{"$f":"SUM(J9:N9)","v":0},{"$f":"SUM(J8:N8)","v":0},0,0,0,0,0,0]
[null,null,null,null,null,null,null,null,null,null,null,null,null,null,null,null,null,null,null,null,null,null,null,null,null,null,null,null,null,null,null,null,null,null,{"$f":"IF(COUNTIF(C9:G9,DISTANCE_8)=NB_SETS_G_8,VAL_PT_MATCH,0)","v":0},{"$f":"IF(AI17=VAL_PT_MATCH,(NB_SETS_G_8*2)-1-COUNTIF(C8:G8,DISTANCE_8),COUNTIF(C9:G9,DISTANCE_8))","v":0},0,{"$f":"SUM(C9:G9)","v":0},{"$f":"SUM(C8:G8)","v":0},0,0,0,0,0,0]
[null,null,null,null,null,null,null,null,null,null,null,null,null,null,null,null,null,null,null,null,null,null,null,null,null,null,null,null,null,null,null,null,null,null,{"$f":"IF(COUNTIF(J5:N5,DISTANCE_8)=NB_SETS_G_8,VAL_PT_MATCH,0)","v":0},{"$f":"IF(AI18=VAL_PT_MATCH,(NB_SETS_G_8*2)-1-COUNTIF(J4:N4,DISTANCE_8),COUNTIF(J5:N5,DISTANCE_8))","v":0},0,{"$f":"SUM(J5:N5)","v":0},{"$f":"SUM(J4:N4)","v":0},0,0,0,0,0,0]
[null,null,null,null,null,null,null,null,null,null,null,null,null,null,null,null,null,null,null,null,null,null,null,null,null,null,null,null,null,null,null,null,null,null,{"$f":"IF(COUNTIF(C5:G5,DISTANCE_8)=NB_SETS_G_8,VAL_PT_MATCH,0)","v":0},{"$f":"IF(AI19=VAL_PT_MATCH,(NB_SETS_G_8*2)-1-COUNTIF(C4:G4,DISTANCE_8),COUNTIF(C5:G5,DISTANCE_8))","v":0},0,{"$f":"SUM(C5:G5)","v":0},{"$f":"SUM(C4:G4)","v":0},0,0,0,0,0,0]

{"sheet":"DemisRef3Sets","index":21,"n_rows":25,"n_cols":50,"rows_kept":25,"cut":false,"hidden":true,"merged":[[36,9,36,13],[35,9,35,13],[34,9,34,13],[6,17,6,25],[17,17,18,17],[35,17,36,17]]}
[null,{"$f":" TOURNOI & \" - \" & LIEU_TOURNOI","v":"T3 Qualification CD62 R1 - WIMILLE"},null,null,null,null,null,null,null,null,null,null,null,null,null,null,null,null,null,null,null,null,null,null,null,null,null,null,"Résultats Reclassement",null,null,null,null,"Résultats 1/2 F.",null,null,null,null,"Résultats F.",null,null,null,null,"Total compétition"]
[null,{"$f":"DATE_TOURNOI","v":"2019-01-13"},null,null,null,null,null,null,null,null,null,null,null,null,null,null,null,null,null,null,null,null,null,null,null,null,null,"Joueur","Pts Match","Pts set","Moy. Part.","Pts Marq.","Pts subis","Pts Match","Pts set","Moy.","Pts Marq.","Pts subis","Pts Match","Pts set","Moy.","Pts Marq.","Pts subis","Rang final","Pts Match","Pts set","Moy. Gen.","Moy. Part.","Pts Marq.","Pts subis"]
[null,null,null,null,null,null,null,null,null,null,null,null,null,null,null,null,null,null,null,null,null,null,null,null,null,null,null,null,null,null,null,null,null,{"$f":"IF(B10=AB3,IF(COUNTIF(C10:G10,DISTANCE_F)=NB_SETS_G_F,VAL_PT_MATCH,0),0)","v":0},{"$f":"IF(B10=AB3,IF(AH3=VAL_PT_MATCH,(NB_SETS_G_F*2)-1-COUNTIF(C11:G11,DISTANCE_F),COUNTIF(C10:G10,DISTANCE_F)),0)","v":0},{"$f":"IF(AL3<>0,ROUNDDOWN(AK3/AL3,3),0)","v":0},{"$f":"IF(B10=AB3,SUM(C10:G10),0)","v":0},{"$f":"IF(B10=AB3,SUM(C11:G11),0)","v":0},{"$f":"IF(I18=AB3,IF(COUNTIF(J18:N18,DISTANCE_F)=NB_SETS_G_F,VAL_PT_MATCH,0),0)","v":0},{"$f":"IF(I18=AB3,IF(AM3=VAL_PT_MATCH,(NB_SETS_G_F*2)-1-COUNTIF(J19:N19,DISTANCE_F),COUNTIF(J18:N18,DISTANCE_F)),0)","v":0},{"$f":"IF(AQ3<>0,ROUNDDOWN(AP3/AQ3,3),0)","v":0},{"$f":"IF(I18=AB3,SUM(J18:N18),0)","v":0},{"$f":"IF(I18=AB3,SUM(J19:N19),0)","v":0},{"$f":"IF(AM3=VAL_PT_MATCH,1,IF(AH3=VAL_PT_MATCH,2,3))","v":3},{"$f":"AC3+AH3+AM3","v":0},0,{"$f":"IF(AX3<>0,ROUNDDOWN(AW3/AX3,3),0)","v":0},{"$f":"MAX(AE3,AJ3,AO3)","v":0},{"$f":"AF3+AK3+AP3","v":0},0]
[null,null,null,null,null,null,null,null,null,null,null,null,null,null,null,null,null,null,null,null,null,null,null,null,null,null,null,null,null,null,null,null,null,{"$f":"IF(B26=AB4,IF(COUNTIF(C26:G26,DISTANCE_F)=NB_SETS_G_F,VAL_PT_MATCH,0),0)","v":0},{"$f":"IF(B26=AB4,IF(AH4=VAL_PT_MATCH,(NB_SETS_G_F*2)-1-COUNTIF(C27:G27,DISTANCE_F),COUNTIF(C26:G26,DISTANCE_F)),0)","v":0},{"$f":"IF(AL4<>0,ROUNDDOWN(AK4/AL4,3),0)","v":0},{"$f":"IF(B26=AB4,SUM(C26:G26),0)","v":0},{"$f":"IF(B26=AB4,SUM(C27:G27),0)","v":0},{"$f":"IF(I19=AB4,IF(COUNTIF(J19:N19,DISTANCE_F)=NB_SETS_G_F,VAL_PT_MATCH,0),0)","v":0},{"$f":"IF(I19=AB4,IF(AM4=VAL_PT_MATCH,(NB_SETS_G_F*2)-1-COUNTIF(J18:N18,DISTANCE_F),COUNTIF(J19:N19,DISTANCE_F)),0)","v":0},{"$f":"IF(AQ4<>0,ROUNDDOWN(AP4/AQ4,3),0)","v":0},{"$f":"IF(I19=AB4,SUM(J19:N19),0)","v":0},{"$f":"IF(I19=AB4,SUM(J18:N18),0)","v":0},{"$f":"IF(AM4=VAL_PT_MATCH,1,IF(AH4=VAL_PT_MATCH,2,3))","v":3},0,0,{"$f":"IF(AX4<>0,ROUNDDOWN(AW4/AX4,3),0)","v":0},{"$f":"MAX(AE4,AJ4,AO4)","v":0},0,0]
[null,null,null,null,null,null,null,null,null,null,null,null,null,null,null,null,null,null,null,null,null,null,null,null,null,null,null,null,null,null,null,null,null,{"$f":"IF(B27=AB5,IF(COUNTIF(C27:G27,DISTANCE_F)=NB_SETS_G_F,VAL_PT_MATCH,0),0)","v":0},{"$f":"IF(B27=AB5,IF(AH5=VAL_PT_MATCH,(NB_SETS_G_F*2)-1-COUNTIF(C26:G26,DISTANCE_F),COUNTIF(C27:G27,DISTANCE_F)),0)","v":0},{"$f":"IF(AL5<>0,ROUNDDOWN(AK5/AL5,3),0)","v":0},{"$f":"IF(B27=AB5,SUM(C27:G27),0)","v":0},{"$f":"IF(B27=AB5,SUM(C26:G26),0)","v":0},{"$f":"IF(I19=AB5,IF(COUNTIF(J19:N19,DISTANCE_F)=NB_SETS_G_F,VAL_PT_MATCH,0),0)","v":0},{"$f":"IF(I19=AB5,IF(AM5=VAL_PT_MATCH,(NB_SETS_G_F*2)-1-COUNTIF(J18:N18,DISTANCE_F),COUNTIF(J19:N19,DISTANCE_F)),0)","v":0},{"$f":"IF(AQ5<>0,ROUNDDOWN(AP5/AQ5,3),0)","v":0},{"$f":"IF(I19=AB5,SUM(J19:N19),0)","v":0},{"$f":"IF(I19=AB5,SUM(J18:N18),0)","v":0},{"$f":"IF(AM5=VAL_PT_MATCH,1,IF(AH5=VAL_PT_MATCH,2,3))","v":3},0,0,{"$f":"IF(AX5<>0,ROUNDDOWN(AW5/AX5,3),0)","v":0},{"$f":"MAX(AE5,AJ5,AO5)","v":0},0,0]
[null,null,null,null,null,null,null,null,null,null,null,null,null,null,null,null,null,null,null,null,null,null,null,null,null,null,null,null,null,null,null,null,null,{"$f":"IF(B11=AB6,IF(COUNTIF(C11:G11,DISTANCE_F)=NB_SETS_G_F,VAL_PT_MATCH,0),0)","v":0},{"$f":"IF(B11=AB6,IF(AH6=VAL_PT_MATCH,(NB_SETS_G_F*2)-1-COUNTIF(C10:G10,DISTANCE_F),COUNTIF(C11:G11,DISTANCE_F)),0)","v":0},{"$f":"IF(AL6<>0,ROUNDDOWN(AK6/AL6,3),0)","v":0},{"$f":"IF(B11=AB6,SUM(C11:G11),0)","v":0},{"$f":"IF(B11=AB6,SUM(C10:G10),0)","v":0},{"$f":"IF(I18=AB6,IF(COUNTIF(J18:N18,DISTANCE_F)=NB_SETS_G_F,VAL_PT_MATCH,0),0)","v":0},{"$f":"IF(I18=AB6,IF(AM6=VAL_PT_MATCH,(NB_SETS_G_F*2)-1-COUNTIF(J19:N19,DISTANCE_F),COUNTIF(J18:N18,DISTANCE_F)),0)","v":0},{"$f":"IF(AQ6<>0,ROUNDDOWN(AP6/AQ6,3),0)","v":0},{"$f":"IF(I18=AB6,SUM(J18:N18),0)","v":0},{"$f":"IF(I18=AB6,SUM(J19:N19),0)","v":0},{"$f":"IF(AM6=VAL_PT_MATCH,1,IF(AH6=VAL_PT_MATCH,2,3))","v":3},0,0,{"$f":"IF(AX6<>0,ROUNDDOWN(AW6/AX6,3),0)","v":0},{"$f":"MAX(AE6,AJ6,AO6)","v":0},0,0]
[]
[null,"- 1/2 finale -"]
[null,"1 - 4"]
[]
[]
[]
[]
[]
[]
[null,null,null,null,null,null,null,null,"- Finale -"]
[null,null,null,null,null,null,null,null,null,null,null,null,null,null,null,null,null,{"$f":"IF(R18<>\"\",\"VAINQUEUR\",\"\")","v":""}]
[null,null,null,null,null,null,null,null,{"$f":"IF(COUNTIF(C10:G10,DISTANCE_F)=NB_SETS_G_F,B10,IF(COUNTIF(C11:G11,DISTANCE_F)=NB_SETS_G_F,B11,\"\"))","v":""},null,null,null,null,null,null,null,null,{"$f":"IF(COUNTIF(J18:N18,DISTANCE_F)=NB_SETS_G_F,I18,IF(COUNTIF(J19:N19,DISTANCE_F)=NB_SETS_G_F,I19,\"\"))","v":""}]
[null,null,null,null,null,null,null,null,{"$f":"IF(COUNTIF(C26:G26,DISTANCE_F)=NB_SETS_G_F,B26,IF(COUNTIF(C27:G27,DISTANCE_F)=NB_SETS_G_F,B27,\"\"))","v":""}]
[]
[]
[]
[]
[]
[null,"2 - 3"]

{"sheet":"QuartsRef3Sets","index":22,"n_rows":32,"n_cols":55,"rows_kept":32,"cut":false,"hidden":true,"merged":[[17,24,18,24]]}
[null,{"$f":" TOURNOI & \" - \" & LIEU_TOURNOI","v":"T3 Qualification CD62 R1 - WIMILLE"},null,null,null,null,null,null,null,null,null,null,null,null,null,null,null,null,null,null,null,null,null,null,null,null,null,null,"Résultats Reclassement",null,null,null,null,"Résultats 1/4 F.",null,null,null,null,"Resultats 1/2 F.",null,null,null,null,"Resultats F.",null,null,null,null,"Total compétition"]
[null,{"$f":"DATE_TOURNOI","v":"2019-01-13"},null,null,null,null,null,null,null,null,null,null,null,null,null,null,null,null,null,null,null,null,null,null,null,null,null,"Joueur","Pts Match","Pts set","Moy. Part.","Pts Marq.","Pts subis","Pts Match","Pts set","Moy.","Pts Marq.","Pts subis","Pts Match","Pts set","Moy.","Pts Marq.","Pts subis","Pts Match","Pts set","Moy.","Pts Marq.","Pts subis","Rang final","Pts Match","Pts set","Moy. Gen.","Moy. Part.","Pts Marq.","Pts subis"]
[null,null,null,null,null,null,null,null,null,null,null,null,null,null,null,null,null,null,null,null,null,null,null,null,null,null,null,null,null,null,null,null,null,{"$f":"IF(COUNTIF(C6:G6,DISTANCE_F)=NB_SETS_G_F,VAL_PT_MATCH,0)","v":0},{"$f":"IF(AH3=2,(NB_SETS_G_F*2)-1-COUNTIF(C7:G7,DISTANCE_F),COUNTIF(C6:G6,DISTANCE_F))","v":0},{"$f":"IF(AL3<>0,ROUNDDOWN(AK3/AL3,3),0)","v":0},{"$f":"SUM(C6:G6)","v":0},{"$f":"SUM(C7:G7)","v":0},{"$f":"IF(I10=AB3,IF(COUNTIF(J10:N10,DISTANCE_F)=NB_SETS_G_F,VAL_PT_MATCH,0),0)","v":0},{"$f":"IF(I10=AB3,IF(AM3=2,(NB_SETS_G_F*2)-1-COUNTIF(J11:N11,DISTANCE_F),COUNTIF(J10:N10,DISTANCE_F)),0)","v":0},{"$f":"IF(AQ3<>0,ROUNDDOWN(AP3/AQ3,3),0)","v":0},{"$f":"IF(I10=AB3,SUM(J10:N10),0)","v":0},{"$f":"IF(I10=AB3,SUM(J11:N11),0)","v":0},{"$f":"IF(P18=AB3,IF(COUNTIF(Q18:U18,DISTANCE_F)=NB_SETS_G_F,VAL_PT_MATCH,0),0)","v":0},{"$f":"IF(P18=AB3,IF(AR3=2,(NB_SETS_G_F*2)-1-COUNTIF(Q19:U19,DISTANCE_F),COUNTIF(Q18:U18,DISTANCE_F)),0)","v":0},{"$f":"IF(AV3<>0,ROUNDDOWN(AU3/AV3,3),0)","v":0},{"$f":"IF(P18=AB3,SUM(Q18:U18),0)","v":0},{"$f":"IF(P18=AB3,SUM(Q19:U19),0)","v":0},{"$f":"IF(AR3=VAL_PT_MATCH,1,IF(AM3=VAL_PT_MATCH,2,IF(AH3=VAL_PT_MATCH,3,4)))","v":4},{"$f":"AC3+AH3+AM3+AR3","v":0},0,{"$f":"IF(BC3<>0,ROUNDDOWN(BB3/BC3,3),0)","v":0},{"$f":"MAX(AE3,AJ3,AO3,AT3)","v":0},{"$f":"AF3+AK3+AP3+AU3","v":0},0]
[null,"- 1/4 finale -",null,null,null,null,null,null,null,null,null,null,null,null,null,null,null,null,null,null,null,null,null,null,null,null,null,null,null,null,null,null,null,{"$f":"IF(COUNTIF(C22:G22,DISTANCE_F)=NB_SETS_G_F,VAL_PT_MATCH,0)","v":0},{"$f":"IF(AH4=2,(NB_SETS_G_F*2)-1-COUNTIF(C23:G23,DISTANCE_F),COUNTIF(C22:G22,DISTANCE_F))","v":0},{"$f":"IF(AL4<>0,ROUNDDOWN(AK4/AL4,3),0)","v":0},{"$f":"SUM(C22:G22)","v":0},{"$f":"SUM(C23:G23)","v":0},{"$f":"IF(I26=AB4,IF(COUNTIF(J26:N26,DISTANCE_F)=NB_SETS_G_F,VAL_PT_MATCH,0),0)","v":0},{"$f":"IF(I26=AB4,IF(AM4=2,(NB_SETS_G_F*2)-1-COUNTIF(J27:N27,DISTANCE_F),COUNTIF(J26:N26,DISTANCE_F)),0)","v":0},0,{"$f":"IF(I26=AB4,SUM(J26:N26),0)","v":0},{"$f":"IF(I26=AB4,SUM(J27:N27),0)","v":0},{"$f":"IF(P19=AB4,IF(COUNTIF(Q19:U19,DISTANCE_F)=NB_SETS_G_F,VAL_PT_MATCH,0),0)","v":0},{"$f":"IF(P19=AB4,IF(AR4=2,(NB_SETS_G_F*2)-1-COUNTIF(Q18:U18,DISTANCE_F),COUNTIF(Q19:U19,DISTANCE_F)),0)","v":0},0,{"$f":"IF(P19=AB4,SUM(Q19:U19),0)","v":0},{"$f":"IF(P19=AB4,SUM(Q18:U18),0)","v":0},4,0,0,{"$f":"IF(BC4<>0,ROUNDDOWN(BB4/BC4,3),0)","v":0},0,0,0]
[null,"1 - 8",null,null,null,null,null,null,null,null,null,null,null,null,null,null,null,null,null,null,null,null,null,null,null,null,null,null,null,null,null,null,null,{"$f":"IF(COUNTIF(C30:G30,DISTANCE_F)=NB_SETS_G_F,VAL_PT_MATCH,0)","v":0},{"$f":"IF(AH5=2,(NB_SETS_G_F*2)-1-COUNTIF(C31:G31,DISTANCE_F),COUNTIF(C30:G30,DISTANCE_F))","v":0},0,{"$f":"SUM(C30:G30)","v":0},{"$f":"SUM(C31:G31)","v":0},{"$f":"IF(I27=AB5,IF(COUNTIF(J27:N27,DISTANCE_F)=NB_SETS_G_F,VAL_PT_MATCH,0),0)","v":0},{"$f":"IF(I27=AB5,IF(AM5=2,(NB_SETS_G_F*2)-1-COUNTIF(J26:N26,DISTANCE_F),COUNTIF(J27:N27,DISTANCE_F)),0)","v":0},0,{"$f":"IF(I27=AB5,SUM(J27:N27),0)","v":0},{"$f":"IF(I27=AB5,SUM(J26:N26),0)","v":0},{"$f":"IF(P19=AB5,IF(COUNTIF(Q19:U19,DISTANCE_F)=NB_SETS_G_F,VAL_PT_MATCH,0),0)","v":0},{"$f":"IF(P19=AB5,IF(AR5=2,(NB_SETS_G_F*2)-1-COUNTIF(Q18:U18,DISTANCE_F),COUNTIF(Q19:U19,DISTANCE_F)),0)","v":0},0,{"$f":"IF(P19=AB5,SUM(Q19:U19),0)","v":0},{"$f":"IF(P19=AB5,SUM(Q18:U18),0)","v":0},4,0,0,0,0,0,0]
[null,null,null,null,null,null,null,null,null,null,null,null,null,null,null,null,null,null,null,null,null,null,null,null,null,null,null,null,null,null,null,null,null,{"$f":"IF(COUNTIF(C14:G14,DISTANCE_F)=NB_SETS_G_F,VAL_PT_MATCH,0)","v":0},{"$f":"IF(AH6=2,(NB_SETS_G_F*2)-1-COUNTIF(C15:G15,DISTANCE_F),COUNTIF(C14:G14,DISTANCE_F))","v":0},0,{"$f":"SUM(C14:G14)","v":0},{"$f":"SUM(C15:G15)","v":0},{"$f":"IF(I11=AB6,IF(COUNTIF(J11:N11,DISTANCE_F)=NB_SETS_G_F,VAL_PT_MATCH,0),0)","v":0},{"$f":"IF(I11=AB6,IF(AM6=2,(NB_SETS_G_F*2)-1-COUNTIF(J10:N10,DISTANCE_F),COUNTIF(J11:N11,DISTANCE_F)),0)","v":0},0,{"$f":"IF(I11=AB6,SUM(J11:N11),0)","v":0},{"$f":"IF(I11=AB6,SUM(J10:N10),0)","v":0},{"$f":"IF(P18=AB6,IF(COUNTIF(Q18:U18,DISTANCE_F)=NB_SETS_G_F,VAL_PT_MATCH,0),0)","v":0},{"$f":"IF(P18=AB6,IF(AR6=2,(NB_SETS_G_F*2)-1-COUNTIF(Q19:U19,DISTANCE_F),COUNTIF(Q18:U18,DISTANCE_F)),0)","v":0},0,{"$f":"IF(P18=AB6,SUM(Q18:U18),0)","v":0},{"$f":"IF(P18=AB6,SUM(Q19:U19),0)","v":0},4,0,0,0,0,0,0]
[null,null,null,null,null,null,null,null,null,null,null,null,null,null,null,null,null,null,null,null,null,null,null,null,null,null,null,null,null,null,null,null,null,{"$f":"IF(COUNTIF(C15:G15,DISTANCE_F)=NB_SETS_G_F,VAL_PT_MATCH,0)","v":0},{"$f":"IF(AH7=2,(NB_SETS_G_F*2)-1-COUNTIF(C14:G14,DISTANCE_F),COUNTIF(C15:G15,DISTANCE_F))","v":0},0,{"$f":"SUM(C15:G15)","v":0},{"$f":"SUM(C14:G14)","v":0},{"$f":"IF(I11=AB7,IF(COUNTIF(J11:N11,DISTANCE_F)=NB_SETS_G_F,VAL_PT_MATCH,0),0)","v":0},{"$f":"IF(I11=AB7,IF(AM7=2,(NB_SETS_G_F*2)-1-COUNTIF(J10:N10,DISTANCE_F),COUNTIF(J11:N11,DISTANCE_F)),0)","v":0},0,{"$f":"IF(I11=AB7,SUM(J11:N11),0)","v":0},{"$f":"IF(I11=AB7,SUM(J10:N10),0)","v":0},{"$f":"IF(P18=AB7,IF(COUNTIF(Q18:U18,DISTANCE_F)=NB_SETS_G_F,VAL_PT_MATCH,0),0)","v":0},{"$f":"IF(P18=AB7,IF(AR7=2,(NB_SETS_G_F*2)-1-COUNTIF(Q19:U19,DISTANCE_F),COUNTIF(Q18:U18,DISTANCE_F)),0)","v":0},0,{"$f":"IF(P18=AB7,SUM(Q18:U18),0)","v":0},{"$f":"IF(P18=AB7,SUM(Q19:U19),0)","v":0},4,0,0,0,0,0,0]
[null,null,null,null,null,null,null,null,"- 1/2 finale -",null,null,null,null,null,null,null,null,null,null,null,null,null,null,null,null,null,null,null,null,null,null,null,null,{"$f":"IF(COUNTIF(C31:G31,DISTANCE_F)=NB_SETS_G_F,VAL_PT_MATCH,0)","v":0},{"$f":"IF(AH8=2,(NB_SETS_G_F*2)-1-COUNTIF(C30:G30,DISTANCE_F),COUNTIF(C31:G31,DISTANCE_F))","v":0},0,{"$f":"SUM(C31:G31)","v":0},{"$f":"SUM(C30:G30)","v":0},{"$f":"IF(I27=AB8,IF(COUNTIF(J27:N27,DISTANCE_F)=NB_SETS_G_F,VAL_PT_MATCH,0),0)","v":0},{"$f":"IF(I27=AB8,IF(AM8=2,(NB_SETS_G_F*2)-1-COUNTIF(J26:N26,DISTANCE_F),COUNTIF(J27:N27,DISTANCE_F)),0)","v":0},0,{"$f":"IF(I27=AB8,SUM(J27:N27),0)","v":0},{"$f":"IF(I27=AB8,SUM(J26:N26),0)","v":0},{"$f":"IF(P19=AB8,IF(COUNTIF(Q19:U19,DISTANCE_F)=NB_SETS_G_F,VAL_PT_MATCH,0),0)","v":0},{"$f":"IF(P19=AB8,IF(AR8=2,(NB_SETS_G_F*2)-1-COUNTIF(Q18:U18,DISTANCE_F),COUNTIF(Q19:U19,DISTANCE_F)),0)","v":0},0,{"$f":"IF(P19=AB8,SUM(Q19:U19),0)","v":0},{"$f":"IF(P19=AB8,SUM(Q18:U18),0)","v":0},4,0,0,0,0,0,0]
[null,null,null,null,null,null,null,null,null,null,null,null,null,null,null,null,null,null,null,null,null,null,null,null,null,null,null,null,null,null,null,null,null,{"$f":"IF(COUNTIF(C23:G23,DISTANCE_F)=NB_SETS_G_F,VAL_PT_MATCH,0)","v":0},{"$f":"IF(AH9=2,(NB_SETS_G_F*2)-1-COUNTIF(C22:G22,DISTANCE_F),COUNTIF(C23:G23,DISTANCE_F))","v":0},0,{"$f":"SUM(C23:G23)","v":0},{"$f":"SUM(C22:G22)","v":0},{"$f":"IF(I26=AB9,IF(COUNTIF(J26:N26,DISTANCE_F)=NB_SETS_G_F,VAL_PT_MATCH,0),0)","v":0},{"$f":"IF(I26=AB9,IF(AM9=2,(NB_SETS_G_F*2)-1-COUNTIF(J27:N27,DISTANCE_F),COUNTIF(J26:N26,DISTANCE_F)),0)","v":0},0,{"$f":"IF(I26=AB9,SUM(J26:N26),0)","v":0},{"$f":"IF(I26=AB9,SUM(J27:N27),0)","v":0},{"$f":"IF(P19=AB9,IF(COUNTIF(Q19:U19,DISTANCE_F)=NB_SETS_G_F,VAL_PT_MATCH,0),0)","v":0},{"$f":"IF(P19=AB9,IF(AR9=2,(NB_SETS_G_F*2)-1-COUNTIF(Q18:U18,DISTANCE_F),COUNTIF(Q19:U19,DISTANCE_F)),0)","v":0},0,{"$f":"IF(P19=AB9,SUM(Q19:U19),0)","v":0},{"$f":"IF(P19=AB9,SUM(Q18:U18),0)","v":0},4,0,0,0,0,0,0]
[null,null,null,null,null,null,null,null,{"$f":"IF(COUNTIF(C6:G6,DISTANCE_F)=NB_SETS_G_F,B6,IF(COUNTIF(C7:G7,DISTANCE_F)=NB_SETS_G_F,B7,\"\"))","v":""},null,null,null,null,null,null,null,null,null,null,null,null,null,null,null,null,null,null,null,null,null,null,null,null,{"$f":"IF(COUNTIF(C7:G7,DISTANCE_F)=NB_SETS_G_F,VAL_PT_MATCH,0)","v":0},{"$f":"IF(AH10=2,(NB_SETS_G_F*2)-1-COUNTIF(C6:G6,DISTANCE_F),COUNTIF(C7:G7,DISTANCE_F))","v":0},0,{"$f":"SUM(C7:G7)","v":0},{"$f":"SUM(C6:G6)","v":0},{"$f":"IF(I10=AB10,IF(COUNTIF(J10:N10,DISTANCE_F)=NB_SETS_G_F,VAL_PT_MATCH,0),0)","v":0},{"$f":"IF(I10=AB10,IF(AM10=2,(NB_SETS_G_F*2)-1-COUNTIF(J11:N11,DISTANCE_F),COUNTIF(J10:N10,DISTANCE_F)),0)","v":0},0,{"$f":"IF(I10=AB10,SUM(J10:N10),0)","v":0},{"$f":"IF(I10=AB10,SUM(J11:N11),0)","v":0},{"$f":"IF(P18=AB10,IF(COUNTIF(Q18:U18,DISTANCE_F)=NB_SETS_G_F,VAL_PT_MATCH,0),0)","v":0},{"$f":"IF(P18=AB10,IF(AR10=2,(NB_SETS_G_F*2)-1-COUNTIF(Q19:U19,DISTANCE_F),COUNTIF(Q18:U18,DISTANCE_F)),0)","v":0},0,{"$f":"IF(P18=AB10,SUM(Q18:U18),0)","v":0},{"$f":"IF(P18=AB10,SUM(Q19:U19),0)","v":0},4,0,0,0,0,0,0]
[null,null,null,null,null,null,null,null,{"$f":"IF(COUNTIF(C14:G14,DISTANCE_F)=NB_SETS_G_F,B14,IF(COUNTIF(C15:G15,DISTANCE_F)=NB_SETS_G_F,B15,\"\"))","v":""}]
[]
[null,"4 - 5"]
[]
[]
[null,null,null,null,null,null,null,null,null,null,null,null,null,null,null,"- Finale -"]
[null,null,null,null,null,null,null,null,null,null,null,null,null,null,null,null,null,null,null,null,null,null,null,null,{"$f":"IF(Y18<>\"\",\"VAINQUEUR\",\"\")","v":""}]
[null,null,null,null,null,null,null,null,null,null,null,null,null,null,null,{"$f":"IF(COUNTIF(J10:N10,DISTANCE_F)=NB_SETS_G_F,I10,IF(COUNTIF(J11:N11,DISTANCE_F)=NB_SETS_G_F,I11,\"\"))","v":""},null,null,null,null,null,null,null,null,{"$f":"IF(COUNTIF(Q18:U18,DISTANCE_F)=NB_SETS_G_F,P18,IF(COUNTIF(Q19:U19,DISTANCE_F)=NB_SETS_G_F,P19,\"\"))","v":""}]
[null,null,null,null,null,null,null,null,null,null,null,null,null,null,null,{"$f":"IF(COUNTIF(J26:N26,DISTANCE_F)=NB_SETS_G_F,I26,IF(COUNTIF(J27:N27,DISTANCE_F)=NB_SETS_G_F,I27,\"\"))","v":""}]
[]
[null,"2 - 7"]
[]
[]
[]
[]
[null,null,null,null,null,null,null,null,{"$f":"IF(COUNTIF(C22:G22,DISTANCE_F)=NB_SETS_G_F,B22,IF(COUNTIF(C23:G23,DISTANCE_F)=NB_SETS_G_F,B23,\"\"))","v":""}]
[null,null,null,null,null,null,null,null,{"$f":"IF(COUNTIF(C30:G30,DISTANCE_F)=NB_SETS_G_F,B30,IF(COUNTIF(C31:G31,DISTANCE_F)=NB_SETS_G_F,B31,\"\"))","v":""}]
[]
[null,"3 - 6"]
[]
[]
[null,null,null,null,null,null," "]

{"sheet":"RefClassement compétition","index":23,"n_rows":6,"n_cols":10,"rows_kept":6,"cut":false,"hidden":true,"merged":[[3,0,3,8]]}
[null,{"$f":"TOURNOI & \" - \" & LIEU_TOURNOI","v":"T3 Qualification CD62 R1 - WIMILLE"}]
[null,{"$f":"DATE_TOURNOI","v":"2019-01-13"}]
[]
["Classement final"]
[]
["Place","Joueur",{"$f":"IF(NUM_TOURNOI>0,\"Pts Tournoi\",\"\")","v":"Pts Tournoi"},"Pts Match","Pts Set","Moy. Gen.","Moy. Part.","Pts Marq.","Pts Subis","Phase atteinte"]

{"sheet":"8èmesFinalRef","index":24,"n_rows":32,"n_cols":67,"rows_kept":32,"cut":false,"hidden":true,"merged":[[17,31,18,31]]}
[null,null,null,null,null,null,null,null,{"$f":" TOURNOI & \" - \" & LIEU_TOURNOI","v":"T3 Qualification CD62 R1 - WIMILLE"},null,null,null,null,null,null,null,null,null,null,null,null,null,null,null,null,null,null,null,null,null,null,null,null,null,null,"Résultats Reclassement",null,null,null,null,"Résultats 1/8 F.",null,null,null,null,"Résultats 1/4 F.",null,null,null,null,"Resultats 1/2 F.",null,null,null,null,"Resultats F.",null,null,null,null,"Total compétition"]
[null,"- 1/8 finale -",null,null,null,null,null,null,{"$f":"DATE_TOURNOI","v":"2019-01-13"},null,null,null,null,null,null,null,null,null,null,null,null,null,null,null,null,null,null,null,null,null,null,null,null,null,"Joueur","Pts Match","Pts set","Moy. Part.","Pts Marq.","Pts subis","Pts Match","Pts set","Moy.","Pts Marq.","Pts subis","Pts Match","Pts set","Moy.","Pts Marq.","Pts subis","Pts Match","Pts set","Moy.","Pts Marq.","Pts subis","Pts Match","Pts set","Moy.","Pts Marq.","Pts subis","Rang final","Pts Match","Pts set","Moy. Gen.","Moy. Part.","Pts Marq.","Pts subis"]
[null,"1 - 16",null,null,null,null,null,null,null,null,null,null,null,null,null,null,null,null,null,null,null,null,null,null,null,null,null,null,null,null,null,null,null,null,null,null,null,null,null,null,{"$f":"IF(COUNTIF(C4:G4,DISTANCE_8)=NB_SETS_G_8,VAL_PT_MATCH,0)","v":0},{"$f":"IF(AO3=VAL_PT_MATCH,(NB_SETS_G_8*2)-1-COUNTIF(C5:G5,DISTANCE_8),COUNTIF(C4:G4,DISTANCE_8))","v":0},{"$f":"IF(AS3<>0,ROUNDDOWN(AR3/AS3,3),0)","v":0},{"$f":"SUM(C4:G4)","v":0},{"$f":"SUM(C5:G5)","v":0},{"$f":"IF(I6=AI3,IF(COUNTIF(J6:N6,DISTANCE_F)=NB_SETS_G_F,VAL_PT_MATCH,0),0)","v":0},{"$f":"IF(I6=AI3,IF(AT3=VAL_PT_MATCH,(NB_SETS_G_F*2)-1-COUNTIF(J7:N7,DISTANCE_F),COUNTIF(J6:N6,DISTANCE_F)),0)","v":0},{"$f":"IF(AX3<>0,ROUNDDOWN(AW3/AX3,3),0)","v":0},{"$f":"IF(I6=AI3,SUM(J6:N6),0)","v":0},{"$f":"IF(I6=AI3,SUM(J7:N7),0)","v":0},{"$f":"IF(P10=AI3,IF(COUNTIF(Q10:U10,DISTANCE_F)=NB_SETS_G_F,VAL_PT_MATCH,0),0)","v":0},{"$f":"IF(P10=AI3,IF(AY3=VAL_PT_MATCH,(NB_SETS_G_F*2)-1-COUNTIF(Q11:U11,DISTANCE_F),COUNTIF(Q10:U10,DISTANCE_F)),0)","v":0},{"$f":"IF(BC3<>0,ROUNDDOWN(BB3/BC3,3),0)","v":0},{"$f":"IF(P10=AI3,SUM(Q10:U10),0)","v":0},{"$f":"IF(P10=AI3,SUM(Q11:U11),0)","v":0},{"$f":"IF(W18=AI3,IF(COUNTIF(X18:AB18,DISTANCE_F)=NB_SETS_G_F,VAL_PT_MATCH,0),0)","v":0},{"$f":"IF(W18=AI3,IF(BD3=VAL_PT_MATCH,(NB_SETS_G_F*2)-1-COUNTIF(X19:AB19,DISTANCE_F),COUNTIF(X18:AB18,DISTANCE_F)),0)","v":0},{"$f":"IF(BH3<>0,ROUNDDOWN(BG3/BH3,3),0)","v":0},{"$f":"IF(W18=AI3,SUM(X18:AB18),0)","v":0},{"$f":"IF(W18=AI3,SUM(X19:AB19),0)","v":0},{"$f":"IF(BD3=VAL_PT_MATCH,1,IF(AY3=VAL_PT_MATCH,2,IF(AT3=VAL_PT_MATCH,3,IF(AO3=VAL_PT_MATCH,4,5))))","v":5},{"$f":"SUM(AJ3,AO3,AT3,AY3,BD3)","v":0},{"$f":"SUM(AK3,AP3,AU3,AZ3,BE3)","v":0},{"$f":"IF(BO3<>0,ROUNDDOWN(BN3/BO3,3),0)","v":0},{"$f":"MAX(AL3,AQ3,AV3,BA3,BF3)","v":0},{"$f":"SUM(AM3,AR3,AW3,BB3,BG3)","v":0},{"$f":"SUM(AN3,AS3,AX3,BC3,BH3)","v":0}]
[null,null,null,null,null,null,null,null,"- 1/4 finale -",null,null,null,null,null,null,null,null,null,null,null,null,null,null,null,null,null,null,null,null,null,null,null,null,null,null,null,null,null,null,null,{"$f":"IF(COUNTIF(C32:G32,DISTANCE_8)=NB_SETS_G_8,VAL_PT_MATCH,0)","v":0},{"$f":"IF(AO4=VAL_PT_MATCH,(NB_SETS_G_8*2)-1-COUNTIF(C33:G33,DISTANCE_8),COUNTIF(C32:G32,DISTANCE_8))","v":0},0,{"$f":"SUM(C32:G32)","v":0},{"$f":"SUM(C33:G33)","v":0},{"$f":"IF(I31=AI4,IF(COUNTIF(J31:N31,DISTANCE_F)=NB_SETS_G_F,VAL_PT_MATCH,0),0)","v":0},{"$f":"IF(I31=AI4,IF(AT4=VAL_PT_MATCH,(NB_SETS_G_F*2)-1-COUNTIF(J30:N30,DISTANCE_F),COUNTIF(J31:N31,DISTANCE_F)),0)","v":0},0,{"$f":"IF(I31=AI4,SUM(J31:N31),0)","v":0},{"$f":"IF(I31=AI4,SUM(J30:N30),0)","v":0},{"$f":"IF(P27=AI4,IF(COUNTIF(Q27:U27,DISTANCE_F)=NB_SETS_G_F,VAL_PT_MATCH,0),0)","v":0},{"$f":"IF(P27=AI4,IF(AY4=VAL_PT_MATCH,(NB_SETS_G_F*2)-1-COUNTIF(Q26:U26,DISTANCE_F),COUNTIF(Q27:U27,DISTANCE_F)),0)","v":0},0,{"$f":"IF(P27=AI4,SUM(Q27:U27),0)","v":0},{"$f":"IF(P27=AI4,SUM(Q26:U26),0)","v":0},{"$f":"IF(W19=AI4,IF(COUNTIF(X19:AB19,DISTANCE_F)=NB_SETS_G_F,VAL_PT_MATCH,0),0)","v":0},{"$f":"IF(W19=AI4,IF(BD4=VAL_PT_MATCH,(NB_SETS_G_F*2)-1-COUNTIF(X18:AB18,DISTANCE_F),COUNTIF(X19:AB19,DISTANCE_F)),0)","v":0},0,{"$f":"IF(W19=AI4,SUM(X19:AB19),0)","v":0},{"$f":"IF(W19=AI4,SUM(X18:AB18),0)","v":0},5,0,0,{"$f":"IF(BO4<>0,ROUNDDOWN(BN4/BO4,3),0)","v":0},0,0,0]
[null,null,null,null,null,null,null,null,null,null,null,null,null,null,null,null,null,null,null,null,null,null,null,null,null,null,null,null,null,null,null,null,null,null,null,null,null,null,null,null,{"$f":"IF(COUNTIF(C20:G20,DISTANCE_8)=NB_SETS_G_8,VAL_PT_MATCH,0)","v":0},{"$f":"IF(AO5=VAL_PT_MATCH,(NB_SETS_G_8*2)-1-COUNTIF(C21:G21,DISTANCE_8),COUNTIF(C20:G20,DISTANCE_8))","v":0},0,{"$f":"SUM(C20:G20)","v":0},{"$f":"SUM(C21:G21)","v":0},{"$f":"IF(I22=AI5,IF(COUNTIF(J22:N22,DISTANCE_F)=NB_SETS_G_F,VAL_PT_MATCH,0),0)","v":0},{"$f":"IF(I22=AI5,IF(AT5=VAL_PT_MATCH,(NB_SETS_G_F*2)-1-COUNTIF(J23:N23,DISTANCE_F),COUNTIF(J22:N22,DISTANCE_F)),0)","v":0},0,{"$f":"IF(I22=AI5,SUM(J22:N22),0)","v":0},{"$f":"IF(I22=AI5,SUM(J23:N23),0)","v":0},{"$f":"IF(P26=AI5,IF(COUNTIF(Q26:U26,DISTANCE_F)=NB_SETS_G_F,VAL_PT_MATCH,0),0)","v":0},{"$f":"IF(P26=AI5,IF(AY5=VAL_PT_MATCH,(NB_SETS_G_F*2)-1-COUNTIF(Q27:U27,DISTANCE_F),COUNTIF(Q26:U26,DISTANCE_F)),0)","v":0},0,{"$f":"IF(P26=AI5,SUM(Q26:U26),0)","v":0},{"$f":"IF(P26=AI5,SUM(Q27:U27),0)","v":0},{"$f":"IF(W19=AI5,IF(COUNTIF(X19:AB19,DISTANCE_F)=NB_SETS_G_F,VAL_PT_MATCH,0),0)","v":0},{"$f":"IF(W19=AI5,IF(BD5=VAL_PT_MATCH,(NB_SETS_G_F*2)-1-COUNTIF(X18:AB18,DISTANCE_F),COUNTIF(X19:AB19,DISTANCE_F)),0)","v":0},0,{"$f":"IF(W19=AI5,SUM(X19:AB19),0)","v":0},{"$f":"IF(W19=AI5,SUM(X18:AB18),0)","v":0},5,0,0,0,0,0,0]
[null,null,null,null,null,null,null,null,{"$f":"IF(COUNTIF(C4:G4,DISTANCE_8)=NB_SETS_G_8,B4,IF(COUNTIF(C5:G5,DISTANCE_8)=NB_SETS_G_8,B5,\"\"))","v":""},null,null,null,null,null,null,null,null,null,null,null,null,null,null,null,null,null,null,null,null,null,null,null,null,null,null,null,null,null,null,null,{"$f":"IF(COUNTIF(C16:G16,DISTANCE_8)=NB_SETS_G_8,VAL_PT_MATCH,0)","v":0},{"$f":"IF(AO6=VAL_PT_MATCH,(NB_SETS_G_8*2)-1-COUNTIF(C17:G17,DISTANCE_8),COUNTIF(C16:G16,DISTANCE_8))","v":0},0,{"$f":"SUM(C16:G16)","v":0},{"$f":"SUM(C17:G17)","v":0},{"$f":"IF(I15=AI6,IF(COUNTIF(J15:N15,DISTANCE_F)=NB_SETS_G_F,VAL_PT_MATCH,0),0)","v":0},{"$f":"IF(I15=AI6,IF(AT6=VAL_PT_MATCH,(NB_SETS_G_F*2)-1-COUNTIF(J14:N14,DISTANCE_F),COUNTIF(J15:N15,DISTANCE_F)),0)","v":0},0,{"$f":"IF(I15=AI6,SUM(J15:N15),0)","v":0},{"$f":"IF(I15=AI6,SUM(J14:N14),0)","v":0},{"$f":"IF(P11=AI6,IF(COUNTIF(Q11:U11,DISTANCE_F)=NB_SETS_G_F,VAL_PT_MATCH,0),0)","v":0},{"$f":"IF(P11=AI6,IF(AY6=VAL_PT_MATCH,(NB_SETS_G_F*2)-1-COUNTIF(Q10:U10,DISTANCE_F),COUNTIF(Q11:U11,DISTANCE_F)),0)","v":0},0,{"$f":"IF(P11=AI6,SUM(Q11:U11),0)","v":0},{"$f":"IF(P11=AI6,SUM(Q10:U10),0)","v":0},{"$f":"IF(W18=AI6,IF(COUNTIF(X18:AB18,DISTANCE_F)=NB_SETS_G_F,VAL_PT_MATCH,0),0)","v":0},{"$f":"IF(W18=AI6,IF(BD6=VAL_PT_MATCH,(NB_SETS_G_F*2)-1-COUNTIF(X19:AB19,DISTANCE_F),COUNTIF(X18:AB18,DISTANCE_F)),0)","v":0},0,{"$f":"IF(W18=AI6,SUM(X18:AB18),0)","v":0},{"$f":"IF(W18=AI6,SUM(X19:AB19),0)","v":0},5,0,0,0,0,0,0]
[null,"8 - 9",null,null,null,null,null,null,{"$f":"IF(COUNTIF(C8:G8,DISTANCE_8)=NB_SETS_G_8,B8,IF(COUNTIF(C9:G9,DISTANCE_8)=NB_SETS_G_8,B9,\"\"))","v":""},null,null,null,null,null,null,null,null,null,null,null,null,null,null,null,null,null,null,null,null,null,null,null,null,null,null,null,null,null,null,null,{"$f":"IF(COUNTIF(C12:G12,DISTANCE_8)=NB_SETS_G_8,VAL_PT_MATCH,0)","v":0},{"$f":"IF(AO7=VAL_PT_MATCH,(NB_SETS_G_8*2)-1-COUNTIF(C13:G13,DISTANCE_8),COUNTIF(C12:G12,DISTANCE_8))","v":0},0,{"$f":"SUM(C12:G12)","v":0},{"$f":"SUM(C13:G13)","v":0},{"$f":"IF(I14=AI7,IF(COUNTIF(J14:N14,DISTANCE_F)=NB_SETS_G_F,VAL_PT_MATCH,0),0)","v":0},{"$f":"IF(I14=AI7,IF(AT7=VAL_PT_MATCH,(NB_SETS_G_F*2)-1-COUNTIF(J15:N15,DISTANCE_F),COUNTIF(J14:N14,DISTANCE_F)),0)","v":0},0,{"$f":"IF(I14=AI7,SUM(J14:N14),0)","v":0},{"$f":"IF(I14=AI7,SUM(J15:N15),0)","v":0},{"$f":"IF(P11=AI7,IF(COUNTIF(Q11:U11,DISTANCE_F)=NB_SETS_G_F,VAL_PT_MATCH,0),0)","v":0},{"$f":"IF(P11=AI7,IF(AY7=VAL_PT_MATCH,(NB_SETS_G_F*2)-1-COUNTIF(Q10:U10,DISTANCE_F),COUNTIF(Q11:U11,DISTANCE_F)),0)","v":0},0,{"$f":"IF(P11=AI7,SUM(Q11:U11),0)","v":0},{"$f":"IF(P11=AI7,SUM(Q10:U10),0)","v":0},{"$f":"IF(W18=AI7,IF(COUNTIF(X18:AB18,DISTANCE_F)=NB_SETS_G_F,VAL_PT_MATCH,0),0)","v":0},{"$f":"IF(W18=AI7,IF(BD7=VAL_PT_MATCH,(NB_SETS_G_F*2)-1-COUNTIF(X19:AB19,DISTANCE_F),COUNTIF(X18:AB18,DISTANCE_F)),0)","v":0},0,{"$f":"IF(W18=AI7,SUM(X18:AB18),0)","v":0},{"$f":"IF(W18=AI7,SUM(X19:AB19),0)","v":0},5,0,0,0,0,0,0]
[null,null,null,null,null,null,null,null,null,null,null,null,null,null,null,"- 1/2 finale -",null,null,null,null,null,null,null,null,null,null,null,null,null,null,null,null,null,null,null,null,null,null,null,null,{"$f":"IF(COUNTIF(C24:G24,DISTANCE_8)=NB_SETS_G_8,VAL_PT_MATCH,0)","v":0},{"$f":"IF(AO8=VAL_PT_MATCH,(NB_SETS_G_8*2)-1-COUNTIF(C25:G25,DISTANCE_8),COUNTIF(C24:G24,DISTANCE_8))","v":0},0,{"$f":"SUM(C24:G24)","v":0},{"$f":"SUM(C25:G25)","v":0},{"$f":"IF(I23=AI8,IF(COUNTIF(J23:N23,DISTANCE_F)=NB_SETS_G_F,VAL_PT_MATCH,0),0)","v":0},{"$f":"IF(I23=AI8,IF(AT8=VAL_PT_MATCH,(NB_SETS_G_F*2)-1-COUNTIF(J22:N22,DISTANCE_F),COUNTIF(J23:N23,DISTANCE_F)),0)","v":0},0,{"$f":"IF(I23=AI8,SUM(J23:N23),0)","v":0},{"$f":"IF(I23=AI8,SUM(J22:N22),0)","v":0},{"$f":"IF(P26=AI8,IF(COUNTIF(Q26:U26,DISTANCE_F)=NB_SETS_G_F,VAL_PT_MATCH,0),0)","v":0},{"$f":"IF(P26=AI8,IF(AY8=VAL_PT_MATCH,(NB_SETS_G_F*2)-1-COUNTIF(Q27:U27,DISTANCE_F),COUNTIF(Q26:U26,DISTANCE_F)),0)","v":0},0,{"$f":"IF(P26=AI8,SUM(Q26:U26),0)","v":0},{"$f":"IF(P26=AI8,SUM(Q27:U27),0)","v":0},{"$f":"IF(W19=AI8,IF(COUNTIF(X19:AB19,DISTANCE_F)=NB_SETS_G_F,VAL_PT_MATCH,0),0)","v":0},{"$f":"IF(W19=AI8,IF(BD8=VAL_PT_MATCH,(NB_SETS_G_F*2)-1-COUNTIF(X18:AB18,DISTANCE_F),COUNTIF(X19:AB19,DISTANCE_F)),0)","v":0},0,{"$f":"IF(W19=AI8,SUM(X19:AB19),0)","v":0},{"$f":"IF(W19=AI8,SUM(X18:AB18),0)","v":0},5,0,0,0,0,0,0]
[null,null,null,null,null,null,null,null,null,null,null,null,null,null,null,null,null,null,null,null,null,null,null,null,null,null,null,null,null,null,null,null,null,null,null,null,null,null,null,null,{"$f":"IF(COUNTIF(C28:G28,DISTANCE_8)=NB_SETS_G_8,VAL_PT_MATCH,0)","v":0},{"$f":"IF(AO9=VAL_PT_MATCH,(NB_SETS_G_8*2)-1-COUNTIF(C29:G29,DISTANCE_8),COUNTIF(C28:G28,DISTANCE_8))","v":0},0,{"$f":"SUM(C28:G28)","v":0},{"$f":"SUM(C29:G29)","v":0},{"$f":"IF(I30=AI9,IF(COUNTIF(J30:N30,DISTANCE_F)=NB_SETS_G_F,VAL_PT_MATCH,0),0)","v":0},{"$f":"IF(I30=AI9,IF(AT9=VAL_PT_MATCH,(NB_SETS_G_F*2)-1-COUNTIF(J31:N31,DISTANCE_F),COUNTIF(J30:N30,DISTANCE_F)),0)","v":0},0,{"$f":"IF(I30=AI9,SUM(J30:N30),0)","v":0},{"$f":"IF(I30=AI9,SUM(J31:N31),0)","v":0},{"$f":"IF(P27=AI9,IF(COUNTIF(Q27:U27,DISTANCE_F)=NB_SETS_G_F,VAL_PT_MATCH,0),0)","v":0},{"$f":"IF(P27=AI9,IF(AY9=VAL_PT_MATCH,(NB_SETS_G_F*2)-1-COUNTIF(Q26:U26,DISTANCE_F),COUNTIF(Q27:U27,DISTANCE_F)),0)","v":0},0,{"$f":"IF(P27=AI9,SUM(Q27:U27),0)","v":0},{"$f":"IF(P27=AI9,SUM(Q26:U26),0)","v":0},{"$f":"IF(W19=AI9,IF(COUNTIF(X19:AB19,DISTANCE_F)=NB_SETS_G_F,VAL_PT_MATCH,0),0)","v":0},{"$f":"IF(W19=AI9,IF(BD9=VAL_PT_MATCH,(NB_SETS_G_F*2)-1-COUNTIF(X18:AB18,DISTANCE_F),COUNTIF(X19:AB19,DISTANCE_F)),0)","v":0},0,{"$f":"IF(W19=AI9,SUM(X19:AB19),0)","v":0},{"$f":"IF(W19=AI9,SUM(X18:AB18),0)","v":0},5,0,0,0,0,0,0]
[null,null,null,null,null,null,null,null,null,null,null,null,null,null,null,{"$f":"IF(COUNTIF(J6:N6,DISTANCE_F)=NB_SETS_G_F,I6,IF(COUNTIF(J7:N7,DISTANCE_F)=NB_SETS_G_F,I7,\"\"))","v":""},null,null,null,null,null,null,null,null,null,null,null,null,null,null,null,null,null,null,null,null,null,null,null,null,{"$f":"IF(COUNTIF(C8:G8,DISTANCE_8)=NB_SETS_G_8,VAL_PT_MATCH,0)","v":0},{"$f":"IF(AO10=VAL_PT_MATCH,(NB_SETS_G_8*2)-1-COUNTIF(C9:G9,DISTANCE_8),COUNTIF(C8:G8,DISTANCE_8))","v":0},0,{"$f":"SUM(C8:G8)","v":0},{"$f":"SUM(C9:G9)","v":0},{"$f":"IF(I7=AI10,IF(COUNTIF(J7:N7,DISTANCE_F)=NB_SETS_G_F,VAL_PT_MATCH,0),0)","v":0},{"$f":"IF(I7=AI10,IF(AT10=VAL_PT_MATCH,(NB_SETS_G_F*2)-1-COUNTIF(J6:N6,DISTANCE_F),COUNTIF(J7:N7,DISTANCE_F)),0)","v":0},0,{"$f":"IF(I7=AI10,SUM(J7:N7),0)","v":0},{"$f":"IF(I7=AI10,SUM(J6:N6),0)","v":0},{"$f":"IF(P10=AI10,IF(COUNTIF(Q10:U10,DISTANCE_F)=NB_SETS_G_F,VAL_PT_MATCH,0),0)","v":0},{"$f":"IF(P10=AI10,IF(AY10=VAL_PT_MATCH,(NB_SETS_G_F*2)-1-COUNTIF(Q11:U11,DISTANCE_F),COUNTIF(Q10:U10,DISTANCE_F)),0)","v":0},0,{"$f":"IF(P10=AI10,SUM(Q10:U10),0)","v":0},{"$f":"IF(P10=AI10,SUM(Q11:U11),0)","v":0},{"$f":"IF(W18=AI10,IF(COUNTIF(X18:AB18,DISTANCE_F)=NB_SETS_G_F,VAL_PT_MATCH,0),0)","v":0},{"$f":"IF(W18=AI10,IF(BD10=VAL_PT_MATCH,(NB_SETS_G_F*2)-1-COUNTIF(X19:AB19,DISTANCE_F),COUNTIF(X18:AB18,DISTANCE_F)),0)","v":0},0,{"$f":"IF(W18=AI10,SUM(X18:AB18),0)","v":0},{"$f":"IF(W18=AI10,SUM(X19:AB19),0)","v":0},5,0,0,0,0,0,0]
[null,"5 - 12",null,null,null,null,null,null,null,null,null,null,null,null,null,{"$f":"IF(COUNTIF(J14:N14,DISTANCE_F)=NB_SETS_G_F,I14,IF(COUNTIF(J15:N15,DISTANCE_F)=NB_SETS_G_F,I15,\"\"))","v":""},null,null,null,null,null,null,null,null,null,null,null,null,null,null,null,null,null,null,null,null,null,null,null,null,{"$f":"IF(COUNTIF(C9:G9,DISTANCE_8)=NB_SETS_G_8,VAL_PT_MATCH,0)","v":0},{"$f":"IF(AO11=VAL_PT_MATCH,(NB_SETS_G_8*2)-1-COUNTIF(C8:G8,DISTANCE_8),COUNTIF(C9:G9,DISTANCE_8))","v":0},0,{"$f":"SUM(C9:G9)","v":0},{"$f":"SUM(C8:G8)","v":0},{"$f":"IF(I7=AI11,IF(COUNTIF(J7:N7,DISTANCE_F)=NB_SETS_G_F,VAL_PT_MATCH,0),0)","v":0},{"$f":"IF(I7=AI11,IF(AT11=VAL_PT_MATCH,(NB_SETS_G_F*2)-1-COUNTIF(J6:N6,DISTANCE_F),COUNTIF(J7:N7,DISTANCE_F)),0)","v":0},0,{"$f":"IF(I7=AI11,SUM(J7:N7),0)","v":0},{"$f":"IF(I7=AI11,SUM(J6:N6),0)","v":0},{"$f":"IF(P10=AI11,IF(COUNTIF(Q10:U10,DISTANCE_F)=NB_SETS_G_F,VAL_PT_MATCH,0),0)","v":0},{"$f":"IF(P10=AI11,IF(AY11=VAL_PT_MATCH,(NB_SETS_G_F*2)-1-COUNTIF(Q11:U11,DISTANCE_F),COUNTIF(Q10:U10,DISTANCE_F)),0)","v":0},0,{"$f":"IF(P10=AI11,SUM(Q10:U10),0)","v":0},{"$f":"IF(P10=AI11,SUM(Q11:U11),0)","v":0},{"$f":"IF(W18=AI11,IF(COUNTIF(X18:AB18,DISTANCE_F)=NB_SETS_G_F,VAL_PT_MATCH,0),0)","v":0},{"$f":"IF(W18=AI11,IF(BD11=VAL_PT_MATCH,(NB_SETS_G_F*2)-1-COUNTIF(X19:AB19,DISTANCE_F),COUNTIF(X18:AB18,DISTANCE_F)),0)","v":0},0,{"$f":"IF(W18=AI11,SUM(X18:AB18),0)","v":0},{"$f":"IF(W18=AI11,SUM(X19:AB19),0)","v":0},5,0,0,0,0,0,0]
[null,null,null,null,null,null,null,null,null,null,null,null,null,null,null,null,null,null,null,null,null,null,null,null,null,null,null,null,null,null,null,null,null,null,null,null,null,null,null,null,{"$f":"IF(COUNTIF(C29:G29,DISTANCE_8)=NB_SETS_G_8,VAL_PT_MATCH,0)","v":0},{"$f":"IF(AO12=VAL_PT_MATCH,(NB_SETS_G_8*2)-1-COUNTIF(C28:G28,DISTANCE_8),COUNTIF(C29:G29,DISTANCE_8))","v":0},0,{"$f":"SUM(C29:G29)","v":0},{"$f":"SUM(C28:G28)","v":0},{"$f":"IF(I30=AI12,IF(COUNTIF(J30:N30,DISTANCE_F)=NB_SETS_G_F,VAL_PT_MATCH,0),0)","v":0},{"$f":"IF(I30=AI12,IF(AT12=VAL_PT_MATCH,(NB_SETS_G_F*2)-1-COUNTIF(J31:N31,DISTANCE_F),COUNTIF(J30:N30,DISTANCE_F)),0)","v":0},0,{"$f":"IF(I30=AI12,SUM(J30:N30),0)","v":0},{"$f":"IF(I30=AI12,SUM(J31:N31),0)","v":0},{"$f":"IF(P27=AI12,IF(COUNTIF(Q27:U27,DISTANCE_F)=NB_SETS_G_F,VAL_PT_MATCH,0),0)","v":0},{"$f":"IF(P27=AI12,IF(AY12=VAL_PT_MATCH,(NB_SETS_G_F*2)-1-COUNTIF(Q26:U26,DISTANCE_F),COUNTIF(Q27:U27,DISTANCE_F)),0)","v":0},0,{"$f":"IF(P27=AI12,SUM(Q27:U27),0)","v":0},{"$f":"IF(P27=AI12,SUM(Q26:U26),0)","v":0},{"$f":"IF(W19=AI12,IF(COUNTIF(X19:AB19,DISTANCE_F)=NB_SETS_G_F,VAL_PT_MATCH,0),0)","v":0},{"$f":"IF(W19=AI12,IF(BD12=VAL_PT_MATCH,(NB_SETS_G_F*2)-1-COUNTIF(X18:AB18,DISTANCE_F),COUNTIF(X19:AB19,DISTANCE_F)),0)","v":0},0,{"$f":"IF(W19=AI12,SUM(X19:AB19),0)","v":0},{"$f":"IF(W19=AI12,SUM(X18:AB18),0)","v":0},5,0,0,0,0,0,0]
[null,null,null,null,null,null,null,null,null,null,null,null,null,null,null,null,null,null,null,null,null,null,null,null,null,null,null,null,null,null,null,null,null,null,null,null,null,null,null,null,{"$f":"IF(COUNTIF(C25:G25,DISTANCE_8)=NB_SETS_G_8,VAL_PT_MATCH,0)","v":0},{"$f":"IF(AO13=VAL_PT_MATCH,(NB_SETS_G_8*2)-1-COUNTIF(C24:G24,DISTANCE_8),COUNTIF(C25:G25,DISTANCE_8))","v":0},0,{"$f":"SUM(C25:G25)","v":0},{"$f":"SUM(C24:G24)","v":0},{"$f":"IF(I23=AI13,IF(COUNTIF(J23:N23,DISTANCE_F)=NB_SETS_G_F,VAL_PT_MATCH,0),0)","v":0},{"$f":"IF(I23=AI13,IF(AT13=VAL_PT_MATCH,(NB_SETS_G_F*2)-1-COUNTIF(J22:N22,DISTANCE_F),COUNTIF(J23:N23,DISTANCE_F)),0)","v":0},0,{"$f":"IF(I23=AI13,SUM(J23:N23),0)","v":0},{"$f":"IF(I23=AI13,SUM(J22:N22),0)","v":0},{"$f":"IF(P26=AI13,IF(COUNTIF(Q26:U26,DISTANCE_F)=NB_SETS_G_F,VAL_PT_MATCH,0),0)","v":0},{"$f":"IF(P26=AI13,IF(AY13=VAL_PT_MATCH,(NB_SETS_G_F*2)-1-COUNTIF(Q27:U27,DISTANCE_F),COUNTIF(Q26:U26,DISTANCE_F)),0)","v":0},0,{"$f":"IF(P26=AI13,SUM(Q26:U26),0)","v":0},{"$f":"IF(P26=AI13,SUM(Q27:U27),0)","v":0},{"$f":"IF(W19=AI13,IF(COUNTIF(X19:AB19,DISTANCE_F)=NB_SETS_G_F,VAL_PT_MATCH,0),0)","v":0},{"$f":"IF(W19=AI13,IF(BD13=VAL_PT_MATCH,(NB_SETS_G_F*2)-1-COUNTIF(X18:AB18,DISTANCE_F),COUNTIF(X19:AB19,DISTANCE_F)),0)","v":0},0,{"$f":"IF(W19=AI13,SUM(X19:AB19),0)","v":0},{"$f":"IF(W19=AI13,SUM(X18:AB18),0)","v":0},5,0,0,0,0,0,0]
[null,null,null,null,null,null,null,null,{"$f":"IF(COUNTIF(C12:G12,DISTANCE_8)=NB_SETS_G_8,B12,IF(COUNTIF(C13:G13,DISTANCE_8)=NB_SETS_G_8,B13,\"\"))","v":""},null,null,null,null,null,null,null,null,null,null,null,null,null,null,null,null,null,null,null,null,null,null,null,null,null,null,null,null,null,null,null,{"$f":"IF(COUNTIF(C13:G13,DISTANCE_8)=NB_SETS_G_8,VAL_PT_MATCH,0)","v":0},{"$f":"IF(AO14=VAL_PT_MATCH,(NB_SETS_G_8*2)-1-COUNTIF(C12:G12,DISTANCE_8),COUNTIF(C13:G13,DISTANCE_8))","v":0},0,{"$f":"SUM(C13:G13)","v":0},{"$f":"SUM(C12:G12)","v":0},{"$f":"IF(I14=AI14,IF(COUNTIF(J14:N14,DISTANCE_F)=NB_SETS_G_F,VAL_PT_MATCH,0),0)","v":0},{"$f":"IF(I14=AI14,IF(AT14=VAL_PT_MATCH,(NB_SETS_G_F*2)-1-COUNTIF(J15:N15,DISTANCE_F),COUNTIF(J14:N14,DISTANCE_F)),0)","v":0},0,{"$f":"IF(I14=AI14,SUM(J14:N14),0)","v":0},{"$f":"IF(I14=AI14,SUM(J15:N15),0)","v":0},{"$f":"IF(P11=AI14,IF(COUNTIF(Q11:U11,DISTANCE_F)=NB_SETS_G_F,VAL_PT_MATCH,0),0)","v":0},{"$f":"IF(P11=AI14,IF(AY14=VAL_PT_MATCH,(NB_SETS_G_F*2)-1-COUNTIF(Q10:U10,DISTANCE_F),COUNTIF(Q11:U11,DISTANCE_F)),0)","v":0},0,{"$f":"IF(P11=AI14,SUM(Q11:U11),0)","v":0},{"$f":"IF(P11=AI14,SUM(Q10:U10),0)","v":0},{"$f":"IF(W18=AI14,IF(COUNTIF(X18:AB18,DISTANCE_F)=NB_SETS_G_F,VAL_PT_MATCH,0),0)","v":0},{"$f":"IF(W18=AI14,IF(BD14=VAL_PT_MATCH,(NB_SETS_G_F*2)-1-COUNTIF(X19:AB19,DISTANCE_F),COUNTIF(X18:AB18,DISTANCE_F)),0)","v":0},0,{"$f":"IF(W18=AI14,SUM(X18:AB18),0)","v":0},{"$f":"IF(W18=AI14,SUM(X19:AB19),0)","v":0},5,0,0,0,0,0,0]
[null,"4 - 13",null,null,null,null,null,null,{"$f":"IF(COUNTIF(C16:G16,DISTANCE_8)=NB_SETS_G_8,B16,IF(COUNTIF(C17:G17,DISTANCE_8)=NB_SETS_G_8,B17,\"\"))","v":""},null,null,null,null,null,null,null,null,null,null,null,null,null,null,null,null,null,null,null,null,null,null,null,null,null,null,null,null,null,null,null,{"$f":"IF(COUNTIF(C17:G17,DISTANCE_8)=NB_SETS_G_8,VAL_PT_MATCH,0)","v":0},{"$f":"IF(AO15=VAL_PT_MATCH,(NB_SETS_G_8*2)-1-COUNTIF(C16:G16,DISTANCE_8),COUNTIF(C17:G17,DISTANCE_8))","v":0},0,{"$f":"SUM(C17:G17)","v":0},{"$f":"SUM(C16:G16)","v":0},{"$f":"IF(I15=AI15,IF(COUNTIF(J15:N15,DISTANCE_F)=NB_SETS_G_F,VAL_PT_MATCH,0),0)","v":0},{"$f":"IF(I15=AI15,IF(AT15=VAL_PT_MATCH,(NB_SETS_G_F*2)-1-COUNTIF(J14:N14,DISTANCE_F),COUNTIF(J15:N15,DISTANCE_F)),0)","v":0},0,{"$f":"IF(I15=AI15,SUM(J15:N15),0)","v":0},{"$f":"IF(I15=AI15,SUM(J14:N14),0)","v":0},{"$f":"IF(P11=AI15,IF(COUNTIF(Q11:U11,DISTANCE_F)=NB_SETS_G_F,VAL_PT_MATCH,0),0)","v":0},{"$f":"IF(P11=AI15,IF(AY15=VAL_PT_MATCH,(NB_SETS_G_F*2)-1-COUNTIF(Q10:U10,DISTANCE_F),COUNTIF(Q11:U11,DISTANCE_F)),0)","v":0},0,{"$f":"IF(P11=AI15,SUM(Q11:U11),0)","v":0},{"$f":"IF(P11=AI15,SUM(Q10:U10),0)","v":0},{"$f":"IF(W18=AI15,IF(COUNTIF(X18:AB18,DISTANCE_F)=NB_SETS_G_F,VAL_PT_MATCH,0),0)","v":0},{"$f":"IF(W18=AI15,IF(BD15=VAL_PT_MATCH,(NB_SETS_G_F*2)-1-COUNTIF(X19:AB19,DISTANCE_F),COUNTIF(X18:AB18,DISTANCE_F)),0)","v":0},0,{"$f":"IF(W18=AI15,SUM(X18:AB18),0)","v":0},{"$f":"IF(W18=AI15,SUM(X19:AB19),0)","v":0},5,0,0,0,0,0,0]
[null,null,null,null,null,null,null,null,null,null,null,null,null,null,null,null,null,null,null,null,null,null,"- Finale -",null,null,null,null,null,null,null,null,null,null,null,null,null,null,null,null,null,{"$f":"IF(COUNTIF(C21:G21,DISTANCE_8)=NB_SETS_G_8,VAL_PT_MATCH,0)","v":0},{"$f":"IF(AO16=VAL_PT_MATCH,(NB_SETS_G_8*2)-1-COUNTIF(C20:G20,DISTANCE_8),COUNTIF(C21:G21,DISTANCE_8))","v":0},0,{"$f":"SUM(C21:G21)","v":0},{"$f":"SUM(C20:G20)","v":0},{"$f":"IF(I22=AI16,IF(COUNTIF(J22:N22,DISTANCE_F)=NB_SETS_G_F,VAL_PT_MATCH,0),0)","v":0},{"$f":"IF(I22=AI16,IF(AT16=VAL_PT_MATCH,(NB_SETS_G_F*2)-1-COUNTIF(J23:N23,DISTANCE_F),COUNTIF(J22:N22,DISTANCE_F)),0)","v":0},0,{"$f":"IF(I22=AI16,SUM(J22:N22),0)","v":0},{"$f":"IF(I22=AI16,SUM(J23:N23),0)","v":0},{"$f":"IF(P26=AI16,IF(COUNTIF(Q26:U26,DISTANCE_F)=NB_SETS_G_F,VAL_PT_MATCH,0),0)","v":0},{"$f":"IF(P26=AI16,IF(AY16=VAL_PT_MATCH,(NB_SETS_G_F*2)-1-COUNTIF(Q27:U27,DISTANCE_F),COUNTIF(Q26:U26,DISTANCE_F)),0)","v":0},0,{"$f":"IF(P26=AI16,SUM(Q26:U26),0)","v":0},{"$f":"IF(P26=AI16,SUM(Q27:U27),0)","v":0},{"$f":"IF(W19=AI16,IF(COUNTIF(X19:AB19,DISTANCE_F)=NB_SETS_G_F,VAL_PT_MATCH,0),0)","v":0},{"$f":"IF(W19=AI16,IF(BD16=VAL_PT_MATCH,(NB_SETS_G_F*2)-1-COUNTIF(X18:AB18,DISTANCE_F),COUNTIF(X19:AB19,DISTANCE_F)),0)","v":0},0,{"$f":"IF(W19=AI16,SUM(X19:AB19),0)","v":0},{"$f":"IF(W19=AI16,SUM(X18:AB18),0)","v":0},5,0,0,0,0,0,0]
[null,null,null,null,null,null,null,null,null,null,null,null,null,null,null,null,null,null,null,null,null,null,null,null,null,null,null,null,null,null,null,{"$f":"IF(AF18<>\"\",\"VAINQUEUR\",\"\")","v":""},null,null,null,null,null,null,null,null,{"$f":"IF(COUNTIF(C33:G33,DISTANCE_8)=NB_SETS_G_8,VAL_PT_MATCH,0)","v":0},{"$f":"IF(AO17=VAL_PT_MATCH,(NB_SETS_G_8*2)-1-COUNTIF(C32:G32,DISTANCE_8),COUNTIF(C33:G33,DISTANCE_8))","v":0},0,{"$f":"SUM(C33:G33)","v":0},{"$f":"SUM(C32:G32)","v":0},{"$f":"IF(I31=AI17,IF(COUNTIF(J31:N31,DISTANCE_F)=NB_SETS_G_F,VAL_PT_MATCH,0),0)","v":0},{"$f":"IF(I31=AI17,IF(AT17=VAL_PT_MATCH,(NB_SETS_G_F*2)-1-COUNTIF(J30:N30,DISTANCE_F),COUNTIF(J31:N31,DISTANCE_F)),0)","v":0},0,{"$f":"IF(I31=AI17,SUM(J31:N31),0)","v":0},{"$f":"IF(I31=AI17,SUM(J30:N30),0)","v":0},{"$f":"IF(P27=AI17,IF(COUNTIF(Q27:U27,DISTANCE_F)=NB_SETS_G_F,VAL_PT_MATCH,0),0)","v":0},{"$f":"IF(P27=AI17,IF(AY17=VAL_PT_MATCH,(NB_SETS_G_F*2)-1-COUNTIF(Q26:U26,DISTANCE_F),COUNTIF(Q27:U27,DISTANCE_F)),0)","v":0},0,{"$f":"IF(P27=AI17,SUM(Q27:U27),0)","v":0},{"$f":"IF(P27=AI17,SUM(Q26:U26),0)","v":0},{"$f":"IF(W19=AI17,IF(COUNTIF(X19:AB19,DISTANCE_F)=NB_SETS_G_F,VAL_PT_MATCH,0),0)","v":0},{"$f":"IF(W19=AI17,IF(BD17=VAL_PT_MATCH,(NB_SETS_G_F*2)-1-COUNTIF(X18:AB18,DISTANCE_F),COUNTIF(X19:AB19,DISTANCE_F)),0)","v":0},0,{"$f":"IF(W19=AI17,SUM(X19:AB19),0)","v":0},{"$f":"IF(W19=AI17,SUM(X18:AB18),0)","v":0},5,0,0,0,0,0,0]
[null,null,null,null,null,null,null,null,null,null,null,null,null,null,null,null,null,null,null,null,null,null,{"$f":"IF(COUNTIF(Q10:U10,DISTANCE_F)=NB_SETS_G_F,P10,IF(COUNTIF(Q11:U11,DISTANCE_F)=NB_SETS_G_F,P11,\"\"))","v":""},null,null,null,null,null,null,null,null,{"$f":"IF(COUNTIF(X18:AB18,DISTANCE_F)=NB_SETS_G_F,W18,IF(COUNTIF(X19:AB19,DISTANCE_F)=NB_SETS_G_F,W19,\"\"))","v":""},null,null,null,null,null,null,null,null,{"$f":"IF(COUNTIF(C5:G5,DISTANCE_8)=NB_SETS_G_8,VAL_PT_MATCH,0)","v":0},{"$f":"IF(AO18=VAL_PT_MATCH,(NB_SETS_G_8*2)-1-COUNTIF(C4:G4,DISTANCE_8),COUNTIF(C5:G5,DISTANCE_8))","v":0},0,{"$f":"SUM(C5:G5)","v":0},{"$f":"SUM(C4:G4)","v":0},{"$f":"IF(I6=AI18,IF(COUNTIF(J6:N6,DISTANCE_F)=NB_SETS_G_F,VAL_PT_MATCH,0),0)","v":0},{"$f":"IF(I6=AI18,IF(AT18=VAL_PT_MATCH,(NB_SETS_G_F*2)-1-COUNTIF(J7:N7,DISTANCE_F),COUNTIF(J6:N6,DISTANCE_F)),0)","v":0},0,{"$f":"IF(I6=AI18,SUM(J6:N6),0)","v":0},{"$f":"IF(I6=AI18,SUM(J7:N7),0)","v":0},{"$f":"IF(P10=AI18,IF(COUNTIF(Q10:U10,DISTANCE_F)=NB_SETS_G_F,VAL_PT_MATCH,0),0)","v":0},{"$f":"IF(P10=AI18,IF(AY18=VAL_PT_MATCH,(NB_SETS_G_F*2)-1-COUNTIF(Q11:U11,DISTANCE_F),COUNTIF(Q10:U10,DISTANCE_F)),0)","v":0},0,{"$f":"IF(P10=AI18,SUM(Q10:U10),0)","v":0},{"$f":"IF(P10=AI18,SUM(Q11:U11),0)","v":0},{"$f":"IF(W18=AI18,IF(COUNTIF(X18:AB18,DISTANCE_F)=NB_SETS_G_F,VAL_PT_MATCH,0),0)","v":0},{"$f":"IF(W18=AI18,IF(BD18=VAL_PT_MATCH,(NB_SETS_G_F*2)-1-COUNTIF(X19:AB19,DISTANCE_F),COUNTIF(X18:AB18,DISTANCE_F)),0)","v":0},0,{"$f":"IF(W18=AI18,SUM(X18:AB18),0)","v":0},{"$f":"IF(W18=AI18,SUM(X19:AB19),0)","v":0},5,0,0,0,0,0,0]
[null,"3 - 14",null,null,null,null,null,null,null,null,null,null,null,null,null,null,null,null,null,null,null,null,{"$f":"IF(COUNTIF(Q26:U26,DISTANCE_F)=NB_SETS_G_F,P26,IF(COUNTIF(Q27:U27,DISTANCE_F)=NB_SETS_G_F,P27,\"\"))","v":""}]
[]
[]
[null,null,null,null,null,null,null,null,{"$f":"IF(COUNTIF(C20:G20,DISTANCE_8)=NB_SETS_G_8,B20,IF(COUNTIF(C21:G21,DISTANCE_8)=NB_SETS_G_8,B21,\"\"))","v":""}]
[null,"6 - 11",null,null,null,null,null,null,{"$f":"IF(COUNTIF(C24:G24,DISTANCE_8)=NB_SETS_G_8,B24,IF(COUNTIF(C25:G25,DISTANCE_8)=NB_SETS_G_8,B25,\"\"))","v":""}]
[]
[]
[null,null,null,null,null,null,null,null,null,null,null,null,null,null,null,{"$f":"IF(COUNTIF(J22:N22,DISTANCE_F)=NB_SETS_G_F,I22,IF(COUNTIF(J23:N23,DISTANCE_F)=NB_SETS_G_F,I23,\"\"))","v":""}]
[null,"7 - 10",null,null,null,null,null,null,null,null,null,null,null,null,null,{"$f":"IF(COUNTIF(J30:N30,DISTANCE_F)=NB_SETS_G_F,I30,IF(COUNTIF(J31:N31,DISTANCE_F)=NB_SETS_G_F,I31,\"\"))","v":""}]
[]
[]
[null,null,null,null,null,null,null,null,{"$f":"IF(COUNTIF(C28:G28,DISTANCE_8)=NB_SETS_G_8,B28,IF(COUNTIF(C29:G29,DISTANCE_8)=NB_SETS_G_8,B29,\"\"))","v":""}]
[null,"2 - 15",null,null,null,null,null,null,{"$f":"IF(COUNTIF(C32:G32,DISTANCE_8)=NB_SETS_G_8,B32,IF(COUNTIF(C33:G33,DISTANCE_8)=NB_SETS_G_8,B33,\"\"))","v":""}]
[null,null,null,null,null,null,null,null,null,null,null,null,null," "]