{"text_format":"1","workbook":"xlsx","n_sheets":2,"sheets":["Feuille de Match","Joueurs"],"not_rendered":{"charts":0,"images":4,"macros":1,"external_links":0,"defined_names":67,"comments":0,"pivot_tables":0},"unopened":[],"bounds":{"document_bytes":16777216,"sheet_cells":100000,"rows_first":2000,"rows_last":500,"rows_between":2000,"halvings":0,"cell_chars":16384,"cell_head_chars":4096},"cells_cut":0,"cells_raw":0,"read":"whole","date_system":"1900"}

{"sheet":"Feuille de Match","index":0,"n_rows":73,"n_cols":35,"rows_kept":73,"cut":false,"hidden":false,"merged":[[0,4,0,10],[14,31,15,31],[14,32,15,32],[14,33,15,33],[14,34,15,34],[8,31,8,34],[9,28,9,29],[10,28,11,28],[12,31,13,31],[12,32,13,32],[12,33,13,33],[12,34,13,34],[9,31,9,32],[9,33,9,34],[10,31,11,31],[10,32,11,32],[10,33,11,33],[10,34,11,34],[10,29,11,29],[12,28,13,28],[12,29,13,29],[14,28,15,28],[14,29,15,29],[10,27,11,27],[14,27,15,27],[21,1,22,1],[14,2,15,2],[10,2,11,2],[8,3,8,9],[21,6,21,7],[16,1,16,3],[14,4,15,4],[12,4,13,4],[8,26,8,29],[19,3,19,8],[9,26,9,27],[10,17,11,17],[16,10,16,12],[10,4,11,4],[10,5,11,5],[10,7,11,7],[8,12,8,18],[10,18,11,18],[10,8,11,8],[10,9,11,9],[10,15,11,15],[14,17,15,17],[19,12,19,17],[10,0,11,0],[12,0,13,0],[14,0,15,0],[12,2,13,2],[10,26,11,26],[10,19,11,19],[12,19,13,19],[14,19,15,19],[14,11,15,11],[10,6,11,6],[14,5,15,5],[12,7,13,7],[14,26,15,26],[12,26,13,26],[12,18,13,18],[14,18,15,18],[12,16,13,16],[12,9,13,9],[14,9,15,9],[12,13,13,13],[14,15,15,15],[14,13,15,13],[14,14,15,14],[12,11,13,11],[12,15,13,15],[21,15,21,16],[12,17,13,17],[14,16,15,16],[2,11,2,16],[0,11,0,16],[4,11,4,16],[10,16,11,16],[10,11,11,11],[6,12,6,17],[10,14,11,14],[10,13,11,13],[30,27,32,29],[67,26,67,29],[39,27,40,29],[47,27,48,29],[54,27,55,29],[60,26,60,29],[33,1,33,16],[32,12,32,16],[12,5,13,5],[14,6,15,6],[27,19,28,19],[12,27,13,27],[37,5,37,10],[27,3,27,7],[12,14,13,14],[12,8,13,8],[36,5,36,10],[35,5,35,10],[12,6,13,6],[14,8,15,8],[14,7,15,7],[31,12,31,16],[22,15,22,16],[27,12,27,16]]}
[null,"COMITE DEPARTEMENTAL 62",null,null,"L'activation des macros est indispensable pour Continuez !!!",null,null,null,null,null,null,"Matches par équipes 62",null,null,null,null,null,null,null,null,"2022-2023",{"$f":"IF(Division=7,\"50\",\"\")","v":""}]
[null,null,null,null,null,null,null,null,null,null,null,null,null,null,null,null,null,null,null,null,"Plafond de la",null,null,null,null,null,null,null,"Choix de la"]
[null,{"$f":"IF($C$3<>\"\",VLOOKUP($C$3,$AC$4:$AD$7,2,FALSE),\"\")","v":""},null,null,null,null,null,null,null,null,null,{"$f":"\"Saison\"& \" \" &U1","v":"Saison 2022-2023"},null,null,null,null,null,null,null,null,"Division",null,null,null,null,null,null,null,"Division"]
[null,null,null,null,null,null,null,null,null,null,null,null,null,null,null,null,null,null,null,null,{"$f":"IF(C3=\"\",\"\",IF(C3=1,2000,IF(C3=2,1200,IF(C3=6,700,IF(C3=7,400)))))","v":""},null,null,null,null,null,null,{"$f":"'Feuille de Match'!AC4:AC7","v":1},1,"Triathlon"]
[null,null,null,null,null,null,null,null,null,null,null,{"$f":"IF(OR(D9=\"\"),\"\",VLOOKUP($D9,$B$39:$C$55,2,FALSE))","v":""},null,null,null,null,null,null,null,null,null,null,null,null,null,null,null,null,2,"Triathlon"]
[null,null,null,null,null,null,null,null,null,null,null,null,null,null,null,null,null,null,null,null,null,null,null,null,null,null,null,null,6,"Division"]
[null,null,null,null,null,null,null,null,null,null,"Date :",null,null,null,null,null,null,null,null,null,null,null,null,null,null,null,null,null,7,"Division"]
[]
[null,"CLUB RECEVEUR :",null,null,null,null,null,null,null,null,"CLUB VISITEUR :",null,null,null,null,null,null,null,null,null,null,null,null,null,null,null,"Division 1 et 2",null,null,null,null,"Division 6 et 7"]
[null,"NOM   PRENOM\nN° Licence","Mode de\nJeu","Catégorie\nDistance","Points réalisés","Rep.","M. G.","Série","%","Tot","NOM   PRENOM\nN° Licence",{"$f":"C10","v":"Mode de\nJeu"},"Catégorie\nDistance","Points réalisés","Rep.","M. G.","Série","%","Tot",null,null,null,null,null,null,null,"CLUB VISITE",null,"CLUB VISITEUR",null,null,"CLUB VISITE",null,"CLUB VISITEUR"]
[null,null,{"$f":"IF($C$3<>\"\",VLOOKUP($C$3,$AA$63:$AD$66,2,FALSE),\"\")","v":""},null,null,null,{"$f":"IF(F11=\"\",\"\",E11/F11)","v":""},null,{"$f":"IF(E11=0,\"\",E11/(LEFT(D12,3)))","v":""},{"$f":"IF(I11=\"\",\"\",IF(I11>R11,3,IF(I11=R11,2,1)))","v":""},null,{"$f":"IF($C$3<>\"\",VLOOKUP($C$3,$AA$63:$AD$66,2,FALSE),\"\")","v":""},null,null,{"$f":"IF(F11=\"\",\"\",F11)","v":""},{"$f":"IF(O11=\"\",\"\",N11/O11)","v":""},null,{"$f":"IF(N11=0,\"\",N11/(LEFT(M12,3)))","v":""},{"$f":"IF(R11=\"\",\"\",IF(R11>I11,3,IF(R11=I11,2,1)))","v":""},null,null,null,null,null,null,null,"Libre",{"$f":"IF($D11<>\"\",VLOOKUP($D11,$AA$24:$AD$30,2,FALSE),\"\")","v":""},"Libre",{"$f":"IF($M11<>\"\",VLOOKUP($M11,$AA$24:$AD$30,2,FALSE),\"\")","v":""},null,"Libre",{"$f":"IF($D11<>\"\",VLOOKUP($D11,$AA$24:$AB$30,2,FALSE),\"\")","v":""},"Libre",{"$f":"IF($M11<>\"\",VLOOKUP($M11,$AA$24:$AD$30,2,FALSE),\"\")","v":""}]
[null,{"$f":"IF($B11<>\"\",VLOOKUP($B11,Joueurs!$B$3:$F$496,4,FALSE),\"\")","v":""},null,{"$f":"IF($C$3<>\"\",VLOOKUP($C$3,$AA$70:$AD$73,2,FALSE),\"\")","v":""},null,null,null,null,null,null,{"$f":"IF($K11<>\"\",VLOOKUP($K11,Joueurs!$B$3:$F$496,4,FALSE),\"\")","v":""},null,{"$f":"IF($C$3<>\"\",VLOOKUP($C$3,$AA$70:$AD$73,2,FALSE),\"\")","v":""}]
[null,null,{"$f":"IF($C$3<>\"\",VLOOKUP($C$3,$AA$63:$AD$66,3,FALSE),\"\")","v":""},null,null,null,{"$f":"IF(F13=\"\",\"\",E13/F13)","v":""},null,{"$f":"IF(E13=0,\"\",E13/(LEFT(D14,3)))","v":""},{"$f":"IF(I13=\"\",\"\",IF(I13>R13,3,IF(I13=R13,2,1)))","v":""},null,{"$f":"IF($C$3<>\"\",VLOOKUP($C$3,$AA$63:$AD$66,3,FALSE),\"\")","v":""},null,null,{"$f":"IF(F13=\"\",\"\",F13)","v":""},{"$f":"IF(O13=\"\",\"\",N13/O13)","v":""},null,{"$f":"IF(N13=0,\"\",N13/(LEFT(M14,3)))","v":""},{"$f":"IF(R13=\"\",\"\",IF(R13>I13,3,IF(R13=I13,2,1)))","v":""},null,null,null,null,null,null,null,"Bande",{"$f":"IF($D13<>\"\",VLOOKUP($D13,$AA$24:$AD$30,3,FALSE),\"\")","v":""},"Bande",{"$f":"IF($M13<>\"\",VLOOKUP($M13,$AA$24:$AD$30,3,FALSE),\"\")","v":""},null,"Libre",{"$f":"IF($D13<>\"\",VLOOKUP($D13,$AA$24:$AD$30,2,FALSE),\"\")","v":""},"Libre",{"$f":"IF($M13<>\"\",VLOOKUP($M13,$AA$24:$AD$30,2,FALSE),\"\")","v":""}]
[null,{"$f":"IF($B13<>\"\",VLOOKUP($B13,Joueurs!$B$3:$F$496,4,FALSE),\"\")","v":""},null,{"$f":"IF($C$3<>\"\",VLOOKUP($C$3,$AA$70:$AD$73,3,FALSE),\"\")","v":""},null,null,null,null,null,null,{"$f":"IF($K13<>\"\",VLOOKUP($K13,Joueurs!$B$3:$F$496,4,FALSE),\"\")","v":""},null,{"$f":"IF($C$3<>\"\",VLOOKUP($C$3,$AA$70:$AD$73,3,FALSE),\"\")","v":""}]
[null,null,{"$f":"IF($C$3<>\"\",VLOOKUP($C$3,$AA$63:$AD$66,4,FALSE),\"\")","v":""},null,null,null,{"$f":"IF(F15=\"\",\"\",E15/F15)","v":""},null,{"$f":"IF(E15=0,\"\",E15/(LEFT(D16,3)))","v":""},{"$f":"IF(I15=\"\",\"\",IF(I15>R15,3,IF(I15=R15,2,1)))","v":""},null,{"$f":"IF($C$3<>\"\",VLOOKUP($C$3,$AA$63:$AD$66,4,FALSE),\"\")","v":""},null,null,{"$f":"IF(F15=\"\",\"\",F15)","v":""},{"$f":"IF(O15=\"\",\"\",N15/O15)","v":""},null,{"$f":"IF(N15=0,\"\",N15/(LEFT(M16,3)))","v":""},{"$f":"IF(R15=\"\",\"\",IF(R15>I15,3,IF(R15=I15,2,1)))","v":""},null,null,null,null,null,null,null,"3 Bandes",{"$f":"IF($D15<>\"\",VLOOKUP($D15,$AA$24:$AD$30,4,FALSE),\"\")","v":""},"3 Bandes",{"$f":"IF($M15<>\"\",VLOOKUP($M15,$AA$24:$AD$30,4,FALSE),\"\")","v":""},null,"Libre",{"$f":"IF($D15<>\"\",VLOOKUP($D15,$AA$24:$AD$30,2,FALSE),\"\")","v":""},"Libre",{"$f":"IF($M15<>\"\",VLOOKUP($M15,$AA$24:$AD$30,2,FALSE),\"\")","v":""}]
[null,{"$f":"IF($B15<>\"\",VLOOKUP($B15,Joueurs!$B$3:$F$496,4,FALSE),\"\")","v":""},null,{"$f":"IF($C$3<>\"\",VLOOKUP($C$3,$AA$70:$AD$73,4,FALSE),\"\")","v":""},null,null,null,null,null,null,{"$f":"IF($K15<>\"\",VLOOKUP($K15,Joueurs!$B$3:$F$496,4,FALSE),\"\")","v":""},null,{"$f":"IF($C$3<>\"\",VLOOKUP($C$3,$AA$70:$AD$73,4,FALSE),\"\")","v":""}]
[null,"RESULTATS",null,null,{"$f":"IF(OR($C$3=\"\"),\"\",SUM(E11:E16))","v":""},{"$f":"IF(OR($C$3=\"\"),\"\",SUM(F11:F16))","v":""},{"$f":"IF(OR($C$3=\"\"),\"\",IF(F17=0,\"\",E17/F17))","v":""},null,{"$f":"IF(OR($C$3=\"\"),\"\",SUM(I11:I16)/3)","v":""},{"$f":"IF(OR(C3=\"\"),\"\",SUM(J11:J16))","v":""},"RESULTATS",null,null,{"$f":"IF(OR($C$3=\"\"),\"\",SUM(N11:N16))","v":""},{"$f":"IF(OR($C$3=\"\"),\"\",SUM(O11:O16))","v":""},{"$f":"IF(OR($C$3=\"\"),\"\",IF(O17=0,\"\",N17/O17))","v":""},null,{"$f":"IF(OR($C$3=\"\"),\"\",SUM(R11:R16)/3)","v":""},{"$f":"IF(OR(C3=\"\"),\"\",SUM(S11:S16))","v":""},null,null,null,null,null,null,null,"TOTAL",{"$f":"IF(OR(D11=\"\",D13=\"\",D15=\"\"),\"\",AB11+AB13+AB15)","v":""},"TOTAL",{"$f":"IF(OR(AD11=\"\",AD13=\"\",AD15=\"\"),\"\",AD11+AD13+AD15)","v":""},null,"TOTAL",{"$f":"IF(OR(D11=\"\",D13=\"\",D15=\"\"),\"\",AG11+AG13+AG15)","v":""},"TOTAL",{"$f":"IF(OR(AI11=\"\",AI13=\"\",AI15=\"\"),\"\",AI11+AI13+AI15)","v":""}]
[null,null,null,{"$f":"IF(OR(D12=\"\",D14=\"\",D16=\"\"),\"\",LEFT(D14,3)+LEFT(D16,3)+LEFT(D12,3))","v":""},null,null,null,null,null,null,null,null,{"$f":"IF(OR(M12=\"\",M14=\"\",M16=\"\"),\"\",LEFT(M14,3)+LEFT(M16,3)+LEFT(M12,3))","v":""}]
[]
[null,null,null,{"$f":"IF(OR(C3=\"\"),\"\",IF(J17=0,\"\",IF(J17<S17,M9,IF(J17=S17,D9,D9))))","v":""},null,null,null,null,null,null,{"$f":"IF(OR(C3=\"\"),\"\",IF(J17=S17,\"EGALITE CONTRE\",\"BAT CONTRE\"))","v":""},null,{"$f":"IF(OR(C3=\"\"),\"\",IF(S17=0,\"\",IF(S17<J17,M9,IF(S17=J17,M9,D9))))","v":""}]
[]
[null,"Contrôle de la division :",null,{"$f":"IF($C$3=\"\",\"\",IF($C$3=1,$AB$17,IF($C$3=2,$AB$17,IF(C3=6,$AG$17,IF($C$3=7,$AG$17)))))","v":""},null,null,{"$f":"IF(J17<S17,S17,IF(J17=S17,J17,J17))","v":""},null,null,null,"à",null,{"$f":"IF(S17<J17,S17,IF(S17=J17,S17,J17))","v":""},null,null,{"$f":"IF($C$3=\"\",\"\",IF($C$3=1,$AD$17,IF($C$3=2,$AD$17,IF(C3=6,$AI$17,IF($C$3=7,$AI$17)))))","v":""},null,null,null,null,null,null,null,null,null,null,null,"Libre","Bande","3 Bandes"]
[null,null,null,{"$f":"IF(OR(C3=\"\"),\"\",IF(D22<=$U$4,\"OK\",\"NON VALIDE\"))","v":""},null,null,null,null,null,null,null,null,null,null,null,{"$f":"IF(OR(C3=\"\"),\"\",IF(P22<=$U$4,\"OK\",\"NON VALIDE\"))","v":""},null,null,null,null,null,null,null,null,null,null,"Cat"]
[null,"Je soussigné, Capitaine de l'équipe mentionnée ci-dessus, déclare sur",null,null,null,null,null,null,null,null,"Je soussigné, Capitaine de l'équipe mentionnée ci-dessus, déclare sur",null,null,null,null,null,null,null,null,null,null,null,null,null,null,null,"N1",800,800,800]
[null,"l'honneur que les joueurs précités répondent aux critères requis par le",null,null,null,null,null,null,null,null,"l'honneur que les joueurs précités répondent aux critères requis par le",null,null,null,null,null,null,null,null,null,null,null,null,null,null,null,"N2",null,null,700]
[null,"règlement des matches par équipes",null,null,null,null,null,null,null,null,"règlement des matches par équipes",null,null,null,null,null,null,null,null,null,null,null,null,null,null,null,"N3",600,600,600]
[null,null,null,null,null,null,null,null,null,null,null,null,null,null,null,null,null,null,null,null,null,null,null,null,null,null,"R1",400,400,400]
[null,"NOM - Prénom",null,null,null,null,null,null,null,null,"NOM - Prénom",null,null,null,null,null,null,null,null,null,null,null,null,null,null,null,"R2",300,300,300]
[null,"Signature :",null,null,null,null,null,null,null,null,"Signature :",null,null,null,null,null,null,null,null,null,null,null,null,null,null,null,"R3",200]
[null,null,null,null,null,null,null,null,null,null,null,null,null,null,null,null,null,null,null,null,null,null,null,null,null,null,"R4",100]
[null,"Les feuilles de résultats doivent à adresser dimanche midi au plus tard",null,null,null,null,null,null,null,null,null,null,null,null,null,null,null,null,null,null,null,null,null,null,null,null,null,"Catégories Possible par Mode de Jeu\nDivision 1"]
[null,"- au responsable format : Christian FONTAINE :",null,"mpe.artois@gmail.com",null,null,null,null,null,null,{"$f":"IF(OR(D9=\"\"),\"\",IF(L5=B37,D37,D38))","v":""},null,{"$f":"IF(OR(D9=\"\"),\"\",IF(K32=D37,F37,K38))","v":""}]
[null,"- au webmaster",null,null,null,null,null,null,null,null,{"$f":"IF(OR(D9=\"\"),\"\",D36)","v":""},null,{"$f":"IF(OR(D9=\"\"),\"\",F36)","v":""}]
[null,"Les résultats doivent être également saisis sur https://www.telemat.org/FFBI/sif/",null,null,null,null,null,null,null,null,null,null,null,null,null,null,null,null,null,null,null,null,null,null,null,null,{"$f":"'Feuille de Match'!AB34:AB38","v":"Cat"},"Cat","Cat","Cat"]
[null,null,null,null,null,null,null,null,null,null,null,null,null,null,null,null,null,null,null,null,null,null,null,null,null,null,null,"N1","N1","N1"]
[null,"1/2 CD",null,null,null,null,null,null,null,null,null,null,null,null,null,null,null,null,null,null,null,null,null,null,null,null,null,"R2",null,"R2"]
[null,"Artois",null,"FONTAINE CHRISTIAN",null,"mpe.artois@gmail.com",null,null,null,null,null,null,null,null,null,null,null,null,null,null,null,null,null,null,null,null,null,"R3"]
[null,"Maritime",null,"CARON Christian",null,"christian.caron62@orange.fr",null,null,null,null,null,null,null,null,null,null,null,null,null,null,null,null,null,null,null,null,null,"R4"]
[null,null,"Artois"]
[null,"Billy","Artois",null,null,null,null,null,null,null,null,null,null,null,null,null,null,null,null,null,null,null,null,null,null,null,null,"Catégories Possible par Mode de Jeu\nDivision 2"]
{"$rows_left_out":34}
{"sheet":"Joueurs","index":1,"n_rows":496,"n_cols":14,"rows_kept":496,"cut":false,"hidden":false,"merged":[[0,13,1,13],[0,1,0,5],[0,11,1,11],[0,12,1,12]]}
[null,"LES NOMS DOIVENT TOUJOURS ETRE DANS L'ORDRE ALPHABETIQUE\n(sélectionner les lignes complètes en cliquant sur le chiffre de la ligne)",null,null,null,null,null,null,null,null,null,"Recherche\nJoueurs","  ","<== Insérer les premières lettres de votre recherche"]
[null,"Nom Prenom","Nom","Prenom","Licence","Clubs",null,"Num de ligne","Recherche","Liste num"]
[null,{"$f":"C3 & \" \" &D3","v":"ABUCKI PASCAL"},"ABUCKI","PASCAL","016813R","COURRIERES",null,{"$f":"ROWS($B$3:B3)","v":1},{"$f":"IF(ISNUMBER(SEARCH($M$1,B3)),H3,\"\")","v":""},{"$f":"IFERROR(SMALL($I$3:$I$496,H3),\"\")","v":""},null,null,{"$f":"IFERROR(INDEX($B$3:$B$496,J3,1),\"\")","v":""}]
[null,"AMEYE CHRISTIAN","AMEYE","CHRISTIAN","138348C","CARVIN",null,{"$f":"ROWS($B$3:B4)","v":2},"","",null,null,{"$f":"IFERROR(INDEX($B$3:$B$496,J4,1),\"\")","v":""}]
[null,"ARAMINI SALVATORE","ARAMINI","SALVATORE","176849C","ARRAS",null,{"$f":"ROWS($B$3:B5)","v":3},"","",null,null,{"$f":"IFERROR(INDEX($B$3:$B$496,J5,1),\"\")","v":""}]
[null,"BAHEUX DAVID","BAHEUX","DAVID","107661V","OUTREAU",null,{"$f":"ROWS($B$3:B6)","v":4},"","",null,null,{"$f":"IFERROR(INDEX($B$3:$B$496,J6,1),\"\")","v":""}]
[null,"BAHEUX DANNY","BAHEUX","DANNY","151977S","OUTREAU",null,{"$f":"ROWS($B$3:B7)","v":5},"","",null,null,{"$f":"IFERROR(INDEX($B$3:$B$496,J7,1),\"\")","v":""}]
[null,"BAILLET BERNARD","BAILLET","BERNARD","147240T","CUCQ",null,{"$f":"ROWS($B$3:B8)","v":6},"","",null,null,{"$f":"IFERROR(INDEX($B$3:$B$496,J8,1),\"\")","v":""}]
[null,"BAILLEUX ALEXIS","BAILLEUX","ALEXIS","155087Y","ARRAS",null,{"$f":"ROWS($B$3:B9)","v":7},"","",null,null,{"$f":"IFERROR(INDEX($B$3:$B$496,J9,1),\"\")","v":""}]
[null,"BAILLEZ AIME","BAILLEZ","AIME","017295F","BILLY",null,{"$f":"ROWS($B$3:B10)","v":8},"","",null,null,{"$f":"IFERROR(INDEX($B$3:$B$496,J10,1),\"\")","v":""}]
[null,"BARBE JEAN MARC","BARBE","JEAN MARC","134146M","LE TOUQUET",null,{"$f":"ROWS($B$3:B11)","v":9},"","",null,null,{"$f":"IFERROR(INDEX($B$3:$B$496,J11,1),\"\")","v":""}]
[null,"BARMUTA PHILIPPE","BARMUTA","PHILIPPE","134074S","OUTREAU",null,{"$f":"ROWS($B$3:B12)","v":10},"","",null,null,{"$f":"IFERROR(INDEX($B$3:$B$496,J12,1),\"\")","v":""}]
[null,"BAYART PASCAL","BAYART","PASCAL","016982E","CARVIN",null,{"$f":"ROWS($B$3:B13)","v":11},"","",null,null,{"$f":"IFERROR(INDEX($B$3:$B$496,J13,1),\"\")","v":""}]
[null,"BEAUCHAMPS SAMUEL","BEAUCHAMPS","SAMUEL","176835M","FOUQUIERES",null,{"$f":"ROWS($B$3:B14)","v":12},"","",null,null,{"$f":"IFERROR(INDEX($B$3:$B$496,J14,1),\"\")","v":""}]
[null,"BEAUDUIN ADRIEN","BEAUDUIN","ADRIEN","166004P","BILLY",null,{"$f":"ROWS($B$3:B15)","v":13},"","",null,null,{"$f":"IFERROR(INDEX($B$3:$B$496,J15,1),\"\")","v":""}]
[null,"BEETS MARC","BEETS","MARC","101174I","DIVION",null,{"$f":"ROWS($B$3:B16)","v":14},"","",null,null,{"$f":"IFERROR(INDEX($B$3:$B$496,J16,1),\"\")","v":""}]
[null,"BENS MATHIEU","BENS","MATHIEU","168853L","ARRAS",null,{"$f":"ROWS($B$3:B17)","v":15},"","",null,null,{"$f":"IFERROR(INDEX($B$3:$B$496,J17,1),\"\")","v":""}]
[null,"BERNARD FRANCIS","BERNARD","FRANCIS","117728A","BILLY",null,{"$f":"ROWS($B$3:B18)","v":16},"","",null,null,{"$f":"IFERROR(INDEX($B$3:$B$496,J18,1),\"\")","v":""}]
[null,"BERNARD LAURENT","BERNARD","LAURENT","127738A","BILLY",null,{"$f":"ROWS($B$3:B19)","v":17},"","",null,null,{"$f":"IFERROR(INDEX($B$3:$B$496,J19,1),\"\")","v":""}]
[null,"BERRIER ANTOINE","BERRIER","ANTOINE","177234W","BILLY",null,{"$f":"ROWS($B$3:B20)","v":18},"","",null,null,{"$f":"IFERROR(INDEX($B$3:$B$496,J20,1),\"\")","v":""}]
[null,"BERTELOOT SYLVAIN","BERTELOOT","SYLVAIN","173590K","ARRAS",null,{"$f":"ROWS($B$3:B21)","v":19},"","",null,null,{"$f":"IFERROR(INDEX($B$3:$B$496,J21,1),\"\")","v":""}]
[null,"BERTOLOTTI BEATRICE","BERTOLOTTI","BEATRICE","016807L","CARVIN",null,{"$f":"ROWS($B$3:B22)","v":20},"","",null,null,{"$f":"IFERROR(INDEX($B$3:$B$496,J22,1),\"\")","v":""}]
[null,"BETRANCOURT PASCAL","BETRANCOURT","PASCAL","016746C","BILLY",null,{"$f":"ROWS($B$3:B23)","v":21},"","",null,null,{"$f":"IFERROR(INDEX($B$3:$B$496,J23,1),\"\")","v":""}]
[null,"BEUVELET JEAN MARIE","BEUVELET","JEAN MARIE","146362I","BILLY",null,{"$f":"ROWS($B$3:B24)","v":22},"","",null,null,{"$f":"IFERROR(INDEX($B$3:$B$496,J24,1),\"\")","v":""}]
[null,"BIGOT JEAN PIERRE","BIGOT","JEAN PIERRE","016942Q","CUCQ",null,{"$f":"ROWS($B$3:B25)","v":23},"","",null,null,{"$f":"IFERROR(INDEX($B$3:$B$496,J25,1),\"\")","v":""}]
[null,"BLANCKAERT ANDY","BLANCKAERT","ANDY","178200W","FOUQUIERES",null,{"$f":"ROWS($B$3:B26)","v":24},"","",null,null,{"$f":"IFERROR(INDEX($B$3:$B$496,J26,1),\"\")","v":""}]
[null,"BLONDEEL BRUNO","BLONDEEL","BRUNO","131428Y","OUTREAU",null,{"$f":"ROWS($B$3:B27)","v":25},"","",null,null,{"$f":"IFERROR(INDEX($B$3:$B$496,J27,1),\"\")","v":""}]
[null,"BLONDEEL FIRMIN","BLONDEEL","FIRMIN","133104K","OUTREAU",null,{"$f":"ROWS($B$3:B28)","v":26},"","",null,null,{"$f":"IFERROR(INDEX($B$3:$B$496,J28,1),\"\")","v":""}]
[null,"BOCQUET JEAN LUC","BOCQUET","JEAN LUC","016577P","BILLY",null,{"$f":"ROWS($B$3:B29)","v":27},"","",null,null,{"$f":"IFERROR(INDEX($B$3:$B$496,J29,1),\"\")","v":""}]
[null,"BON VINCENT","BON","VINCENT","017044O","BILLY",null,{"$f":"ROWS($B$3:B30)","v":28},"","",null,null,{"$f":"IFERROR(INDEX($B$3:$B$496,J30,1),\"\")","v":""}]
[null,"BONNET STEPHANE","BONNET","STEPHANE","148887J","OUTREAU",null,{"$f":"ROWS($B$3:B31)","v":29},"","",null,null,{"$f":"IFERROR(INDEX($B$3:$B$496,J31,1),\"\")","v":""}]
[null,"BORKOWSKI PATRICE","BORKOWSKI","PATRICE","171081H","BILLY",null,{"$f":"ROWS($B$3:B32)","v":30},"","",null,null,{"$f":"IFERROR(INDEX($B$3:$B$496,J32,1),\"\")","v":""}]
[null,"BOUBET JEAN","BOUBET","JEAN","121412S","CUCQ",null,{"$f":"ROWS($B$3:B33)","v":31},"","",null,null,{"$f":"IFERROR(INDEX($B$3:$B$496,J33,1),\"\")","v":""}]
[null,"BOUBET FRANCINE","BOUBET","FRANCINE","133115V","CUCQ",null,{"$f":"ROWS($B$3:B34)","v":32},"","",null,null,{"$f":"IFERROR(INDEX($B$3:$B$496,J34,1),\"\")","v":""}]
[null,"BRABANT DAVID","BRABANT","DAVID","171205S","ARRAS",null,{"$f":"ROWS($B$3:B35)","v":33},"","",null,null,{"$f":"IFERROR(INDEX($B$3:$B$496,J35,1),\"\")","v":""}]
[null,"BRASSEUR LUDOVIC","BRASSEUR","LUDOVIC","176867X","ARRAS",null,{"$f":"ROWS($B$3:B36)","v":34},"","",null,null,{"$f":"IFERROR(INDEX($B$3:$B$496,J36,1),\"\")","v":""}]
[null,"BRAZY ALAIN","BRAZY","ALAIN","102980U","CALAIS",null,{"$f":"ROWS($B$3:B37)","v":35},"","",null,null,{"$f":"IFERROR(INDEX($B$3:$B$496,J37,1),\"\")","v":""}]
[null,"BROCAIL PASCAL","BROCAIL","PASCAL","166006R","DIVION",null,{"$f":"ROWS($B$3:B38)","v":36},"","",null,null,{"$f":"IFERROR(INDEX($B$3:$B$496,J38,1),\"\")","v":""}]
[null,"BROUTIER BERTRAND","BROUTIER","BERTRAND","101241X","CUCQ",null,{"$f":"ROWS($B$3:B39)","v":37},"","",null,null,{"$f":"IFERROR(INDEX($B$3:$B$496,J39,1),\"\")","v":""}]
[null,"CABOCHE MARCEL","CABOCHE","MARCEL","017273J","BILLY",null,{"$f":"ROWS($B$3:B40)","v":38},"","",null,null,{"$f":"IFERROR(INDEX($B$3:$B$496,J40,1),\"\")","v":""}]
{"$rows_left_out":456}