{"text_format":"1","workbook":"xlsx","n_sheets":4,"sheets":["Match","Adresses","Ecussons","Classification"],"not_rendered":{"charts":0,"images":33,"macros":1,"external_links":2,"defined_names":72,"comments":1,"pivot_tables":0},"unopened":[],"bounds":{"document_bytes":16777216,"sheet_cells":100000,"rows_first":2000,"rows_last":500,"rows_between":2000,"halvings":0,"cell_chars":16384,"cell_head_chars":4096},"cells_cut":0,"cells_raw":0,"read":"whole","date_system":"1900"}

{"sheet":"Match","index":0,"n_rows":33,"n_cols":35,"rows_kept":33,"cut":false,"hidden":false,"merged":[[32,1,34,1],[32,2,34,16],[23,1,24,2],[23,3,24,4],[23,8,24,8],[23,9,24,10],[23,11,24,12],[23,16,24,16],[28,1,29,5],[28,6,30,9],[19,16,20,16],[19,12,20,12],[28,10,29,16],[30,1,30,5],[30,10,30,16],[21,13,22,13],[21,14,22,14],[21,15,22,15],[21,16,22,16],[22,2,22,3],[22,10,22,11],[21,4,22,4],[21,5,22,5],[21,6,22,6],[21,7,22,7],[21,8,22,8],[21,12,22,12],[18,2,18,3],[18,10,18,11],[19,13,20,13],[19,14,20,14],[20,2,20,3],[20,10,20,11],[19,4,20,4],[19,5,20,5],[19,6,20,6],[19,7,20,7],[19,8,20,8],[19,15,20,15],[17,12,18,12],[17,13,18,13],[17,14,18,14],[17,15,18,15],[17,16,18,16],[17,4,18,4],[17,5,18,5],[17,6,18,6],[17,7,18,7],[17,8,18,8],[14,1,15,7],[14,8,15,8],[14,9,15,15],[14,16,15,16],[10,1,11,8],[10,9,11,16],[12,1,13,8],[12,9,13,16],[2,1,8,1],[5,2,5,3],[7,3,7,5],[8,3,8,5],[8,10,8,16]]}
[]
[null,null,null,null,null,null,null,null,null,null,null,null,null,null,null,null,null,null,null,null,null,null,"TRIATHLON D1 (Libre ; Bande ; 3 bandes)",{"$f":"IF(J11=W2,1,IF(J11=W3,2,IF(J11=W4,3,IF(J11=W5,4,0))))","v":0},"D2","LIBRE",null,"D2","BANDE",null,"D2","3 BANDES",null,"D2","CADRES"]
[13236,null,{"$f":"IF(A3=\"\",\"\",IF(VLOOKUP(A3,club,3,FALSE)=0,\"\",VLOOKUP(A3,club,3,FALSE)))","v":"BILLARD Français VILLENEUVE D'ASCQ"},null,null,null,null,null,null,null,null,null,null,null,null,null,null,null,null,null,null,null,"TRIATHLON D1 (Libre ; Bande ; Cadre)",null,"R1",150,null,"R1",60,null,"R1",20,null,"R1",80]
[null,null,{"$f":"IF(A3=\"\",\"\",IF(VLOOKUP(A3,club,4,FALSE)=0,\"\",VLOOKUP(A3,club,4,FALSE)))","v":""},null,null,null,null,null,null,null,null,null,null,null,null,null,null,null,null,null,null,null,"TRIATHLON D2 (Libre ; Bande ; 3 bandes)",null,"R2",100,null,"R2",40,null,"R2",15,null,"N1","NON"]
[null,null,{"$f":"IF(A3=\"\",\"\",IF(VLOOKUP(A3,club,5,FALSE)=0,\"\",VLOOKUP(A3,club,5,FALSE)))","v":"3 rue jean vilar"},null,null,null,null,null,null,null,null,null,null,null,null,null,null,null,null,null,null,null,"TRIATHLON D2 (Libre ; Bande ; Cadre)",null,"R3",70,null,"R3",40,null,"N1","NON",null,"N2","NON"]
[null,null,{"$f":"IF(A3=\"\",\"\",VLOOKUP(A3,club,6,FALSE))","v":59650},null,{"$f":"IF(A3=\"\",\"\",VLOOKUP(A3,club,7,FALSE))","v":"VILLENEUVE D'ASCQ"},null,null,null,null,null,null,null,null,null,null,null,null,null,null,null,null,null,null,null,"R4",50,null,"N1","NON",null,"N2","NON",null,"N3","NON"]
[null,null,null,null,null,null,null,null,null,null,null,null,null,null,null,null,null,null,null,null,null,null,null,null,"N1","NON",null,"N2","NON",null,"N3","NON",null,"MAS","NON"]
[null,null,{"$f":"IF(D8=\"\",\"\",\"(\")","v":"("},{"$f":"IF(A3=\"\",\"\",VLOOKUP(A3,club,8,FALSE))","v":320055726},null,null,null,null,null,null,null,null,null,null,null,null,null,null,null,null,null,null,null,null,"N2","NON",null,"N3","NON",null,"MAS","NON",null,"MASTERS","NON"]
[null,null,{"$f":"IF(D9=\"\",\"\",\":\")","v":""},{"$f":"IF(A3=\"\",\"\",IF(VLOOKUP(A3,club,9,FALSE)=0,\"\",VLOOKUP(A3,club,9,FALSE)))","v":""},null,null,null,null,null,"Date :",null,null,null,null,null,null,null,null,null,null,null,null,null,null,"N3","NON",null,"MAS","NON",null,"MASTERS","NON"]
[null,null,null,null,null,null,null,null,null,null,null,null,null,null,null,null,null,null,null,null,null,null,null,null,"MAS","NON",null,"MASTERS","NON"]
[null,null,null,null,null,null,null,null,null,null,null,null,null,null,null,null,null,null,null,null,null,null,null,null,"MASTERS","NON"]
[null,null,null,null,null,null,null,null,null,null,null,null,null,null,null,null,null,null,null,null,null,null,null,null,"R5",50]
[null,"CLUB VISITE",null,null,null,null,null,null,null,"CLUB VISITEUR"]
[]
[]
[null,null,null,null,null,null,null,null,null,null,null,null,null,null,null,null,null,null,null,null,null,null,null,null,"D1","LIBRE",null,"D1","BANDE",null,"D1","3 BANDES",null,"D1","CADRES"]
[null,"NOM PRENOM                   N° LICENCE","CAT.","Pts à réaliser","Pts réalisés","Reprise","Moyenne","Série ","PTS MATCH","NOM PRENOM                   N° LICENCE","CAT.","Pts à réaliser","Pts réalisés","Reprise","Moyenne","Série ","PTS MATCH",null,null,null,null,null,null,null,"MASTERS",500,null,"MASTERS",165,null,"MASTERS",50,null,"MASTERS",300]
[null,{"$f":"IF(Classification!A1=\"\",\"\",VLOOKUP(Classification!A1,Classification!$A$3:$AC$602,3,FALSE)&\" \"&VLOOKUP(Classification!A1,Classification!$A$3:$AC$602,4,FALSE))","v":""},{"$f":"IF(Classification!A1=\"\",\"\",VLOOKUP(Classification!A1,Classification!$A$3:$AC$602,8,FALSE))","v":""},{"$f":"IF($J$11=\"\",\"\",\"120\")","v":""},null,null,{"$f":"IF(OR(E18=\"\",F18=\"\"),\"\",E18/F18)","v":""},null,{"$f":"IF(OR(D18=\"\",E18=\"\",L18=\"\",M18=\"\"),\"\",IF((E18/D18)>(M18/L18),2,IF((E18/D18)=(M18/L18),1,0)))","v":""},{"$f":"IF(Classification!B1=\"\",\"\",VLOOKUP(Classification!B1,Classification!$A$3:$AC$602,3,FALSE)&\" \"&VLOOKUP(Classification!B1,Classification!$A$3:$AC$602,4,FALSE))","v":""},{"$f":"IF(Classification!B1=\"\",\"\",VLOOKUP(Classification!B1,Classification!$A$3:$AC$602,8,FALSE))","v":""},{"$f":"IF($J$11=\"\",\"\",\"120\")","v":""},null,{"$f":"IF(F18=\"\",\"\",F18)","v":""},{"$f":"IF(OR(M18=\"\",N18=\"\"),\"\",M18/N18)","v":""},null,{"$f":"IF(OR(L18=\"\",M18=\"\",D18=\"\",E18=\"\"),\"\",IF((M18/L18)>(E18/D18),2,IF((M18/L18)=(E18/D18),1,0)))","v":""},null,null,null,null,null,null,null,"N1",375,null,"N1",110,null,"N1",40,null,"N1",200]
[null,{"$f":"IF(Classification!A1=\"\",\"\",VLOOKUP(Classification!A1,Classification!$A$3:$AC$602,6,FALSE))","v":""},{"$f":"IF($J$11=\"\",\"\",\"LIBRE\")","v":""},null,null,null,null,null,null,{"$f":"IF(Classification!B1=\"\",\"\",VLOOKUP(Classification!B1,Classification!$A$3:$AC$602,6,FALSE))","v":""},{"$f":"IF($J$11=\"\",\"\",\"LIBRE\")","v":""},null,null,null,null,null,null,null,null,null,null,null,null,null,"N2",200,null,"N2",80,null,"N2",35,null,"N2",120]
[null,{"$f":"IF(Classification!C1=\"\",\"\",VLOOKUP(Classification!C1,Classification!$A$3:$AC$602,3,FALSE)&\" \"&VLOOKUP(Classification!C1,Classification!$A$3:$AC$602,4,FALSE))","v":""},{"$f":"IF(Classification!C1=\"\",\"\",VLOOKUP(Classification!C1,Classification!$A$3:$AC$602,18,FALSE))","v":""},{"$f":"IF($J$11=\"\",\"\",\"60\")","v":""},null,null,{"$f":"IF(OR(E20=\"\",F20=\"\"),\"\",E20/F20)","v":""},null,{"$f":"IF(OR(D20=\"\",E20=\"\",L20=\"\",M20=\"\"),\"\",IF((E20/D20)>(M20/L20),2,IF((E20/D20)=(M20/L20),1,0)))","v":""},{"$f":"IF(Classification!D1=\"\",\"\",VLOOKUP(Classification!D1,Classification!$A$3:$AC$602,3,FALSE)&\" \"&VLOOKUP(Classification!D1,Classification!$A$3:$AC$602,4,FALSE))","v":""},{"$f":"IF(Classification!D1=\"\",\"\",VLOOKUP(Classification!D1,Classification!$A$3:$AC$602,18,FALSE))","v":""},{"$f":"IF($J$11=\"\",\"\",\"60\")","v":""},null,{"$f":"IF(F20=\"\",\"\",F20)","v":""},{"$f":"IF(OR(M20=\"\",N20=\"\"),\"\",M20/N20)","v":""},null,{"$f":"IF(OR(L20=\"\",M20=\"\",D20=\"\",E20=\"\"),\"\",IF((M20/L20)>(E20/D20),2,IF((M20/L20)=(E20/D20),1,0)))","v":""},null,null,null,null,null,null,null,"R1",150,null,"R1",60,null,"N3",25,null,"N3",120]
[null,{"$f":"IF(Classification!C1=\"\",\"\",VLOOKUP(Classification!C1,Classification!$A$3:$AC$602,6,FALSE))","v":""},{"$f":"IF($J$11=\"\",\"\",\"BANDE\")","v":""},null,null,null,null,null,null,{"$f":"IF(Classification!D1=\"\",\"\",VLOOKUP(Classification!D1,Classification!$A$3:$AC$602,6,FALSE))","v":""},{"$f":"IF($J$11=\"\",\"\",\"BANDE\")","v":""},null,null,null,null,null,null,null,null,null,null,null,null,null,"R2","NON",null,"R2","NON",null,"R1",20,null,"R1",80]
[null,{"$f":"IF(Classification!E1=\"\",\"\",VLOOKUP(Classification!E1,Classification!$A$3:$AC$602,3,FALSE)&\" \"&VLOOKUP(Classification!E1,Classification!$A$3:$AC$602,4,FALSE))","v":""},{"$f":"IF(Classification!E1=\"\",\"\",IF(mode_21=\"3 bandes\",VLOOKUP(Classification!E1,Classification!$A$3:$AC$602,23,FALSE),VLOOKUP(Classification!E1,Classification!$A$3:$AC$602,13,FALSE)))","v":""},{"$f":"IF($J$11=\"\",\"\",\"20\")","v":""},null,null,{"$f":"IF(OR(E22=\"\",F22=\"\"),\"\",E22/F22)","v":""},null,{"$f":"IF(OR(D22=\"\",E22=\"\",L22=\"\",M22=\"\"),\"\",IF((E22/D22)>(M22/L22),2,IF((E22/D22)=(M22/L22),1,0)))","v":""},{"$f":"IF(Classification!F1=\"\",\"\",VLOOKUP(Classification!F1,Classification!$A$3:$AC$602,3,FALSE)&\" \"&VLOOKUP(Classification!F1,Classification!$A$3:$AC$602,4,FALSE))","v":""},{"$f":"IF(Classification!F1=\"\",\"\",IF(mode_22=\"3 bandes\",VLOOKUP(Classification!F1,Classification!$A$3:$AC$602,23,FALSE),VLOOKUP(Classification!F1,Classification!$A$3:$AC$602,13,FALSE)))","v":""},{"$f":"IF($J$11=\"\",\"\",\"20\")","v":""},null,{"$f":"IF(F22=\"\",\"\",F22)","v":""},{"$f":"IF(OR(M22=\"\",N22=\"\"),\"\",M22/N22)","v":""},null,{"$f":"IF(OR(L22=\"\",M22=\"\",D22=\"\",E22=\"\"),\"\",IF((M22/L22)>(E22/D22),2,IF((M22/L22)=(E22/D22),1,0)))","v":""},null,null,null,null,null,null,null,"R3","NON",null,"R3","NON",null,"R2","NON",null,"MAS",300]
[null,{"$f":"IF(Classification!E1=\"\",\"\",VLOOKUP(Classification!E1,Classification!$A$3:$AC$602,6,FALSE))","v":""},{"$f":"IF($X$2=0,\"\",IF(OR($X$2=1,$X$2=3),\"3 BANDES\",\"CADRES\"))","v":""},null,null,null,null,null,null,{"$f":"IF(Classification!F1=\"\",\"\",VLOOKUP(Classification!F1,Classification!$A$3:$AC$602,6,FALSE))","v":""},{"$f":"IF($X$2=0,\"\",IF(OR($X$2=1,$X$2=3),\"3 BANDES\",\"CADRES\"))","v":""},null,null,null,null,null,null,null,null,null,null,null,null,null,"R4","NON",null,"MAS",165,null,"R3","NON"]
[null,"POURCENTAGE DE POINTS REALISES",null,{"$f":"IF(OR(D18=\"\",D20=\"\",D22=\"\"),\"\",((E18/D18+E20/D20+E22/D22))/3)","v":""},null,null,null,null,{"$f":"SUM(I18:I23)","v":0},"POURCENTAGE DE POINTS REALISES",null,{"$f":"IF(OR(L18=\"\",L20=\"\",L22=\"\"),\"\",((M18/L18+M20/L20+M22/L22))/3)","v":""},null,null,null,null,{"$f":"SUM(Q18:Q23)","v":0},null,null,null,null,null,null,null,"R5","NON",null,null,null,null,"MAS",50]
[null,null,null,null,null,null,null,null,null,null,null,null,null,null,null,null,null,null,null,null,null,null,null,null,"MAS",500]
[null,null,"<====Capitaine",null,null,null,null,null,null,null,"<====Capitaine"]
[null,null,"<====Signature du capitaine",null,null,null,null,null,null,null,"<====Signature du capitaine"]
[]
[null,{"$f":"IF(AND(B15=\"\",J15=\"\"),\"\",IF(OR(I24>Q24,I24=Q24),B15,J15))","v":""},null,null,null,null,{"$f":"IF(I24=Q24,\"EGAL\",\"BAT\")","v":"EGAL"},null,null,null,{"$f":"IF(AND(B15=\"\",J15=\"\"),\"\",IF(OR(I24>Q24,I24=Q24),J15,B15))","v":""}]
[]
[null,{"$f":"IF(B29=B15,I24,IF(B29=J15,Q24,\"\"))","v":0},null,null,null,null,null,null,null,null,{"$f":"IF(K29=B15,I24,IF(K29=J15,Q24,\"\"))","v":0}]
[]
[null,"OBSERVATION :"]

{"sheet":"Adresses","index":1,"n_rows":35,"n_cols":10,"rows_kept":35,"cut":false,"hidden":false,"merged":[]}
[]
["N°Club","Ville","Nom Club","Adresse 1","Adresse 2","CP","VILLE2","Tel","Fax","Mel"]
[13101,"ARRAS","BILLARD CLUB ARRAGEOIS","Rue Paul  Claudel ","Résidence Saint Pol",62000,"ARRAS","03 21 23 33 96","03 21 23 33 96","arras.billardclub@wanadoo.fr"]
[13102,"AVION","BILLARD CLUB AVIONNAIS","GRPT Joliot Curie","Avenue Salingue",62210,"AVION",321430945,321420952,"bertrand.fremeaux@wanadoo.fr"]
[13103,"BILLY","BILLARD CLUB BILLYSIEN","3 Avenue de la Fosse 2",null,62420,"BILLY MONTIGNY",321201785,321492144,"billybc@9business.fr"]
[13104,"CARVIN","BILLARD CLUB CARVINOIS","Square Pont du Grès",null,62220,"CARVIN",321740644,321740644,"billard.carvin@cegetel.net"]
[13105,"LENS","AVENIR BILLARD CLUB LENSOIS","Rue Jules Ferry",null,62300,"LENS",321431862,321431862,"sebroussel62@yahoo.fr"]
[13107,"DOUAI","AMICALE BILLARD CLUB DOUAISIEN","Complexe Sportif de la Porte d'Arras","Rue d'Arras",59500,"DOUAI",327960636,327960636,"abcdouaibillard@orange.fr"]
[13109,"AUCHY","BILLARD CLUB AUCHY","Rue de Douai","Complexe Sportif",62138,"AUCHY",321267187,321267187]
[13110,"ANNOEULLIN","SPORT BILLARD CLUB ANNOEULLIN","Rue Watrelot",null,59112,"ANNOEULLIN",320866765,null,"s.b.c.a@orange.fr"]
[13117,"DIVION","BILLARD CLUB DIVIONNAIS","Rue Romain Rolland","Ecole Copernic",62710,"DIVION",321533121,321533121,"bcdivion@free.fr"]
[13123,"FOUQUIERES","BILLARD CLUB FOUQUIERES","38 rue Sainte Menehould",null,62740,"FOUQUIERES",321755759,321755759,"frederic.goetinck@hotmail.fr"]
[13124,"COURRIERES","COURRIERES SPORT BILLARD","28 rue Roger Salengro",null,62710,"COURRIERS",321200335,321200335,"courrieres@artois-billard.com"]
[13226,"WAZEMMES","BILLARD CLUB WAZEMMES","Le Retro","14 rue d'arcol",59000,"LILLE",320872110,null,"fiktoo2@yahoo.fr"]
[13231,"HOUPLINES","BILLARD CLUB HOUPLINES",null,"195 rue victor hugo",59116,"HOUPLINES",320100291,320354728]
[13236,"VILLENEUVE D'ASCQ","BILLARD Français VILLENEUVE D'ASCQ",null,"3 rue jean vilar",59650,"VILLENEUVE D'ASCQ",320055726,null,"davidvankieken@free.fr"]
[13240,"RONCHIN","BILLARD CLUB DU CANON D'OR","Salle Elizabeth dupont","rue pierre Dupont",59790,"RONCHIN",320522000,320521547,"bcco.ronchin@club-internet.fr"]
[13249,"FACHES THUMESNIL","BILLARD CLUB DE FACHES THUMESNIL",null,"173 rue carnot",59155,"FACHES THUMESNIL",320979487,null,"bcft@free.fr"]
[13250,"COUNTRY","LE COUNTRY BILLARD CLUB",null,"22 rue princesse",59000,"LILLE",320744668]
[13251,"LA CHAPELLES","BILLARD CLUB CHAPELLOIS","La plaine de détente","rue omere ollivier",59930,"LA CHAPELLES",320353812,null,"jeanluc.missiaen@wanadoo.fr"]
[13252,"ESTAIRES","BILLARD CLUB ESTAIROIS","Rue Jules Ferry","Impasse Louise de Marillac",59940,"ESTAIRES",328501349,null,"billardestairois@yahoo.fr"]
[13353,"DUNKERQUE","U.S.DUNKERQUOISE","Piscine Asseman","Place paul Asseman",59140,"DUNKERQUE",328669183,null,"usdbillard@wanadoo.fr"]
[13355,"GRAVELINES","U.S.GRAVELINOISE","SPORTICA","Place du polder",59820,"GRAVELINES",328655030,null,"gstop@free.fr"]
[13356,"OUTREAU","BILLARD CLUB OUTREAU","Salle Boër","37 rue jean jaures",62230,"OUTREAU",321803869,null,"eldave.62@orange.fr"]
[13360,"ST POL","BILLARD CLUB ST POLOIS","Centre romain roland","Avenue maurice bertaux",59430,"ST POL",328612377,null,"bc.sainpolois@free.fr"]
[13363,"CUCQ","AMICALE LAIQUE CUCQUOISE","Salle Robert Bouchez","place de l'ancienne mairie",62780,"CUCQ",321845067,null,"billard-de-cucq@wanadoo.fr"]
[13364,"CALAIS","ACADEMIE CALAISIENNE DE BILLARD","Complexe sportif calipso","rue roger martin du gard",62100,"CALAIS",321194394,null,"acbcbillardcalais@wanadoo.fr"]
[13365,"GRANDE-SYNTHE","OLYMPIQUE GRANDE-SYNTHE","Salle léo lagrange","3ter rue rigaud",59760,"GRANDE-SYNTHE",328218392,328218393,"PZERBUL@aol.com"]
[13368,"WIMILLE","BILLARD CLUB DE WIMILLE",null,"72 rue du bon secours",62126,"WIMILLE",321310276,null,"naldo1@hotmail.fr"]
[13369,"WIZERNES","WIZERNES BILLARD CLUB","Résidence marie curie","rue des écoles",62570,"WIZERNES",321392007]
[13370,"LE TOUQUET","LE TOUQUET BILLARD CLUB","Pôle tennistique","rond point des sports",62520,"LE TOUQUET",608047029,null,"letouquetbillardclub@neuf.fr"]
[13477,"VALENCIENNES"]
[13478,"DENAIN","ACADEMIE LA CARAMBOLE","Ancienne école de musique","211 rue de villars",59220,"DENAIN",327292061]
[13481,"BRUAY","BILLARD CLUB BRUAYSIEN",null,"52 rue michel brabant",59860,"Bruay sur escaut",327416004,null,"Billard-club-bruaisien@wanadoo.fr"]
[13482,"CAMBRAI","ACADEMIE DE CAMBRAI","Base de loisirs, Citadelle","La Paix de Nimégue",59400,"CAMBRAI",327783720,null,"Alanbury@free.fr"]

{"sheet":"Ecussons","index":2,"n_rows":27,"n_cols":9,"rows_kept":27,"cut":false,"hidden":false,"merged":[]}
[]
[]
[]
[]
[]
["Annoeulin","Arras","Avion","Billy","Bruay","Calais","Cambrai","Carvin","Courrières"]
[]
[]
[]
[]
[]
[]
["Cucq","Denain","Divion","Douai","Dunkerque","Estaires","Faches Thumesnil","Fouquières","Grande synthe"]
[]
[]
[]
[]
[]
[]
["Gravelines","Houplines","Le touquet","Lens","Outreau","Ronchin","St pol sur mer","Vermelle","Villeneuve d'asq"]
[]
[]
[]
[]
[]
[]
["Wizernes","FFB","59-62","LIGUE","CD59","CD62"]

{"sheet":"Classification","index":3,"n_rows":603,"n_cols":41,"rows_kept":603,"cut":false,"hidden":false,"merged":[]}
[null,null,null,null,null,null,null,null,null,null,null,null,null,null,null,null,null,null,null,null,null,null,null,null,null,null,null,null,null,null,null,null,null,null,null,"ANNOEULLIN",{"$f":"COUNTIF($B$3:$B$655,AJ1)","v":35},{"$f":"AK1+2","v":37},null,null,{"$f":"IF(visite=\"\",\"\",\"a\"&VLOOKUP(visite,$AJ$1:$AL$17,3,FALSE)-VLOOKUP(visite,$AJ$1:$AL$17,2,FALSE)+1&\":\"&\"d\"&VLOOKUP(visite,$AJ$1:$AL$17,3,FALSE))","v":""}]
["Code","Nom Club","Nom","Prenom","Date Naissance","Licence","AN","CAT","Libre","C","*","AN2","CAT3","Cadre","Colonne1","*4","AN3","CAT6","1-Bande","C7","*8","AN4","CAT10","3-Bandes","C11","*12","AN5","5 Quilles",null,null,null,null,null,null,null,"BRUAY SUR ESCAUT",17,{"$f":"AK2+AL1","v":54},null,null,{"$f":"IF(visiteur=\"\",\"\",\"a\"&VLOOKUP(visiteur,$AJ$1:$AL$17,3,FALSE)-VLOOKUP(visiteur,$AJ$1:$AL$17,2,FALSE)+1&\":\"&\"d\"&VLOOKUP(visiteur,$AJ$1:$AL$17,3,FALSE))","v":""}]
[1,"ANNOEULLIN","BAROIS PATRICK",null,null,"138349D",11,"R3",1.36,null,"*",null,null,null,null,null,null,null,null,null,null,null,null,null,null,null,null,null,null,"OK",null,null,null,null,null,"CAMBRAI",20,{"$f":"AK3+AL2","v":74}]
[2,"ANNOEULLIN","BEGHIN BENJAMIN",null,null,"145779X",null,null,null,null,null,null,null,null,null,null,null,null,null,null,null,null,null,null,null,null,null,null,null,"OK",null,null,null,null,null,"CHAPELLE ARMENTIERES",7,81]
[3,"ANNOEULLIN","BEGHIN NICOLAS",null,null,"148048X",null,null,null,null,null,null,null,null,null,null,null,null,null,null,null,null,null,null,null,null,null,null,null,"OK",null,null,null,null,null,"DENAIN",35,{"$f":"AK5+AL4","v":116}]
[4,"ANNOEULLIN","CARPENTIER YOHANNE",null,null,"016914O",10,"R2",3.3587499999999997,null,"*",null,null,null,null,null,null,null,null,null,null,11,"N3",0.47674418604651159,null,"*",null,null,null,"OK",null,null,null,null,null,"DOUAI",38,154]
[5,"ANNOEULLIN","CAUX FREDERIC",null,null,"017026W",10,"R3",1.4099999999999997,null,"*",null,null,null,null,null,9,"R2",0.9887640449438202,null,"*",null,null,null,null,null,null,null,null,"OK",null,null,null,null,null,"DUNKERQUE",85,239]
[6,"ANNOEULLIN","CAUX GREGORY",null,null,"147265W",null,null,null,null,null,null,null,null,null,null,null,null,null,null,null,null,null,null,null,null,null,null,null,"OK",null,null,null,null,null,"ESTAIRES",13,252]
[7,"ANNOEULLIN","D HONDT BERTRAND",null,null,"143079B",null,null,null,null,null,null,null,null,null,null,null,null,null,null,null,null,null,null,null,null,null,null,null,"OK",null,null,null,null,null,"FACHES THUMESNIL",47,299]
[8,"ANNOEULLIN","DELCOURT ROBERT",null,null,"016873Z",null,null,null,null,null,null,null,null,null,null,null,null,null,null,null,null,null,null,null,null,null,null,null,"OK",null,null,null,null,null,"GRANDE-SYNTHE",16,315]
[9,"ANNOEULLIN","DELSOL PHILIPPE",null,null,"101151L",null,null,null,null,null,null,null,null,null,null,10,"N1",3.06,null,"*","13","N2",0.53600000000000003,null,1,null,null,null,"OK",null,null,null,null,null,"GRAVELINES",40,355]
[10,"ANNOEULLIN","DEROLEZ JEAN PIERRE",null,null,"101152M",null,null,null,null,null,null,null,null,null,null,null,null,null,null,null,"13","R1",0.30348837209302326,null,1,null,null,null,"OK",null,null,null,null,null,"HOUPLINES",21,376]
[11,"ANNOEULLIN","DONNEAU PHILIPPE",null,null,"138350E",13,"R4",1.0249999999999999,null,1,null,null,null,null,null,13,"R2",0.7078651685393258,null,1,null,null,null,null,null,null,null,null,"OK",null,null,null,null,null,"RONCHIN",91,467]
[12,"ANNOEULLIN","FLOURE STEPHANE",null,null,"147296E",null,null,null,null,null,null,null,null,null,null,null,null,null,null,null,null,null,null,null,null,null,null,null,"OK",null,null,null,null,null,"ST POL SUR MER",20,487]
[13,"ANNOEULLIN","FOURMAUX GERARD",null,null,"147122Q",null,null,null,null,null,null,null,null,null,null,null,null,null,null,null,null,null,null,null,null,null,null,null,"OK",null,null,null,null,null,"VILLENEUVE D ASCQ",52,539]
[14,"ANNOEULLIN","FOURMAUX PIERRE",null,null,"147121P",null,null,null,null,null,null,null,null,null,null,null,null,null,null,null,null,null,null,null,null,null,null,null,"OK"]
[15,"ANNOEULLIN","GEETS PATRICE",null,null,"126847T",10,"R3",1.69875,null,"*",null,null,null,null,null,null,null,null,null,null,null,null,null,null,null,null,null,null,"OK"]
[16,"ANNOEULLIN","GUILLEMANT ALEXANDRE",null,null,"016874A",null,null,null,null,null,null,null,null,null,null,null,null,null,null,null,null,null,null,null,null,null,null,null,"OK"]
[17,"ANNOEULLIN","GUILLEMANT DAVID",null,null,"016875B",null,null,null,null,null,null,null,null,null,null,8,"N3",2.0337078651685392,null,"*",8,"N2",0.54900000000000004,null,"*",null,null,null,"OK"]
[18,"ANNOEULLIN","GUILLEMANT JEAN MARC",null,null,"017025V",null,null,null,null,null,null,null,null,null,null,null,null,null,null,null,null,null,null,null,null,null,null,null,"OK"]
[19,"ANNOEULLIN","KERKAERT JEAN MARIE",null,null,"138351F",13,"R4",0.9375,null,1,null,null,null,null,null,13,"R2",0.5730337078651685,null,1,null,null,null,null,null,null,null,null,"OK"]
[20,"ANNOEULLIN","KRAUPNER JULES",null,null,"017012I",null,null,null,null,null,null,null,null,null,null,null,null,null,null,null,null,null,null,null,null,null,null,null,"OK"]
[21,"ANNOEULLIN","LHERMITTE CEDRIC",null,null,"016910K",10,"R1",4.9799999999999995,null,"*",null,null,null,null,null,8,"N3",1.8089887640449438,null,"*","13","N3",0.46162790697674422,null,1,null,null,null,"OK"]
[22,"ANNOEULLIN","LOTHE JEAN LUC",null,null,"016588A",null,null,null,null,null,null,null,null,null,null,null,null,null,null,null,null,null,null,null,null,null,null,null,"OK"]
[23,"ANNOEULLIN","MAILLE BERNARD",null,null,"016763T",10,"R2",2.3824999999999998,null,"*",null,null,null,null,null,null,null,null,null,null,9,"N3",0.39418604651162792,null,"*",null,null,null,"OK"]
[24,"ANNOEULLIN","MARTEL Jean-Pierre",null,null,null,null,null,null,null,null,null,null,null,null,null,9,"R2",0.75280898876404501,null,"*",null,null,null,null,null,null,null,null,"OK"]
[25,"ANNOEULLIN","MORANT Kévin",null,null,null,8,"R4",0.79499999999999993,null,"*",null,null,null,null,null,null,null,null,null,null,null,null,null,null,null,null,null,null,"OK"]
[26,"ANNOEULLIN","PREVOST JEAN CLAUDE",null,null,"016591D",null,null,null,null,null,null,null,null,null,null,null,null,null,null,null,null,null,null,null,null,null,null,null,"OK"]
[27,"ANNOEULLIN","RACARY Thibaut",null,null,"141510S",10,"R1",4.2699999999999996,null,"*",null,null,null,null,null,null,null,null,null,null,null,null,null,null,null,null,null,null,"OK"]
[28,"ANNOEULLIN","SAUVAGE Jean-Claude",null,null,"141511T",10,"R3",1.2949999999999999,null,"*",null,null,null,null,null,null,null,null,null,null,null,null,null,null,null,null,null,null,"OK"]
[29,"ANNOEULLIN","VALLART DIDIER",null,null,"145781Z",null,null,null,null,null,null,null,null,null,null,null,null,null,null,null,null,null,null,null,null,null,null,null,"OK"]
[30,"ANNOEULLIN","VANDAELE DANIEL",null,null,"102991F",null,null,null,null,null,null,null,null,null,null,null,null,null,null,null,null,null,null,null,null,null,null,null,"OK"]
[31,"ANNOEULLIN","VASSAL André",null,null,null,8,"R4",0.54125000000000001,null,"*",null,null,null,null,null,null,null,null,null,null,null,null,null,null,null,null,null,null,"OK"]
[32,"ANNOEULLIN","VERBEKEN GERARD",null,null,"141512U",null,null,null,null,null,null,null,null,null,null,null,null,null,null,null,null,null,null,null,null,null,null,null,"OK"]
[33,"ANNOEULLIN","VERPLANCKE JEAN PIERRE",null,null,"147295D",null,null,null,null,null,null,null,null,null,null,null,null,null,null,null,null,null,null,null,null,null,null,null,"OK"]
[34,"ANNOEULLIN","VINCENT GERARD",null,null,"141513V",null,null,null,null,null,null,null,null,null,null,null,null,null,null,null,null,null,null,null,null,null,null,null,"OK"]
[35,"ANNOEULLIN","ZEUDE Alain",null,null,"141514W",13,"R4",1.0374999999999999,null,1,null,null,null,null,null,13,"R2",0.6853932584269663,null,1,null,null,null,null,null,null,null,null,"OK"]
[36,"BRUAY SUR ESCAUT","BERNUS Florent",null,null,null,10,"R4",0.91374999999999995,null,"*",null,null,null,null,null,10,"R2",0.5617977528089888,null,"*",null,null,null,null,null,null,null,null,"OK"]
[37,"BRUAY SUR ESCAUT","BUONDELMONTE Antonio",null,null,"016719B",12,"R3",1.7649999999999999,null,"*",null,null,null,null,null,13,"R1",1.0112359550561798,null,1,"13","R1",0.30697674418604654,null,1,null,null,null,"OK"]
[38,"BRUAY SUR ESCAUT","BUONDELMONTE Nazario",null,null,"017134A",12,"R3",1.825,null,"*",null,null,null,null,null,13,"R1",1.2359550561797754,null,1,null,null,null,null,null,null,null,null,"OK"]
{"$rows_left_out":563}