{"text_format":"1","workbook":"xlsx","n_sheets":4,"sheets":["Match","Adresses","Ecussons","Classification"],"not_rendered":{"charts":0,"images":33,"macros":1,"external_links":3,"defined_names":70,"comments":1,"pivot_tables":0},"unopened":[],"bounds":{"document_bytes":16777216,"sheet_cells":100000,"rows_first":2000,"rows_last":500,"rows_between":2000,"halvings":0,"cell_chars":16384,"cell_head_chars":4096},"cells_cut":0,"cells_raw":0,"read":"whole","date_system":"1900"}

{"sheet":"Match","index":0,"n_rows":32,"n_cols":24,"rows_kept":32,"cut":false,"hidden":false,"merged":[[28,1,29,4],[28,5,29,8],[28,9,29,14],[31,1,33,1],[31,2,33,14],[21,10,22,10],[21,14,22,14],[23,1,24,1],[23,2,24,2],[23,3,24,4],[23,8,24,8],[23,9,24,9],[23,10,24,11],[21,9,22,9],[21,2,22,2],[21,3,22,3],[21,7,22,7],[19,14,20,14],[17,2,18,2],[17,3,18,3],[17,7,18,7],[17,9,18,9],[19,2,20,2],[19,3,20,3],[19,7,20,7],[19,9,20,9],[19,10,20,10],[12,8,13,14],[12,1,13,7],[17,10,18,10],[17,14,18,14],[14,1,15,6],[14,8,15,13],[14,7,15,7],[14,14,15,14],[10,1,11,7],[10,8,11,14],[2,1,8,1],[5,2,5,3],[7,3,7,5],[8,3,8,5],[8,9,8,14]]}
[]
[]
[13236,null,{"$f":"IF(A3=\"\",\"\",IF(VLOOKUP(A3,CLUB,3,FALSE)=0,\"\",VLOOKUP(A3,CLUB,3,FALSE)))","v":"BILLARD Français VILLENEUVE D'ASCQ"},null,null,null,null,null,null,null,null,null,null,null,null,null,0,"<=MAJ macro",1]
[null,null,{"$f":"IF(A3=\"\",\"\",IF(VLOOKUP(A3,CLUB,4,FALSE)=0,\"\",VLOOKUP(A3,CLUB,4,FALSE)))","v":""}]
[null,null,{"$f":"IF(A3=\"\",\"\",IF(VLOOKUP(A3,CLUB,5,FALSE)=0,\"\",VLOOKUP(A3,CLUB,5,FALSE)))","v":"3 rue jean vilar"}]
[null,null,{"$f":"IF(A3=\"\",\"\",VLOOKUP(A3,CLUB,6,FALSE))","v":59650},null,{"$f":"IF(A3=\"\",\"\",VLOOKUP(A3,CLUB,7,FALSE))","v":"VILLENEUVE D'ASCQ"}]
[]
[null,null,{"$f":"IF(D8=\"\",\"\",\"(\")","v":"("},{"$f":"IF(A3=\"\",\"\",VLOOKUP(A3,CLUB,8,FALSE))","v":320055726}]
[null,null,{"$f":"IF(D9=\"\",\"\",\":\")","v":""},{"$f":"IF(A3=\"\",\"\",IF(VLOOKUP(A3,CLUB,9,FALSE)=0,\"\",VLOOKUP(A3,CLUB,9,FALSE)))","v":""},null,null,null,null,"Date :"]
[]
[]
[]
[null,"CLUB VISITE",null,null,null,null,null,null,"CLUB VISITEUR"]
[]
[]
[]
[null,"NOM PRENOM                   N° LICENCE","CAT.","Pts à réaliser","Pts réalisés","Reprise","Moyenne","Série ","NOM PRENOM                   N° LICENCE","CAT.","Pts à réaliser","Pts réaliser","Reprise","Moyenne","Série ",null,null,null,null,null,{"$f":"IF(RIGHT(I11,1)=\"6\",3,IF(RIGHT(I11,1)=\"7\",2,0))","v":0},null,"Reprises","Rep adv;"]
[null,{"$f":"IF(Classification!A1=\"\",\"\",VLOOKUP(Classification!A1,Classification!$A$3:$AD$548,3,FALSE)&\" \"&VLOOKUP(Classification!A1,Classification!$A$3:$AD$548,4,FALSE))","v":""},{"$f":"IF(Classification!A1=\"\",\"\",VLOOKUP(Classification!A1,Classification!$A$3:$AD$548,8,FALSE))","v":""},{"$f":"IF(I11=\"\",\"\",INDEX(Points,U18,$U$17))","v":""},{"$f":"IF(E19=\"\",\"\",E19)","v":""},{"$f":"IF(AA18=\"\",\"\",AA18+W18)","v":""},{"$f":"IF(OR(E18=\"\",F18=\"\"),\"\",E18/F18)","v":""},null,{"$f":"IF(Classification!B1=\"\",\"\",VLOOKUP(Classification!B1,Classification!$A$3:$AD$548,3,FALSE)&\" \"&VLOOKUP(Classification!B1,Classification!$A$3:$AD$548,4,FALSE))","v":""},{"$f":"IF(Classification!B1=\"\",\"\",VLOOKUP(Classification!B1,Classification!$A$3:$AD$548,8,FALSE))","v":""},{"$f":"D18","v":""},{"$f":"IF(L19=\"\",\"\",L19)","v":""},{"$f":"IF(OR(AND(E19=P18,L19=P18),AND(L19<P18,E19<P18),AA18=\"\"),\"\",AA18+X18)","v":""},{"$f":"IF(OR(L18=\"\",M18=\"\"),\"\",L18/M18)","v":""},null,{"$f":"D18","v":""},null,null,30,40,1,null,{"$f":"IF(AND(S3=1,L19=P18),-1)","v":-1},{"$f":"IF(AND(S3=0,E19=P18),-1)","v":false}]
[null,{"$f":"IF(Classification!A1=\"\",\"\",VLOOKUP(Classification!A1,Classification!$A$3:$AD$548,6,FALSE))","v":""},null,null,null,{"$f":"F18","v":""},"",null,{"$f":"IF(Classification!B1=\"\",\"\",VLOOKUP(Classification!B1,Classification!$A$3:$AD$548,6,FALSE))","v":""},null,null,null,{"$f":"M18","v":""},"",null,null,null,null,null,null,2]
[null,{"$f":"IF(Classification!C1=\"\",\"\",VLOOKUP(Classification!C1,Classification!$A$3:$AD$548,3,FALSE)&\" \"&VLOOKUP(Classification!C1,Classification!$A$3:$AD$548,4,FALSE))","v":""},{"$f":"IF(Classification!C1=\"\",\"\",VLOOKUP(Classification!C1,Classification!$A$3:$AD$548,8,FALSE))","v":""},{"$f":"IF(I11=\"\",\"\",INDEX(Points,U20,$U$17))","v":""},{"$f":"IF(E21=\"\",\"\",E21-E19)","v":""},{"$f":"IF(AA20=\"\",\"\",AA20+W20-F19)","v":""},"",null,{"$f":"IF(Classification!D1=\"\",\"\",VLOOKUP(Classification!D1,Classification!$A$3:$AD$548,3,FALSE)&\" \"&VLOOKUP(Classification!D1,Classification!$A$3:$AD$548,4,FALSE))","v":""},{"$f":"IF(Classification!D1=\"\",\"\",VLOOKUP(Classification!D1,Classification!$A$3:$AD$548,8,FALSE))","v":""},{"$f":"D20","v":""},{"$f":"IF(L21=\"\",\"\",L21-L19)","v":""},{"$f":"IF(OR(AND(E21=P20,L21=P20),AND(L21<P20,E21<P20),AA20=\"\"),\"\",AA20+X20-M19)","v":""},"",null,{"$f":"IF(I11=\"\",\"\",D18+D20)","v":""},null,null,50,60,3,null,{"$f":"IF(I11=\"\",\"\",IF(OR(AND(S3=0,E19=P18),AND(E19=P18,E21=P20)),1,IF(AND(S3=1,L19=P18,L21=P20),-1)))","v":""},{"$f":"IF(I11=\"\",\"\",IF(AND(S3=0,E19=P18,E21=P20),-1,IF(OR(AND(S3=1,L19=P18),AND(L21=P20,L19=P18)),1)))","v":""}]
[null,{"$f":"IF(Classification!C1=\"\",\"\",VLOOKUP(Classification!C1,Classification!$A$3:$AD$548,6,FALSE))","v":""},null,null,null,{"$f":"IF(AA20=\"\",\"\",IF(S3=0,AA20,IF(AND(S3=1,E21=P20),AA20,AA20-1)))","v":""},"",null,{"$f":"IF(Classification!D1=\"\",\"\",VLOOKUP(Classification!D1,Classification!$A$3:$AD$548,6,FALSE))","v":""},null,null,null,{"$f":"IF(AA20=\"\",\"\",IF(S3=1,AA20,IF(AND(S3=0,L21=P20),AA20,AA20-1)))","v":""},"",null,null,null,null,null,null,4]
[null,{"$f":"IF(Classification!E1=\"\",\"\",VLOOKUP(Classification!E1,Classification!$A$3:$AD$548,3,FALSE)&\" \"&VLOOKUP(Classification!E1,Classification!$A$3:$AD$548,4,FALSE))","v":""},{"$f":"IF(Classification!E1=\"\",\"\",VLOOKUP(Classification!E1,Classification!$A$3:$AD$548,8,FALSE))","v":""},{"$f":"IF(I11=\"\",\"\",INDEX(Points,U22,$U$17))","v":""},{"$f":"IF(E23=\"\",\"\",E23-E21)","v":""},{"$f":"IF(AA22=\"\",\"\",AA22-F21+W22)","v":""},"",null,{"$f":"IF(Classification!F1=\"\",\"\",VLOOKUP(Classification!F1,Classification!$A$3:$AD$548,3,FALSE)&\" \"&VLOOKUP(Classification!F1,Classification!$A$3:$AD$548,4,FALSE))","v":""},{"$f":"IF(Classification!F1=\"\",\"\",VLOOKUP(Classification!F1,Classification!$A$3:$AD$548,8,FALSE))","v":""},{"$f":"D22","v":""},{"$f":"IF(L23=\"\",\"\",L23-L21)","v":""},{"$f":"IF(OR(AND(E23<P22,L23<P22),AA22=\"\"),\"\",AA22-M21+X22)","v":""},"",null,{"$f":"IF(I11=\"\",\"\",D18+D20+D22)","v":""},null,null,70,80,5,null,{"$f":"IF(OR(AND(S3=1,E21=P20,E23<P22),AND(S3=1,E21=P20,E23=P22),AND(S3=0,E21=P20,P22,E23)),1)","v":1},{"$f":"IF(OR(AND(L21=P20,L23<P22),AND(L21=P20,L23=P22)),1)","v":1}]
[null,{"$f":"IF(Classification!E1=\"\",\"\",VLOOKUP(Classification!E1,Classification!$A$3:$AD$548,6,FALSE))","v":""},null,null,null,{"$f":"IF(AA22=\"\",\"\",AA22)","v":""},"",null,{"$f":"IF(Classification!F1=\"\",\"\",VLOOKUP(Classification!F1,Classification!$A$3:$AD$548,6,FALSE))","v":""},null,null,null,{"$f":"IF(AA22=\"\",\"\",AA22)","v":""},""]
[null,"TOTAL DE L'EQUIPE :",{"$f":"IF(OR(C18=\"\",C20=\"\",C22=\"\"),\"\",RIGHT(C18,1)+RIGHT(C20,1)+RIGHT(C22,1))","v":""},{"$f":"IF(E23=\"\",\"\",E23/$P$22)","v":""},null,null,null,null,"TOTAL DE L'EQUIPE :",{"$f":"IF(OR(J18=\"\",J20=\"\",J22=\"\"),\"\",RIGHT(J18,1)+RIGHT(J20,1)+RIGHT(J22,1))","v":""},{"$f":"IF(L23=\"\",\"\",L23/$P$22)","v":""}]
[]
[null,null,"<====Capitaine",null,null,null,null,null,null,"<====Capitaine"]
[null,null,"<====Signature du capitaine",null,null,null,null,null,null,"<====Signature du capitaine"]
[]
[null,{"$f":"IF(AND(B15=\"\",I15=\"\"),\"\",IF(OR(D24>K24,D24=K24),B15,I15))","v":""},null,null,null,{"$f":"IF(D24=0,\"\",IF(D24=K24,\"EGAL\",\"BAT\"))","v":"EGAL"},null,null,null,{"$f":"IF(AND(B15=\"\",I15=\"\"),\"\",IF(OR(D24>K24,D24=K24),I15,B15))","v":""}]
[]
[]
[null,"OBSERVATION :"]

{"sheet":"Adresses","index":1,"n_rows":35,"n_cols":10,"rows_kept":35,"cut":false,"hidden":false,"merged":[]}
[]
["N°Club","Ville","Nom Club","Adresse 1","Adresse 2","CP","VILLE2","Tel","Fax","Mel"]
[13101,"ARRAS","BILLARD CLUB ARRAGEOIS","Rue Paul  Claudel ","Résidence Saint Pol",62000,"ARRAS","03 21 23 33 96","03 21 23 33 96","arras.billardclub@wanadoo.fr"]
[13102,"AVION","BILLARD CLUB AVIONNAIS","GRPT Joliot Curie","Avenue Salingue",62210,"AVION",321430945,321420952,"bertrand.fremeaux@wanadoo.fr"]
[13103,"BILLY","BILLARD CLUB BILLYSIEN","3 Avenue de la Fosse 2",null,62420,"BILLY MONTIGNY",321201785,321492144,"billybc@9business.fr"]
[13104,"CARVIN","BILLARD CLUB CARVINOIS","Square Pont du Grès",null,62220,"CARVIN",321740644,321740644,"billard.carvin@cegetel.net"]
[13105,"LENS","AVENIR BILLARD CLUB LENSOIS","Rue Jules Ferry",null,62300,"LENS",321431862,321431862,"sebroussel62@yahoo.fr"]
[13107,"DOUAI","AMICALE BILLARD CLUB DOUAISIEN","Complexe Sportif de la Porte d'Arras","Rue d'Arras",59500,"DOUAI",327960636,327960636,"abcdouaibillard@orange.fr"]
[13109,"AUCHY","BILLARD CLUB AUCHY","Rue de Douai","Complexe Sportif",62138,"AUCHY",321267187,321267187]
[13110,"ANNOEULLIN","SPORT BILLARD CLUB ANNOEULLIN","Rue Watrelot",null,59112,"ANNOEULLIN",320866765,null,"s.b.c.a@orange.fr"]
[13117,"DIVION","BILLARD CLUB DIVIONNAIS","Rue Romain Rolland","Ecole Copernic",62710,"DIVION",321533121,321533121,"bcdivion@free.fr"]
[13123,"FOUQUIERES","BILLARD CLUB FOUQUIERES","38 rue Sainte Menehould",null,62740,"FOUQUIERES",321755759,321755759,"frederic.goetinck@hotmail.fr"]
[13124,"COURRIERES","COURRIERES SPORT BILLARD","28 rue Roger Salengro",null,62710,"COURRIERS",321200335,321200335,"courrieres@artois-billard.com"]
[13226,"WAZEMMES","BILLARD CLUB WAZEMMES","Le Retro","14 rue d'arcol",59000,"LILLE",320872110,null,"fiktoo2@yahoo.fr"]
[13231,"HOUPLINES","BILLARD CLUB HOUPLINES",null,"195 rue victor hugo",59116,"HOUPLINES",320100291,320354728]
[13236,"VILLENEUVE D'ASCQ","BILLARD Français VILLENEUVE D'ASCQ",null,"3 rue jean vilar",59650,"VILLENEUVE D'ASCQ",320055726,null,"davidvankieken@free.fr"]
[13240,"RONCHIN","BILLARD CLUB DU CANON D'OR","Salle Elizabeth dupont","rue pierre Dupont",59790,"RONCHIN",320522000,320521547,"bcco.ronchin@club-internet.fr"]
[13249,"FACHES THUMESNIL","BILLARD CLUB DE FACHES THUMESNIL",null,"173 rue carnot",59155,"FACHES THUMESNIL",320979487,null,"bcft@free.fr"]
[13250,"COUNTRY","LE COUNTRY BILLARD CLUB",null,"22 rue princesse",59000,"LILLE",320744668]
[13251,"LA CHAPELLES","BILLARD CLUB CHAPELLOIS","La plaine de détente","rue omere ollivier",59930,"LA CHAPELLES",320353812,null,"jeanluc.missiaen@wanadoo.fr"]
[13252,"ESTAIRES","BILLARD CLUB ESTAIROIS","Rue Jules Ferry","Impasse Louise de Marillac",59940,"ESTAIRES",328501349,null,"billardestairois@yahoo.fr"]
[13353,"DUNKERQUE","U.S.DUNKERQUOISE","Piscine Asseman","Place paul Asseman",59140,"DUNKERQUE",328669183,null,"usdbillard@wanadoo.fr"]
[13355,"GRAVELINES","U.S.GRAVELINOISE","SPORTICA","Place du polder",59820,"GRAVELINES",328655030,null,"gstop@free.fr"]
[13356,"OUTREAU","BILLARD CLUB OUTREAU","Salle Boër","37 rue jean jaures",62230,"OUTREAU",321803869,null,"eldave.62@orange.fr"]
[13360,"ST POL","BILLARD CLUB ST POLOIS","Centre romain roland","Avenue maurice bertaux",59430,"ST POL",328612377,null,"bc.sainpolois@free.fr"]
[13363,"CUCQ","AMICALE LAIQUE CUCQUOISE","Salle Robert Bouchez","place de l'ancienne mairie",62780,"CUCQ",321845067,null,"billard-de-cucq@wanadoo.fr"]
[13364,"CALAIS","ACADEMIE CALAISIENNE DE BILLARD","Complexe sportif calipso","rue roger martin du gard",62100,"CALAIS",321194394,null,"acbcbillardcalais@wanadoo.fr"]
[13365,"GRANDE-SYNTHE","OLYMPIQUE GRANDE-SYNTHE","Salle léo lagrange","3ter rue rigaud",59760,"GRANDE-SYNTHE",328218392,328218393,"PZERBUL@aol.com"]
[13368,"WIMILLE","BILLARD CLUB DE WIMILLE",null,"72 rue du bon secours",62126,"WIMILLE",321310276,null,"naldo1@hotmail.fr"]
[13369,"WIZERNES","WIZERNES BILLARD CLUB","Résidence marie curie","rue des écoles",62570,"WIZERNES",321392007]
[13370,"LE TOUQUET","LE TOUQUET BILLARD CLUB","Pôle tennistique","rond point des sports",62520,"LE TOUQUET",608047029,null,"letouquetbillardclub@neuf.fr"]
[13477,"VALENCIENNES"]
[13478,"DENAIN","ACADEMIE LA CARAMBOLE","Ancienne école de musique","211 rue de villars",59220,"DENAIN",327292061]
[13481,"BRUAY","BILLARD CLUB BRUAYSIEN",null,"52 rue michel brabant",59860,"Bruay sur escaut",327416004,null,"Billard-club-bruaisien@wanadoo.fr"]
[13482,"CAMBRAI","ACADEMIE DE CAMBRAI","Base de loisirs, Citadelle","La Paix de Nimégue",59400,"CAMBRAI",327783720,null,"Alanbury@free.fr"]

{"sheet":"Ecussons","index":2,"n_rows":27,"n_cols":9,"rows_kept":27,"cut":false,"hidden":false,"merged":[]}
[]
[]
[]
[]
[]
["Annoeulin","Arras","Avion","Billy","Bruay","Calais","Cambrai","Carvin","Courrières"]
[]
[]
[]
[]
[]
[]
["Cucq","Denain","Divion","Douai","Dunkerque","Estaires","Faches Thumesnil","Fouquières","Grande synthe"]
[]
[]
[]
[]
[]
[]
["Gravelines","Houplines","Le touquet","Lens","Outreau","Ronchin","St pol sur mer","Vermelle","Villeneuve d'asq"]
[]
[]
[]
[]
[]
[]
["Wizernes","FFB","59-62","LIGUE","CD59","CD62"]

{"sheet":"Classification","index":3,"n_rows":600,"n_cols":41,"rows_kept":600,"cut":false,"hidden":false,"merged":[]}
[null,null,null,null,null,null,null,null,null,null,null,null,null,null,null,null,null,null,null,null,null,null,null,null,null,null,null,null,null,null,null,null,null,null,null,"ANNOEULLIN",{"$f":"COUNTIF($B$3:$B$600,AJ1)","v":37},{"$f":"AK1+2","v":39},null,null,{"$f":"IF(VISITE=\"\",\"\",\"A\"&VLOOKUP(VISITE,Classification!$AJ$1:$AL$15,3,FALSE)-VLOOKUP(VISITE,Classification!$AJ$1:$AL$15,2,FALSE)+1&\":\"&\"D\"&VLOOKUP(VISITE,Classification!$AJ$1:$AL$15,3,FALSE))","v":""}]
["Code","Nom Club","Nom","Prenom","Date Naissance","Licence","AN","CAT","Libre","C","*","AN2","CAT3","Cadre","Colonne1","*4","AN3","CAT6","1-Bande","C7","*8","AN4","CAT10","3-Bandes","C11","*12","AN5","5 Quilles",null,null,"CLUB","Licence 2013",null,null,null,"BRUAY SUR ESCAUT",17,{"$f":"AK2+AL1","v":56},null,null,{"$f":"IF(VISITEUR=\"\",\"\",\"A\"&VLOOKUP(VISITEUR,Classification!$AJ$1:$AL$15,3,FALSE)-VLOOKUP(VISITEUR,Classification!$AJ$1:$AL$15,2,FALSE)+1&\":\"&\"D\"&VLOOKUP(VISITEUR,Classification!$AJ$1:$AL$15,3,FALSE))","v":""}]
[1,"ANNOEULLIN","BAROIS              ","PATRICK      ","1958-03-15","138349D",11,"R3",1.36,null,"*",null,null,null,null,null,null,null,null,null,null,null,null,null,null,null,null,null,null,"OK",13110,"OUI",null,null,null,"CAMBRAI",20,{"$f":"AK3+AL2","v":76}]
[2,"ANNOEULLIN","BEGHIN              ","BENJAMIN     ","2001-10-25","145779X",null,null,null,null,null,null,null,null,null,null,null,null,null,null,null,null,null,null,null,null,null,null,null,"OK",13110,"OUI",null,null,null,"CHAPELLE ARMENTIERES",7,83]
[3,"ANNOEULLIN","BEGHIN              ","NICOLAS      ","1971-06-17","148048X",null,null,null,null,null,null,null,null,null,null,null,null,null,null,null,null,null,null,null,null,null,null,null,"OK",13110,"OUI",null,null,null,"DENAIN",37,120]
[4,"ANNOEULLIN","CARPENTIER          ","YOHANNE      ","1970-03-19","016914O",10,"R2",3.3587499999999997,null,"*",null,null,null,null,null,null,null,null,null,null,11,"N3",0.47674418604651159,null,"*",null,null,null,"OK",13110,"OUI",null,null,null,"DOUAI",35,155]
[5,"ANNOEULLIN","CAUX                ","FREDERIC     ","1962-07-23","017026W",10,"R3",1.4099999999999997,null,"*",null,null,null,null,null,9,"R2",0.9887640449438202,null,"*",null,null,null,null,null,null,null,null,"OK",13110,"OUI",null,null,null,"DUNKERQUE",85,240]
[6,"ANNOEULLIN","CAUX                ","GREGORY      ","1993-08-20","147265W",null,null,null,null,null,null,null,null,null,null,null,null,null,null,null,null,null,null,null,null,null,null,null,"OK",13110,"OUI",null,null,null,"ESTAIRES",13,253]
[7,"ANNOEULLIN","D HONDT             ","BERTRAND     ","1953-10-08","143079B",null,null,null,null,null,null,null,null,null,null,null,null,null,null,null,null,null,null,null,null,null,null,null,"OK",13110,"OUI",null,null,null,"FACHES THUMESNIL",47,300]
[8,"ANNOEULLIN","DELCOURT            ","ROBERT       ","1941-03-13","016873Z",null,null,null,null,null,null,null,null,null,null,null,null,null,null,null,null,null,null,null,null,null,null,null,"OK",13110,"OUI",null,null,null,"GRANDE-SYNTHE",17,317]
[9,"ANNOEULLIN","DELSOL              ","PHILIPPE     ","1969-12-26","101151L",null,null,null,null,null,null,null,null,null,null,10,"N1",3.06,null,"*",12,"N1",0.58099999999999996,null,null,null,null,null,"OK",13110,"OUI",null,null,null,"GRAVELINES",40,357]
[10,"ANNOEULLIN","DEROLEZ             ","JEAN PIERRE  ","1950-06-18","101152M",null,null,null,null,null,null,null,null,null,null,null,null,null,null,null,12,"R1",0.32209302325581396,null,"*",null,null,null,"OK",13110,"OUI",null,null,null,"HOUPLINES",21,378]
[11,"ANNOEULLIN","DONNEAU             ","PHILIPPE     ","1952-10-27","138350E",12,"R4",1.0899999999999999,null,"*",null,null,null,null,null,12,"R2",0.62921348314606751,null,"*",null,null,null,null,null,null,null,null,"OK",13110,"OUI",null,null,null,"RONCHIN",93,471]
[12,"ANNOEULLIN","FLOURE              ","STEPHANE     ","1977-03-20","147296E",null,null,null,null,null,null,null,null,null,null,null,null,null,null,null,null,null,null,null,null,null,null,null,"OK",13110,"OUI",null,null,null,"ST POL SUR MER",23,494]
[13,"ANNOEULLIN","FOURMAUX            ","GERARD       ","1950-08-19","147122Q",null,null,null,null,null,null,null,null,null,null,null,null,null,null,null,null,null,null,null,null,null,null,null,"OK",13110,"OUI",null,null,null,"VILLENEUVE D ASCQ",54,548]
[14,"ANNOEULLIN","FOURMAUX            ","PIERRE       ","1922-09-20","147121P",null,null,null,null,null,null,null,null,null,null,null,null,null,null,null,null,null,null,null,null,null,null,null,"OK",13110,"OUI"]
[15,"ANNOEULLIN","GEETS               ","PATRICE      ","1959-08-28","126847T",10,"R3",1.69875,null,"*",null,null,null,null,null,null,null,null,null,null,null,null,null,null,null,null,null,null,"OK",13110,"OUI"]
[16,"ANNOEULLIN","GUILLEMANT          ","ALEXANDRE    ","1980-06-28","016874A",null,null,null,null,null,null,null,null,null,null,null,null,null,null,null,null,null,null,null,null,null,null,null,"OK",13110,"OUI"]
[17,"ANNOEULLIN","GUILLEMANT          ","DAVID        ","1977-01-30","016875B",null,null,null,null,null,null,null,null,null,null,8,"N3",2.0337078651685392,null,"*",8,"N2",0.54900000000000004,null,"*",null,null,null,"OK",13110,"OUI"]
[18,"ANNOEULLIN","GUILLEMANT          ","JEAN MARC    ","1951-01-10","017025V",null,null,null,null,null,null,null,null,null,null,null,null,null,null,null,null,null,null,null,null,null,null,null,"OK",13110,"OUI"]
[19,"ANNOEULLIN","KERKAERT            ","JEAN MARIE   ","1944-04-28","138351F",12,"R4",1.0125,null,"*",null,null,null,null,null,12,"R2",0.65168539325842689,null,"*",null,null,null,null,null,null,null,null,"OK",13110,"OUI"]
[20,"ANNOEULLIN","KRAUPNER            ","JULES        ","1946-09-25","017012I",null,null,null,null,null,null,null,null,null,null,null,null,null,null,null,null,null,null,null,null,null,null,null,"OK",13110,"OUI"]
[21,"ANNOEULLIN","LHERMITTE           ","CEDRIC       ","1979-05-16","016910K",10,"R1",4.9799999999999995,null,"*",null,null,null,null,null,8,"N3",1.8089887640449438,null,"*",null,null,null,null,null,null,null,null,"OK",13110,"OUI"]
[22,"ANNOEULLIN","LOTHE               ","JEAN LUC     ","1949-11-15","016588A",null,null,null,null,null,null,null,null,null,null,null,null,null,null,null,null,null,null,null,null,null,null,null,"OK",13110,"OUI"]
[23,"ANNOEULLIN","MAILLE              ","BERNARD      ","1959-07-15","016763T",10,"R2",2.3824999999999998,null,"*",null,null,null,null,null,null,null,null,null,null,9,"N3",0.39418604651162792,null,"*",null,null,null,"OK",13110,"OUI"]
[24,"ANNOEULLIN","MARTEL Jean-Pierre",null,null,null,null,null,null,null,null,null,null,null,null,null,9,"R2",0.75280898876404501,null,"*",null,null,null,null,null,null,null,null,"",13110]
[25,"ANNOEULLIN","MORANT Kévin",null,null,null,8,"R4",0.79499999999999993,null,"*",null,null,null,null,null,null,null,null,null,null,null,null,null,null,null,null,null,null,"",13110]
[26,"ANNOEULLIN","POTTIER             ","BERTRAND     ","1981-01-20","148250R",null,null,null,null,null,null,null,null,null,null,null,null,null,null,null,null,null,null,null,null,null,null,null,"OK",13110,"OUI"]
[27,"ANNOEULLIN","PREVOST             ","JEAN CLAUDE  ","1939-04-07","016591D",null,null,null,null,null,null,null,null,null,null,null,null,null,null,null,null,null,null,null,null,null,null,null,"OK",13110,"OUI"]
[28,"ANNOEULLIN","RACARY              ","THIBAULT     ","1985-03-26","141510S",10,"R1",4.2699999999999996,null,"*",null,null,null,null,null,null,null,null,null,null,null,null,null,null,null,null,null,null,"OK",13110,"OUI"]
[29,"ANNOEULLIN","SAUVAGE Jean-Claude",null,null,null,10,"R3",1.2949999999999999,null,"*",null,null,null,null,null,null,null,null,null,null,null,null,null,null,null,null,null,null,"",13110]
[30,"ANNOEULLIN","SCIMIA              ","LUIGI        ","1950-10-12","141511T",null,null,null,null,null,null,null,null,null,null,null,null,null,null,null,null,null,null,null,null,null,null,null,"OK",13110,"OUI"]
[31,"ANNOEULLIN","VALLART             ","DIDIER       ","1959-06-16","145781Z",null,null,null,null,null,null,null,null,null,null,null,null,null,null,null,null,null,null,null,null,null,null,null,"OK",13110,"OUI"]
[32,"ANNOEULLIN","VANDAELE            ","DANIEL       ","1940-12-31","102991F",null,null,null,null,null,null,null,null,null,null,null,null,null,null,null,null,null,null,null,null,null,null,null,"OK",13110,"OUI"]
[33,"ANNOEULLIN","VASSAL André",null,null,null,8,"R4",0.54125000000000001,null,"*",null,null,null,null,null,null,null,null,null,null,null,null,null,null,null,null,null,null,"",13110]
[34,"ANNOEULLIN","VERBEKEN            ","GERARD       ","1953-12-13","141512U",null,null,null,null,null,null,null,null,null,null,null,null,null,null,null,null,null,null,null,null,null,null,null,"OK",13110,"OUI"]
[35,"ANNOEULLIN","VERPLANCKE          ","JEAN PIERRE  ","1953-02-07","147295D",null,null,null,null,null,null,null,null,null,null,null,null,null,null,null,null,null,null,null,null,null,null,null,"OK",13110,"OUI"]
[36,"ANNOEULLIN","VINCENT             ","GERARD       ","1948-07-12","141513V",null,null,null,null,null,null,null,null,null,null,null,null,null,null,null,null,null,null,null,null,null,null,null,"OK",13110,"OUI"]
[37,"ANNOEULLIN","ZEUDE               ","ALAIN        ","1958-03-24","141514W",12,"R4",0.96250000000000002,null,"*",null,null,null,null,null,12,"R2",0.6067415730337079,null,"*",null,null,null,null,null,null,null,null,"OK",13110,"OUI"]
[38,"BRUAY SUR ESCAUT","BERNUS Florent",null,null,null,10,"R4",0.91374999999999995,null,"*",null,null,null,null,null,10,"R2",0.5617977528089888,null,"*",null,null,null,null,null,null,null,null,"",13481]
{"$rows_left_out":560}