{"text_format":"1","workbook":"xlsx","n_sheets":4,"sheets":["Match","Adresses","Ecussons","Classification"],"not_rendered":{"charts":0,"images":33,"macros":1,"external_links":2,"defined_names":71,"comments":0,"pivot_tables":0},"unopened":[],"bounds":{"document_bytes":16777216,"sheet_cells":100000,"rows_first":2000,"rows_last":500,"rows_between":2000,"halvings":0,"cell_chars":16384,"cell_head_chars":4096},"cells_cut":0,"cells_raw":0,"read":"whole","date_system":"1900"}

{"sheet":"Match","index":0,"n_rows":33,"n_cols":35,"rows_kept":33,"cut":false,"hidden":false,"merged":[[10,9,11,16],[12,1,13,8],[12,9,13,16],[2,1,8,1],[5,2,5,3],[7,3,7,5],[8,3,8,5],[8,10,8,16],[14,1,15,7],[14,8,15,8],[14,9,15,15],[14,16,15,16],[10,1,11,8],[17,16,18,16],[17,4,18,4],[17,5,18,5],[17,6,18,6],[17,7,18,7],[17,8,18,8],[18,2,18,3],[18,10,18,11],[19,13,20,13],[19,14,20,14],[19,15,20,15],[17,12,18,12],[17,13,18,13],[17,14,18,14],[17,15,18,15],[20,2,20,3],[20,10,20,11],[19,4,20,4],[19,5,20,5],[19,6,20,6],[19,7,20,7],[19,8,20,8],[21,5,22,5],[21,6,22,6],[21,7,22,7],[21,8,22,8],[21,12,22,12],[19,16,20,16],[19,12,20,12],[28,10,29,16],[30,1,30,5],[30,10,30,16],[21,13,22,13],[21,14,22,14],[21,15,22,15],[21,16,22,16],[22,2,22,3],[22,10,22,11],[21,4,22,4],[32,1,34,1],[32,2,34,16],[23,1,24,2],[23,3,24,4],[23,8,24,8],[23,9,24,10],[23,11,24,12],[23,16,24,16],[28,1,29,5],[28,6,30,9]]}
[]
[null,null,null,null,null,null,null,null,null,null,null,null,null,null,null,null,null,null,null,null,null,null,"TRIATHLON D1 (Libre ; Bande ; 3 bandes)",{"$f":"IF(J11=W2,1,IF(J11=W3,2,IF(J11=W4,3,IF(J11=W5,4,0))))","v":0},"D2","LIBRE",null,"D2","BANDE",null,"D2","3 BANDES",null,"D2","CADRES"]
[13107,null,{"$f":"IF(A3=\"\",\"\",IF(VLOOKUP(A3,club,3,FALSE)=0,\"\",VLOOKUP(A3,club,3,FALSE)))","v":"AMICALE BILLARD CLUB DOUAISIEN"},null,null,null,null,null,null,null,null,null,null,null,null,null,null,null,null,null,null,null,"TRIATHLON D1 (Libre ; Bande ; Cadre)",null,"R1",150,null,"R1",60,null,"R1",20,null,"R1",80]
[null,null,{"$f":"IF(A3=\"\",\"\",IF(VLOOKUP(A3,club,4,FALSE)=0,\"\",VLOOKUP(A3,club,4,FALSE)))","v":"Complexe Sportif de la Porte d'Arras"},null,null,null,null,null,null,null,null,null,null,null,null,null,null,null,null,null,null,null,"TRIATHLON D2 (Libre ; Bande ; 3 bandes)",null,"R2",100,null,"R2",40,null,"R2",15,null,"N1","NON"]
[null,null,{"$f":"IF(A3=\"\",\"\",IF(VLOOKUP(A3,club,5,FALSE)=0,\"\",VLOOKUP(A3,club,5,FALSE)))","v":"Rue d'Arras"},null,null,null,null,null,null,null,null,null,null,null,null,null,null,null,null,null,null,null,"TRIATHLON D2 (Libre ; Bande ; Cadre)",null,"R3",70,null,"R3",40,null,"N1","NON",null,"N2","NON"]
[null,null,{"$f":"IF(A3=\"\",\"\",VLOOKUP(A3,club,6,FALSE))","v":59500},null,{"$f":"IF(A3=\"\",\"\",VLOOKUP(A3,club,7,FALSE))","v":"DOUAI"},null,null,null,null,null,null,null,null,null,null,null,null,null,null,null,null,null,null,null,"R4",50,null,"N1","NON",null,"N2","NON",null,"N3","NON"]
[null,null,null,null,null,null,null,null,null,null,null,null,null,null,null,null,null,null,null,null,null,null,null,null,"N1","NON",null,"N2","NON",null,"N3","NON",null,"MAS","NON"]
[null,null,{"$f":"IF(D8=\"\",\"\",\"(\")","v":"("},{"$f":"IF(A3=\"\",\"\",VLOOKUP(A3,club,8,FALSE))","v":327960636},null,null,null,null,null,null,null,null,null,null,null,null,null,null,null,null,null,null,null,null,"N2","NON",null,"N3","NON",null,"MAS","NON",null,"MASTERS","NON"]
[null,null,{"$f":"IF(D9=\"\",\"\",\":\")","v":":"},{"$f":"IF(A3=\"\",\"\",IF(VLOOKUP(A3,club,9,FALSE)=0,\"\",VLOOKUP(A3,club,9,FALSE)))","v":327960636},null,null,null,null,null,"Date :",null,null,null,null,null,null,null,null,null,null,null,null,null,null,"N3","NON",null,"MAS","NON",null,"MASTERS","NON"]
[null,null,null,null,null,null,null,null,null,null,null,null,null,null,null,null,null,null,null,null,null,null,null,null,"MAS","NON",null,"MASTERS","NON"]
[null,null,null,null,null,null,null,null,null,null,null,null,null,null,null,null,null,null,null,null,null,null,null,null,"MASTERS","NON"]
[null,null,null,null,null,null,null,null,null,null,null,null,null,null,null,null,null,null,null,null,null,null,null,null,"R5",50]
[null,"CLUB VISITE",null,null,null,null,null,null,null,"CLUB VISITEUR"]
[]
[]
[null,null,null,null,null,null,null,null,null,null,null,null,null,null,null,null,null,null,null,null,null,null,null,null,"D1","LIBRE",null,"D1","BANDE",null,"D1","3 BANDES",null,"D1","CADRES"]
[null,"NOM PRENOM                   N° LICENCE","CAT.","Pts à réaliser","Pts réalisés","Reprise","Moyenne","Série ","PTS MATCH","NOM PRENOM                   N° LICENCE","CAT.","Pts à réaliser","Pts réalisés","Reprise","Moyenne","Série ","PTS MATCH",null,null,null,null,null,null,null,"MASTERS",500,null,"MASTERS",165,null,"MASTERS",50,null,"MASTERS",300]
[null,{"$f":"IF(Classification!A1=\"\",\"\",VLOOKUP(Classification!A1,Classification!$A$3:$AC$599,3,FALSE)&\" \"&VLOOKUP(Classification!A1,Classification!$A$3:$AC$599,4,FALSE))","v":""},{"$f":"IF(Classification!A1=\"\",\"\",VLOOKUP(Classification!A1,Classification!$A$3:$AC$599,8,FALSE))","v":""},{"$f":"IF(C18=\"\",\"\",IF(LEFT($J$11,12)=\"triathlon d1\",VLOOKUP(C18,Libre_D1,2,FALSE),IF(LEFT($J$11,12)=\"triathlon d2\",VLOOKUP(C18,Libre_D2,2,FALSE))))","v":""},null,null,{"$f":"IF(OR(E18=\"\",F18=\"\"),\"\",E18/F18)","v":""},null,{"$f":"IF(OR(D18=\"\",E18=\"\",L18=\"\",M18=\"\"),\"\",IF((E18/D18)>(M18/L18),2,IF((E18/D18)=(M18/L18),1,0)))","v":""},{"$f":"IF(Classification!B1=\"\",\"\",VLOOKUP(Classification!B1,Classification!$A$3:$AC$599,3,FALSE)&\" \"&VLOOKUP(Classification!B1,Classification!$A$3:$AC$599,4,FALSE))","v":""},{"$f":"IF(Classification!B1=\"\",\"\",VLOOKUP(Classification!B1,Classification!$A$3:$AC$599,8,FALSE))","v":""},{"$f":"IF(K18=\"\",\"\",IF(LEFT($J$11,12)=\"triathlon d1\",VLOOKUP(K18,Libre_D1,2,FALSE),IF(LEFT($J$11,12)=\"triathlon d2\",VLOOKUP(K18,Libre_D2,2,FALSE))))","v":""},null,{"$f":"IF(F18=\"\",\"\",F18)","v":""},{"$f":"IF(OR(M18=\"\",N18=\"\"),\"\",M18/N18)","v":""},null,{"$f":"IF(OR(L18=\"\",M18=\"\",D18=\"\",E18=\"\"),\"\",IF((M18/L18)>(E18/D18),2,IF((M18/L18)=(E18/D18),1,0)))","v":""},null,null,null,null,null,null,null,"N1",375,null,"N1",110,null,"N1",40,null,"N1",200]
[null,{"$f":"IF(Classification!A1=\"\",\"\",VLOOKUP(Classification!A1,Classification!$A$3:$AC$599,6,FALSE))","v":""},{"$f":"IF($J$11=\"\",\"\",\"LIBRE\")","v":""},null,null,null,null,null,null,{"$f":"IF(Classification!B1=\"\",\"\",VLOOKUP(Classification!B1,Classification!$A$3:$AC$599,6,FALSE))","v":""},{"$f":"IF($J$11=\"\",\"\",\"LIBRE\")","v":""},null,null,null,null,null,null,null,null,null,null,null,null,null,"N2",200,null,"N2",80,null,"N2",35,null,"N2",120]
[null,{"$f":"IF(Classification!C1=\"\",\"\",VLOOKUP(Classification!C1,Classification!$A$3:$AC$599,3,FALSE)&\" \"&VLOOKUP(Classification!C1,Classification!$A$3:$AC$599,4,FALSE))","v":""},{"$f":"IF(Classification!C1=\"\",\"\",VLOOKUP(Classification!C1,Classification!$A$3:$AC$599,18,FALSE))","v":""},{"$f":"IF(C20=\"\",\"\",IF(LEFT($J$11,12)=\"triathlon d1\",VLOOKUP(C20,Bande_D1,2,FALSE),IF(LEFT($J$11,12)=\"triathlon d2\",VLOOKUP(C20,Bande_D2,2,FALSE))))","v":""},null,null,{"$f":"IF(OR(E20=\"\",F20=\"\"),\"\",E20/F20)","v":""},null,{"$f":"IF(OR(D20=\"\",E20=\"\",L20=\"\",M20=\"\"),\"\",IF((E20/D20)>(M20/L20),2,IF((E20/D20)=(M20/L20),1,0)))","v":""},{"$f":"IF(Classification!D1=\"\",\"\",VLOOKUP(Classification!D1,Classification!$A$3:$AC$599,3,FALSE)&\" \"&VLOOKUP(Classification!D1,Classification!$A$3:$AC$599,4,FALSE))","v":""},{"$f":"IF(Classification!D1=\"\",\"\",VLOOKUP(Classification!D1,Classification!$A$3:$AC$599,18,FALSE))","v":""},{"$f":"IF(K20=\"\",\"\",IF(LEFT($J$11,12)=\"triathlon d1\",VLOOKUP(K20,Bande_D1,2,FALSE),IF(LEFT($J$11,12)=\"triathlon d2\",VLOOKUP(K20,Bande_D2,2,FALSE))))","v":""},null,{"$f":"IF(F20=\"\",\"\",F20)","v":""},{"$f":"IF(OR(M20=\"\",N20=\"\"),\"\",M20/N20)","v":""},null,{"$f":"IF(OR(L20=\"\",M20=\"\",D20=\"\",E20=\"\"),\"\",IF((M20/L20)>(E20/D20),2,IF((M20/L20)=(E20/D20),1,0)))","v":""},null,null,null,null,null,null,null,"R1",150,null,"R1",60,null,"N3",25,null,"N3",120]
[null,{"$f":"IF(Classification!C1=\"\",\"\",VLOOKUP(Classification!C1,Classification!$A$3:$AC$599,6,FALSE))","v":""},{"$f":"IF($J$11=\"\",\"\",\"BANDE\")","v":""},null,null,null,null,null,null,{"$f":"IF(Classification!D1=\"\",\"\",VLOOKUP(Classification!D1,Classification!$A$3:$AC$599,6,FALSE))","v":""},{"$f":"IF($J$11=\"\",\"\",\"BANDE\")","v":""},null,null,null,null,null,null,null,null,null,null,null,null,null,"R2","NON",null,"R2","NON",null,"R1",20,null,"R1",80]
[null,{"$f":"IF(Classification!E1=\"\",\"\",VLOOKUP(Classification!E1,Classification!$A$3:$AC$599,3,FALSE)&\" \"&VLOOKUP(Classification!E1,Classification!$A$3:$AC$599,4,FALSE))","v":""},{"$f":"IF(Classification!E1=\"\",\"\",IF(mode_21=\"3 bandes\",VLOOKUP(Classification!E1,Classification!$A$3:$AC$599,23,FALSE),VLOOKUP(Classification!E1,Classification!$A$3:$AC$599,13,FALSE)))","v":""},{"$f":"IF(C22=\"\",\"\",IF(AND(RIGHT($J$11,6)=\"andes)\",LEFT($J$11,12)=\"triathlon d1\"),VLOOKUP(C22,Bandes_3_D1,2,FALSE),IF(AND(RIGHT($J$11,6)=\"andes)\",LEFT($J$11,12)=\"triathlon d2\"),VLOOKUP(C22,Bandes_3_D2,2,FALSE),VLOOKUP(C22,cadre,2,FALSE))))","v":""},null,null,{"$f":"IF(OR(E22=\"\",F22=\"\"),\"\",E22/F22)","v":""},null,{"$f":"IF(OR(D22=\"\",E22=\"\",L22=\"\",M22=\"\"),\"\",IF((E22/D22)>(M22/L22),2,IF((E22/D22)=(M22/L22),1,0)))","v":""},{"$f":"IF(Classification!F1=\"\",\"\",VLOOKUP(Classification!F1,Classification!$A$3:$AC$599,3,FALSE)&\" \"&VLOOKUP(Classification!F1,Classification!$A$3:$AC$599,4,FALSE))","v":""},{"$f":"IF(Classification!F1=\"\",\"\",IF(mode_22=\"3 bandes\",VLOOKUP(Classification!F1,Classification!$A$3:$AC$599,23,FALSE),VLOOKUP(Classification!F1,Classification!$A$3:$AC$599,13,FALSE)))","v":""},{"$f":"IF(K22=\"\",\"\",IF(AND(RIGHT($J$11,6)=\"andes)\",LEFT($J$11,12)=\"triathlon d1\"),VLOOKUP(K22,Bandes_3_D1,2,FALSE),IF(AND(RIGHT($J$11,6)=\"andes)\",LEFT($J$11,12)=\"triathlon d2\"),VLOOKUP(K22,Bandes_3_D2,2,FALSE),VLOOKUP(K22,cadre,2,FALSE))))","v":""},null,{"$f":"IF(F22=\"\",\"\",F22)","v":""},{"$f":"IF(OR(M22=\"\",N22=\"\"),\"\",M22/N22)","v":""},null,{"$f":"IF(OR(L22=\"\",M22=\"\",D22=\"\",E22=\"\"),\"\",IF((M22/L22)>(E22/D22),2,IF((M22/L22)=(E22/D22),1,0)))","v":""},null,null,null,null,null,null,null,"R3","NON",null,"R3","NON",null,"R2","NON",null,"MAS",300]
[null,{"$f":"IF(Classification!E1=\"\",\"\",VLOOKUP(Classification!E1,Classification!$A$3:$AC$599,6,FALSE))","v":""},{"$f":"IF($X$2=0,\"\",IF(OR($X$2=1,$X$2=3),\"3 BANDES\",\"CADRES\"))","v":""},null,null,null,null,null,null,{"$f":"IF(Classification!F1=\"\",\"\",VLOOKUP(Classification!F1,Classification!$A$3:$AC$599,6,FALSE))","v":""},{"$f":"IF($X$2=0,\"\",IF(OR($X$2=1,$X$2=3),\"3 BANDES\",\"CADRES\"))","v":""},null,null,null,null,null,null,null,null,null,null,null,null,null,"R4","NON",null,"MAS",165,null,"R3","NON"]
[null,"POURCENTAGE DE POINTS REALISES",null,{"$f":"IF(OR(D18=\"\",D20=\"\",D22=\"\"),\"\",((E18/D18+E20/D20+E22/D22))/3)","v":""},null,null,null,null,{"$f":"SUM(I18:I23)","v":0},"POURCENTAGE DE POINTS REALISES",null,{"$f":"IF(OR(L18=\"\",L20=\"\",L22=\"\"),\"\",((M18/L18+M20/L20+M22/L22))/3)","v":""},null,null,null,null,{"$f":"SUM(Q18:Q23)","v":0},null,null,null,null,null,null,null,"R5","NON",null,null,null,null,"MAS",50]
[null,null,null,null,null,null,null,null,null,null,null,null,null,null,null,null,null,null,null,null,null,null,null,null,"MAS",500]
[null,null,"<====Capitaine",null,null,null,null,null,null,null,"<====Capitaine"]
[null,null,"<====Signature du capitaine",null,null,null,null,null,null,null,"<====Signature du capitaine"]
[]
[null,{"$f":"IF(AND(B15=\"\",J15=\"\"),\"\",IF(OR(I24>Q24,I24=Q24),B15,J15))","v":""},null,null,null,null,{"$f":"IF(I24=Q24,\"EGAL\",\"BAT\")","v":"EGAL"},null,null,null,{"$f":"IF(AND(B15=\"\",J15=\"\"),\"\",IF(OR(I24>Q24,I24=Q24),J15,B15))","v":""}]
[]
[null,{"$f":"IF(B29=B15,I24,IF(B29=J15,Q24,\"\"))","v":0},null,null,null,null,null,null,null,null,{"$f":"IF(K29=B15,I24,IF(K29=J15,Q24,\"\"))","v":0}]
[]
[null,"OBSERVATION :"]

{"sheet":"Adresses","index":1,"n_rows":35,"n_cols":10,"rows_kept":35,"cut":false,"hidden":false,"merged":[]}
[]
["N°Club","Ville","Nom Club","Adresse 1","Adresse 2","CP","VILLE2","Tel","Fax","Mel"]
[13101,"ARRAS","BILLARD CLUB ARRAGEOIS","Rue Paul  Claudel ","Résidence Saint Pol",62000,"ARRAS","03 21 23 33 96","03 21 23 33 96","arras.billardclub@wanadoo.fr"]
[13102,"AVION","BILLARD CLUB AVIONNAIS","GRPT Joliot Curie","Avenue Salingue",62210,"AVION",321430945,321420952,"bertrand.fremeaux@wanadoo.fr"]
[13103,"BILLY","BILLARD CLUB BILLYSIEN","3 Avenue de la Fosse 2",null,62420,"BILLY MONTIGNY",321201785,321492144,"billybc@9business.fr"]
[13104,"CARVIN","BILLARD CLUB CARVINOIS","Square Pont du Grès",null,62220,"CARVIN",321740644,321740644,"billard.carvin@cegetel.net"]
[13105,"LENS","AVENIR BILLARD CLUB LENSOIS","Rue Jules Ferry",null,62300,"LENS",321431862,321431862,"sebroussel62@yahoo.fr"]
[13107,"DOUAI","AMICALE BILLARD CLUB DOUAISIEN","Complexe Sportif de la Porte d'Arras","Rue d'Arras",59500,"DOUAI",327960636,327960636,"abcdouaibillard@orange.fr"]
[13109,"AUCHY","BILLARD CLUB AUCHY","Rue de Douai","Complexe Sportif",62138,"AUCHY",321267187,321267187]
[13110,"ANNOEULLIN","SPORT BILLARD CLUB ANNOEULLIN","Rue Watrelot",null,59112,"ANNOEULLIN",320866765,null,"s.b.c.a@orange.fr"]
[13117,"DIVION","BILLARD CLUB DIVIONNAIS","Rue Romain Rolland","Ecole Copernic",62710,"DIVION",321533121,321533121,"bcdivion@free.fr"]
[13123,"FOUQUIERES","BILLARD CLUB FOUQUIERES","38 rue Sainte Menehould",null,62740,"FOUQUIERES",321755759,321755759,"frederic.goetinck@hotmail.fr"]
[13124,"COURRIERES","COURRIERES SPORT BILLARD","28 rue Roger Salengro",null,62710,"COURRIERS",321200335,321200335,"courrieres@artois-billard.com"]
[13226,"WAZEMMES","BILLARD CLUB WAZEMMES","Le Retro","14 rue d'arcol",59000,"LILLE",320872110,null,"fiktoo2@yahoo.fr"]
[13231,"HOUPLINES","BILLARD CLUB HOUPLINES",null,"195 rue victor hugo",59116,"HOUPLINES",320100291,320354728]
[13236,"VILLENEUVE D'ASCQ","BILLARD Français VILLENEUVE D'ASCQ",null,"3 rue jean vilar",59650,"VILLENEUVE D'ASCQ",320055726,null,"davidvankieken@free.fr"]
[13240,"RONCHIN","BILLARD CLUB DU CANON D'OR","Salle Elizabeth dupont","rue pierre Dupont",59790,"RONCHIN",320522000,320521547,"bcco.ronchin@club-internet.fr"]
[13249,"FACHES THUMESNIL","BILLARD CLUB DE FACHES THUMESNIL",null,"173 rue carnot",59155,"FACHES THUMESNIL",320979487,null,"bcft@free.fr"]
[13250,"COUNTRY","LE COUNTRY BILLARD CLUB",null,"22 rue princesse",59000,"LILLE",320744668]
[13251,"LA CHAPELLES","BILLARD CLUB CHAPELLOIS","La plaine de détente","rue omere ollivier",59930,"LA CHAPELLES",320353812,null,"jeanluc.missiaen@wanadoo.fr"]
[13252,"ESTAIRES","BILLARD CLUB ESTAIROIS","Rue Jules Ferry","Impasse Louise de Marillac",59940,"ESTAIRES",328501349,null,"billardestairois@yahoo.fr"]
[13353,"DUNKERQUE","U.S.DUNKERQUOISE","Piscine Asseman","Place paul Asseman",59140,"DUNKERQUE",328669183,null,"usdbillard@wanadoo.fr"]
[13355,"GRAVELINES","U.S.GRAVELINOISE","SPORTICA","Place du polder",59820,"GRAVELINES",328655030,null,"gstop@free.fr"]
[13356,"OUTREAU","BILLARD CLUB OUTREAU","Salle Boër","37 rue jean jaures",62230,"OUTREAU",321803869,null,"eldave.62@orange.fr"]
[13360,"ST POL","BILLARD CLUB ST POLOIS","Centre romain roland","Avenue maurice bertaux",59430,"ST POL",328612377,null,"bc.sainpolois@free.fr"]
[13363,"CUCQ","AMICALE LAIQUE CUCQUOISE","Salle Robert Bouchez","place de l'ancienne mairie",62780,"CUCQ",321845067,null,"billard-de-cucq@wanadoo.fr"]
[13364,"CALAIS","ACADEMIE CALAISIENNE DE BILLARD","Complexe sportif calipso","rue roger martin du gard",62100,"CALAIS",321194394,null,"acbcbillardcalais@wanadoo.fr"]
[13365,"GRANDE-SYNTHE","OLYMPIQUE GRANDE-SYNTHE","Salle léo lagrange","3ter rue rigaud",59760,"GRANDE-SYNTHE",328218392,328218393,"PZERBUL@aol.com"]
[13368,"WIMILLE","BILLARD CLUB DE WIMILLE",null,"72 rue du bon secours",62126,"WIMILLE",321310276,null,"naldo1@hotmail.fr"]
[13369,"WIZERNES","WIZERNES BILLARD CLUB","Résidence marie curie","rue des écoles",62570,"WIZERNES",321392007]
[13370,"LE TOUQUET","LE TOUQUET BILLARD CLUB","Pôle tennistique","rond point des sports",62520,"LE TOUQUET",608047029,null,"letouquetbillardclub@neuf.fr"]
[13477,"VALENCIENNES"]
[13478,"DENAIN","ACADEMIE LA CARAMBOLE","Ancienne école de musique","211 rue de villars",59220,"DENAIN",327292061]
[13481,"BRUAY","BILLARD CLUB BRUAYSIEN",null,"52 rue michel brabant",59860,"Bruay sur escaut",327416004,null,"Billard-club-bruaisien@wanadoo.fr"]
[13482,"CAMBRAI","ACADEMIE DE CAMBRAI","Base de loisirs, Citadelle","La Paix de Nimégue",59400,"CAMBRAI",327783720,null,"Alanbury@free.fr"]

{"sheet":"Ecussons","index":2,"n_rows":27,"n_cols":9,"rows_kept":27,"cut":false,"hidden":false,"merged":[]}
[]
[]
[]
[]
[]
["Annoeulin","Arras","Avion","Billy","Bruay","Calais","Cambrai","Carvin","Courrières"]
[]
[]
[]
[]
[]
[]
["Cucq","Denain","Divion","Douai","Dunkerque","Estaires","Faches Thumesnil","Fouquières","Grande synthe"]
[]
[]
[]
[]
[]
[]
["Gravelines","Houplines","Le touquet","Lens","Outreau","Ronchin","St pol sur mer","Vermelle","Villeneuve d'asq"]
[]
[]
[]
[]
[]
[]
["Wizernes","FFB","59-62","LIGUE","CD59","CD62"]

{"sheet":"Classification","index":3,"n_rows":652,"n_cols":41,"rows_kept":652,"cut":false,"hidden":false,"merged":[]}
[null,null,null,null,null,null,null,null,null,null,null,null,null,null,null,null,null,null,null,null,null,null,null,null,null,null,null,null,null,null,null,null,null,null,null,"ANNOEULLIN",{"$f":"COUNTIF($B$3:$B$652,AJ1)","v":50},{"$f":"AK1+2","v":52},null,null,{"$f":"IF(visite=\"\",\"\",\"a\"&VLOOKUP(visite,$AJ$1:$AL$17,3,FALSE)-VLOOKUP(visite,$AJ$1:$AL$17,2,FALSE)+1&\":\"&\"d\"&VLOOKUP(visite,$AJ$1:$AL$17,3,FALSE))","v":""}]
["Code","NOM CLUB","NOM","Prénom","Date Nais","Licence",null,"CAT","Libre",null,null,null,"CAT","Cadre",null,"*",null,"CAT","Bande",null,null,null,"CAT","3Bandes",null,null,null,"5Quilles",null,null,null,null,null,null,null,"BRUAY",{"$f":"COUNTIF($B$3:$B$652,AJ2)","v":26},{"$f":"AK2+AL1","v":78},null,null,{"$f":"IF(visiteur=\"\",\"\",\"a\"&VLOOKUP(visiteur,$AJ$1:$AL$17,3,FALSE)-VLOOKUP(visiteur,$AJ$1:$AL$17,2,FALSE)+1&\":\"&\"d\"&VLOOKUP(visiteur,$AJ$1:$AL$17,3,FALSE))","v":""}]
[1,"ANNOEULLIN","BAROIS","PATRICK",150358,"138349-D",11,"R3",1.36,null,"*",null,null,null,null,null,null,null,null,null,null,null,null,null,null,null,null,null,null,{"$f":"IF(F3=\"\",\"\",IF(CHAR(65+MOD(LEFT(F3,6),26))=RIGHT(F3,1),\"OK\",\"ERREUR\"))","v":"OK"},null,null,null,null,null,"CAMBRAI",{"$f":"COUNTIF($B$3:$B$652,AJ3)","v":22},{"$f":"AK3+AL2","v":100}]
[2,"ANNOEULLIN","BONSIGNE","JASMIN",160145,"017279-P",0,"R4",1.82,null,"*",null,null,null,null,null,null,null,null,null,null,null,null,null,null,null,null,null,null,"OK",null,null,null,null,null,"COUNTRY",17,117]
[3,"ANNOEULLIN","BULTE","VINCENT",40196,"133053-L",7,"R5",0.99,null,"*",null,null,null,null,null,null,null,null,null,null,null,null,null,null,null,7,1.014,"R1","OK",null,null,null,null,null,"DENAIN",28,145]
[4,"ANNOEULLIN","CARPENTIER","YOHANNE",190370,"016914-O",10,"R2",3.359,null,"*",null,null,null,null,null,99,"R1",1.66,null,"*",11,"N3",0.29399999999999998,null,"*",10,0.97,"N1","OK",null,null,null,null,null,"DOUAI",55,200]
[5,"ANNOEULLIN","CAUX","FREDERIC",230762,"017026-W",10,"R3",1.41,null,"*",null,null,null,null,null,9,"R2",0.98,null,"*",2,"R1",0.33700000000000002,null,"*",10,0.88300000000000001,"N1","OK",null,null,null,null,null,"DUNKERQUE",47,247]
[6,"ANNOEULLIN","COUPEY","EDOUARD",31240,"016585-X",0,"R3",2.0499999999999998,null,"*",null,null,null,null,null,null,null,null,null,null,null,null,null,null,null,null,null,null,"OK",null,null,null,null,null,"ESTAIRES",9,256]
[7,"ANNOEULLIN","COUPIGNY","DANIEL",40347,"101147-H",2,"R4",1.35,null,"*",null,null,null,null,null,89,"R2",1.1599999999999999,null,"*",0,"R2",0.25900000000000001,null,"*",null,null,null,"OK",null,null,null,null,null,"FACHES THUMESNIL",78,334]
[8,"ANNOEULLIN","COURCOL","FRANCOIS",90774,"117712-K",4,"R1",6.25,null,"*",5,"R1",3.31,null,null,4,"R1",1.54,null,"*",5,"N3",0.48299999999999998,null,"*",null,null,null,"OK",null,null,null,null,null,"GRANDE-SYNTHE",16,350]
[9,"ANNOEULLIN","DELOFFRE","MAURICE",141134,"016586-Y",0,"R4",1.71,null,"*",null,null,null,null,null,0,"R2",1.1299999999999999,null,"*",0,"R2",0.28799999999999998,null,"*",null,null,null,"OK",null,null,null,null,null,"GRAVELINES",28,378]
[10,"ANNOEULLIN","DELSOL","CLAUDE",150245,"101150-K",9,"R2",2.74,null,"*",null,null,null,null,null,6,"R1",1.54,null,null,9,"N3",0.38,null,"*",null,null,null,"OK",null,null,null,null,null,"HOUPLINES",28,406]
[11,"ANNOEULLIN","DELSOL","PHILIPPE",261269,"101151-L",3,"N2",12,"R1","*",6,"N1",5.77,"R1",null,10,"N1",3.44,null,"*",11,"N1",0.85899999999999999,null,"*",10,1.2030000000000001,"N1","OK",null,null,null,null,null,"LA CHAPELLES",10,416]
[12,"ANNOEULLIN","DEROLEZ","JEAN-PIERRE",180650,"101152-M",0,"R5","NH",null,null,null,null,null,null,null,null,null,null,null,null,11,"R1",0.26700000000000002,null,"*",10,0.91600000000000004,"R1","OK",null,null,null,null,null,"RONCHIN",93,509]
[13,"ANNOEULLIN","D'HONDT","BERTRAND",81053,"NJ",null,null,null,null,null,null,null,null,null,null,null,null,null,null,null,null,null,null,null,null,null,null,null,{"$error":"#VALUE!"},null,null,null,null,null,"ST POL",23,532]
[14,"ANNOEULLIN","DONNEAU","PHILIPPE",271052,"138350-E",11,"R4",1,null,"*",null,null,null,null,null,null,null,null,null,null,null,null,null,null,null,null,null,null,"OK",null,null,null,null,null,"VILLENEUVE D'ASCQ",54,586]
[15,"ANNOEULLIN","FAUCOMPREZ","DIDIER",150268,"013101-X",null,null,null,null,null,null,null,null,null,null,null,null,null,null,null,null,null,null,null,null,null,null,null,"OK",null,null,null,null,null,"WAZEMMES",11,597]
[16,"ANNOEULLIN","FAUQUEMBERGUE","BERNARD",50651,"016587-Z",6,"R3",2.38,null,"*",null,null,null,null,null,90,"R3",0.83,null,"*",90,"R1",0.34399999999999997,null,"*",null,null,null,"OK"]
[17,"ANNOEULLIN","FLAMENT","JONATHAN",131086,"106480-K",0,"R3",2.08,null,"*",null,null,null,null,null,null,null,null,null,null,null,null,null,null,null,null,null,null,"OK"]
[18,"ANNOEULLIN","GEETS","PATRICE",280855,"126847-T",10,"R3",1.6990000000000001,null,"*",null,null,null,null,null,null,null,null,null,null,null,null,null,null,null,10,0.999,"N1","OK"]
[19,"ANNOEULLIN","GUILBERT","RAYMOND",30439,"016533-X",7,"R3",2.72,null,null,null,null,null,null,null,7,"R1",1.76,null,"*",7,"N3",0.38,"R1",null,null,null,null,"OK"]
[20,"ANNOEULLIN","GUILLEMANT","ALEXANDRE",280680,"016874-A",6,"N1",18.489999999999998,"R1",null,5,"N1",16.670000000000002,"R1","*",5,"N1",3.95,"R1","*",5,"N2",0.69499999999999995,"R1","*",10,1.4339999999999999,"Mas","OK"]
[21,"ANNOEULLIN","GUILLEMANT","DAVID",300177,"016875-B",2,"R1",7.39,null,"*",2,"N3",5.45,null,"*",9,"N2",2.04,null,"*",9,"N2",0.63800000000000001,null,"*",10,1.1439999999999999,"Mas","OK"]
[22,"ANNOEULLIN","GUILLEMANT","JEAN-MARC",100151,"017025-V",null,null,null,null,null,null,null,null,null,null,null,null,null,null,null,null,null,null,null,null,10,0.94,"N1","OK"]
[23,"ANNOEULLIN","JOLY","CEDRIC",230181,"101154-O",0,"R4",1.23,null,"*",null,null,null,null,null,null,null,null,null,null,null,null,null,null,null,null,null,null,"OK"]
[24,"ANNOEULLIN","KERKAERT","JEAN-MARIE",280444,"138351-F",11,"R4",0.93,null,"*",null,null,null,null,null,null,null,null,null,null,null,null,null,null,null,null,null,null,"OK"]
[25,"ANNOEULLIN","KRAUPNER","JULES",250946,"017012-I",92,"N1B",12.79,null,"*",95,"N1",7.75,null,"*",97,"N2",2.39,null,"*",0,"N1b",0.51500000000000001,null,null,null,null,null,"OK"]
[26,"ANNOEULLIN","LHERMITTE","CEDRIC",160579,"016910-K",10,"R1",4.9800000000000004,null,"*",6,"R1",4.1399999999999997,null,"*",9,"N2",1.81,null,"*",11,"N3",0.43,null,"*",10,1.0009999999999999,"N1","OK"]
[27,"ANNOEULLIN","LOEWEISTEN","STEPHANIE",120685,"106481-L",0,"R5",0.72,null,"*",null,null,null,null,null,null,null,null,null,null,null,null,null,null,null,null,null,null,"OK"]
[28,"ANNOEULLIN","LOGEZ","ROBERT",111139,"017339-X",2,"R4",1.46,null,"*",null,null,null,null,null,null,null,null,null,null,null,null,null,null,null,null,null,null,"OK"]
[29,"ANNOEULLIN","MAILLE","BERNARD",150759,"016763-T",10,"R2",2.383,null,"*",null,null,null,null,null,6,"R3",0.91,null,null,9,"N3",0.39400000000000002,null,"*",10,1.014,"N1","OK"]
[30,"ANNOEULLIN","MARTEL","JEAN-PIERRE",50446,"123799-N",7,"R5",1.03,null,"*",null,null,null,null,null,9,"R2",0.75,null,"*",null,null,null,null,null,10,0.78100000000000003,"R1","OK"]
[31,"ANNOEULLIN","MARTIN","RUDY",110686,"106482-M",2,"R2",3,null,"*",null,null,null,null,null,null,null,null,null,null,null,null,null,null,null,null,null,null,"OK"]
[32,"ANNOEULLIN","MESTDAG","OLIVIER",290165,"017214-C",5,"R3",1.35,null,null,null,null,null,null,null,null,null,null,null,null,5,"NC",null,null,null,null,null,null,"OK"]
[33,"ANNOEULLIN","MORANT","CINDY",100284,"121362-U",9,"R4",0.57999999999999996,null,"*",null,null,null,null,null,null,null,null,null,null,null,null,null,null,null,7,1.341,"R1","OK"]
[34,"ANNOEULLIN","MORANT","KEVIN",120990,"129056-S",9,"R4",0.8,null,"*",null,null,null,null,null,null,null,null,null,null,null,null,null,null,null,7,0.77,"R1","OK"]
[35,"ANNOEULLIN","MOYAERT","FREDERIC",241080,"101157-R",1,"R4",1.57,null,"*",null,null,null,null,null,null,null,null,null,null,null,null,null,null,null,null,null,null,"OK"]
[36,"ANNOEULLIN","MUYL","STEPHAN",100575,"016840-S",4,"R1",5.87,null,"*",null,null,null,null,null,3,"R1",2.4,null,"*",5,"N3",0.46899999999999997,"R1","*",null,null,null,"OK"]
[37,"ANNOEULLIN","PARSY","JEAN-MARIE",140147,"138352-G",null,null,null,null,null,null,null,null,null,null,null,null,null,null,null,null,null,null,null,null,null,null,null,"OK"]
[38,"ANNOEULLIN","PEREZ","FRANCIS",201132,"016590-C",7,"R5",0.73,null,"*",null,null,null,null,null,90,"R3",0.77,null,"*",90,"R2",0.223,null,"*",null,null,null,"OK"]
{"$rows_left_out":612}