{"text_format":"1","workbook":"xlsx","n_sheets":4,"sheets":["Match","Adresses","Ecussons","Classification"],"not_rendered":{"charts":0,"images":33,"macros":1,"external_links":2,"defined_names":71,"comments":0,"pivot_tables":0},"unopened":[],"bounds":{"document_bytes":16777216,"sheet_cells":100000,"rows_first":2000,"rows_last":500,"rows_between":2000,"halvings":0,"cell_chars":16384,"cell_head_chars":4096},"cells_cut":0,"cells_raw":0,"read":"whole","date_system":"1900"}

{"sheet":"Match","index":0,"n_rows":33,"n_cols":35,"rows_kept":33,"cut":false,"hidden":false,"merged":[[10,9,11,16],[12,1,13,8],[12,9,13,16],[2,1,8,1],[5,2,5,3],[7,3,7,5],[8,3,8,5],[8,10,8,16],[14,1,15,7],[14,8,15,8],[14,9,15,15],[14,16,15,16],[10,1,11,8],[17,16,18,16],[17,4,18,4],[17,5,18,5],[17,6,18,6],[17,7,18,7],[17,8,18,8],[18,2,18,3],[18,10,18,11],[19,13,20,13],[19,14,20,14],[19,15,20,15],[17,12,18,12],[17,13,18,13],[17,14,18,14],[17,15,18,15],[20,2,20,3],[20,10,20,11],[19,4,20,4],[19,5,20,5],[19,6,20,6],[19,7,20,7],[19,8,20,8],[21,5,22,5],[21,6,22,6],[21,7,22,7],[21,8,22,8],[21,12,22,12],[19,16,20,16],[19,12,20,12],[28,10,29,16],[30,1,30,5],[30,10,30,16],[21,13,22,13],[21,14,22,14],[21,15,22,15],[21,16,22,16],[22,2,22,3],[22,10,22,11],[21,4,22,4],[32,1,34,1],[32,2,34,16],[23,1,24,2],[23,3,24,4],[23,8,24,8],[23,9,24,10],[23,11,24,12],[23,16,24,16],[28,1,29,5],[28,6,30,9]]}
[]
[null,null,null,null,null,null,null,null,null,null,null,null,null,null,null,null,null,null,null,null,null,null,"TRIATHLON D1 (Libre ; Bande ; 3 bandes)",{"$f":"IF(J11=W2,1,IF(J11=W3,2,IF(J11=W4,3,IF(J11=W5,4,0))))","v":0},"D2","LIBRE",null,"D2","BANDE",null,"D2","3 BANDES",null,"D2","CADRES"]
[13107,null,{"$f":"IF(A3=\"\",\"\",IF(VLOOKUP(A3,club,3,FALSE)=0,\"\",VLOOKUP(A3,club,3,FALSE)))","v":"AMICALE BILLARD CLUB DOUAISIEN"},null,null,null,null,null,null,null,null,null,null,null,null,null,null,null,null,null,null,null,"TRIATHLON D1 (Libre ; Bande ; Cadre)",null,"R1",150,null,"R1",60,null,"R1",20,null,"R1",80]
[null,null,{"$f":"IF(A3=\"\",\"\",IF(VLOOKUP(A3,club,4,FALSE)=0,\"\",VLOOKUP(A3,club,4,FALSE)))","v":"Complexe Sportif de la Porte d'Arras"},null,null,null,null,null,null,null,null,null,null,null,null,null,null,null,null,null,null,null,"TRIATHLON D2 (Libre ; Bande ; 3 bandes)",null,"R2",100,null,"R2",40,null,"R2",15,null,"N1","NON"]
[null,null,{"$f":"IF(A3=\"\",\"\",IF(VLOOKUP(A3,club,5,FALSE)=0,\"\",VLOOKUP(A3,club,5,FALSE)))","v":"Rue d'Arras"},null,null,null,null,null,null,null,null,null,null,null,null,null,null,null,null,null,null,null,"TRIATHLON D2 (Libre ; Bande ; Cadre)",null,"R3",70,null,"R3",40,null,"N1","NON",null,"N2","NON"]
[null,null,{"$f":"IF(A3=\"\",\"\",VLOOKUP(A3,club,6,FALSE))","v":59500},null,{"$f":"IF(A3=\"\",\"\",VLOOKUP(A3,club,7,FALSE))","v":"DOUAI"},null,null,null,null,null,null,null,null,null,null,null,null,null,null,null,null,null,null,null,"R4",50,null,"N1","NON",null,"N2","NON",null,"N3","NON"]
[null,null,null,null,null,null,null,null,null,null,null,null,null,null,null,null,null,null,null,null,null,null,null,null,"N1","NON",null,"N2","NON",null,"N3","NON",null,"MAS","NON"]
[null,null,{"$f":"IF(D8=\"\",\"\",\"(\")","v":"("},{"$f":"IF(A3=\"\",\"\",VLOOKUP(A3,club,8,FALSE))","v":327960636},null,null,null,null,null,null,null,null,null,null,null,null,null,null,null,null,null,null,null,null,"N2","NON",null,"N3","NON",null,"MAS","NON",null,"MASTERS","NON"]
[null,null,{"$f":"IF(D9=\"\",\"\",\":\")","v":":"},{"$f":"IF(A3=\"\",\"\",IF(VLOOKUP(A3,club,9,FALSE)=0,\"\",VLOOKUP(A3,club,9,FALSE)))","v":327960636},null,null,null,null,null,"Date :",null,null,null,null,null,null,null,null,null,null,null,null,null,null,"N3","NON",null,"MAS","NON",null,"MASTERS","NON"]
[null,null,null,null,null,null,null,null,null,null,null,null,null,null,null,null,null,null,null,null,null,null,null,null,"MAS","NON",null,"MASTERS","NON"]
[null,null,null,null,null,null,null,null,null,null,null,null,null,null,null,null,null,null,null,null,null,null,null,null,"MASTERS","NON"]
[null,null,null,null,null,null,null,null,null,null,null,null,null,null,null,null,null,null,null,null,null,null,null,null,"R5",50]
[null,"CLUB VISITE",null,null,null,null,null,null,null,"CLUB VISITEUR"]
[]
[]
[null,null,null,null,null,null,null,null,null,null,null,null,null,null,null,null,null,null,null,null,null,null,null,null,"D1","LIBRE",null,"D1","BANDE",null,"D1","3 BANDES",null,"D1","CADRES"]
[null,"NOM PRENOM                   N° LICENCE","CAT.","Pts à réaliser","Pts réalisés","Reprise","Moyenne","Série ","PTS MATCH","NOM PRENOM                   N° LICENCE","CAT.","Pts à réaliser","Pts réalisés","Reprise","Moyenne","Série ","PTS MATCH",null,null,null,null,null,null,null,"MASTERS",500,null,"MASTERS",165,null,"MASTERS",50,null,"MASTERS",300]
[null,{"$f":"IF(Classification!A1=\"\",\"\",VLOOKUP(Classification!A1,Classification!$A$3:$AC$599,3,FALSE)&\" \"&VLOOKUP(Classification!A1,Classification!$A$3:$AC$599,4,FALSE))","v":""},{"$f":"IF(Classification!A1=\"\",\"\",VLOOKUP(Classification!A1,Classification!$A$3:$AC$599,8,FALSE))","v":""},{"$f":"IF(C18=\"\",\"\",IF(LEFT($J$11,12)=\"triathlon d1\",VLOOKUP(C18,Libre_D1,2,FALSE),IF(LEFT($J$11,12)=\"triathlon d2\",VLOOKUP(C18,Libre_D2,2,FALSE))))","v":""},null,null,{"$f":"IF(OR(E18=\"\",F18=\"\"),\"\",E18/F18)","v":""},null,{"$f":"IF(OR(D18=\"\",E18=\"\",L18=\"\",M18=\"\"),\"\",IF((E18/D18)>(M18/L18),2,IF((E18/D18)=(M18/L18),1,0)))","v":""},{"$f":"IF(Classification!B1=\"\",\"\",VLOOKUP(Classification!B1,Classification!$A$3:$AC$599,3,FALSE)&\" \"&VLOOKUP(Classification!B1,Classification!$A$3:$AC$599,4,FALSE))","v":""},{"$f":"IF(Classification!B1=\"\",\"\",VLOOKUP(Classification!B1,Classification!$A$3:$AC$599,8,FALSE))","v":""},{"$f":"IF(K18=\"\",\"\",IF(LEFT($J$11,12)=\"triathlon d1\",VLOOKUP(K18,Libre_D1,2,FALSE),IF(LEFT($J$11,12)=\"triathlon d2\",VLOOKUP(K18,Libre_D2,2,FALSE))))","v":""},null,{"$f":"IF(F18=\"\",\"\",F18)","v":""},{"$f":"IF(OR(M18=\"\",N18=\"\"),\"\",M18/N18)","v":""},null,{"$f":"IF(OR(L18=\"\",M18=\"\",D18=\"\",E18=\"\"),\"\",IF((M18/L18)>(E18/D18),2,IF((M18/L18)=(E18/D18),1,0)))","v":""},null,null,null,null,null,null,null,"N1",375,null,"N1",110,null,"N1",40,null,"N1",200]
[null,{"$f":"IF(Classification!A1=\"\",\"\",VLOOKUP(Classification!A1,Classification!$A$3:$AC$599,6,FALSE))","v":""},{"$f":"IF($J$11=\"\",\"\",\"LIBRE\")","v":""},null,null,null,null,null,null,{"$f":"IF(Classification!B1=\"\",\"\",VLOOKUP(Classification!B1,Classification!$A$3:$AC$599,6,FALSE))","v":""},{"$f":"IF($J$11=\"\",\"\",\"LIBRE\")","v":""},null,null,null,null,null,null,null,null,null,null,null,null,null,"N2",200,null,"N2",80,null,"N2",35,null,"N2",120]
[null,{"$f":"IF(Classification!C1=\"\",\"\",VLOOKUP(Classification!C1,Classification!$A$3:$AC$599,3,FALSE)&\" \"&VLOOKUP(Classification!C1,Classification!$A$3:$AC$599,4,FALSE))","v":""},{"$f":"IF(Classification!C1=\"\",\"\",VLOOKUP(Classification!C1,Classification!$A$3:$AC$599,18,FALSE))","v":""},{"$f":"IF(C20=\"\",\"\",IF(LEFT($J$11,12)=\"triathlon d1\",VLOOKUP(C20,Bande_D1,2,FALSE),IF(LEFT($J$11,12)=\"triathlon d2\",VLOOKUP(C20,Bande_D2,2,FALSE))))","v":""},null,null,{"$f":"IF(OR(E20=\"\",F20=\"\"),\"\",E20/F20)","v":""},null,{"$f":"IF(OR(D20=\"\",E20=\"\",L20=\"\",M20=\"\"),\"\",IF((E20/D20)>(M20/L20),2,IF((E20/D20)=(M20/L20),1,0)))","v":""},{"$f":"IF(Classification!D1=\"\",\"\",VLOOKUP(Classification!D1,Classification!$A$3:$AC$599,3,FALSE)&\" \"&VLOOKUP(Classification!D1,Classification!$A$3:$AC$599,4,FALSE))","v":""},{"$f":"IF(Classification!D1=\"\",\"\",VLOOKUP(Classification!D1,Classification!$A$3:$AC$599,18,FALSE))","v":""},{"$f":"IF(K20=\"\",\"\",IF(LEFT($J$11,12)=\"triathlon d1\",VLOOKUP(K20,Bande_D1,2,FALSE),IF(LEFT($J$11,12)=\"triathlon d2\",VLOOKUP(K20,Bande_D2,2,FALSE))))","v":""},null,{"$f":"IF(F20=\"\",\"\",F20)","v":""},{"$f":"IF(OR(M20=\"\",N20=\"\"),\"\",M20/N20)","v":""},null,{"$f":"IF(OR(L20=\"\",M20=\"\",D20=\"\",E20=\"\"),\"\",IF((M20/L20)>(E20/D20),2,IF((M20/L20)=(E20/D20),1,0)))","v":""},null,null,null,null,null,null,null,"R1",150,null,"R1",60,null,"N3",25,null,"N3",120]
[null,{"$f":"IF(Classification!C1=\"\",\"\",VLOOKUP(Classification!C1,Classification!$A$3:$AC$599,6,FALSE))","v":""},{"$f":"IF($J$11=\"\",\"\",\"BANDE\")","v":""},null,null,null,null,null,null,{"$f":"IF(Classification!D1=\"\",\"\",VLOOKUP(Classification!D1,Classification!$A$3:$AC$599,6,FALSE))","v":""},{"$f":"IF($J$11=\"\",\"\",\"BANDE\")","v":""},null,null,null,null,null,null,null,null,null,null,null,null,null,"R2","NON",null,"R2","NON",null,"R1",20,null,"R1",80]
[null,{"$f":"IF(Classification!E1=\"\",\"\",VLOOKUP(Classification!E1,Classification!$A$3:$AC$599,3,FALSE)&\" \"&VLOOKUP(Classification!E1,Classification!$A$3:$AC$599,4,FALSE))","v":""},{"$f":"IF(Classification!E1=\"\",\"\",IF(mode_21=\"3 bandes\",VLOOKUP(Classification!E1,Classification!$A$3:$AC$599,23,FALSE),VLOOKUP(Classification!E1,Classification!$A$3:$AC$599,13,FALSE)))","v":""},{"$f":"IF(C22=\"\",\"\",IF(AND(RIGHT($J$11,6)=\"andes)\",LEFT($J$11,12)=\"triathlon d1\"),VLOOKUP(C22,Bandes_3_D1,2,FALSE),IF(AND(RIGHT($J$11,6)=\"andes)\",LEFT($J$11,12)=\"triathlon d2\"),VLOOKUP(C22,Bandes_3_D2,2,FALSE),VLOOKUP(C22,cadre,2,FALSE))))","v":""},null,null,{"$f":"IF(OR(E22=\"\",F22=\"\"),\"\",E22/F22)","v":""},null,{"$f":"IF(OR(D22=\"\",E22=\"\",L22=\"\",M22=\"\"),\"\",IF((E22/D22)>(M22/L22),2,IF((E22/D22)=(M22/L22),1,0)))","v":""},{"$f":"IF(Classification!F1=\"\",\"\",VLOOKUP(Classification!F1,Classification!$A$3:$AC$599,3,FALSE)&\" \"&VLOOKUP(Classification!F1,Classification!$A$3:$AC$599,4,FALSE))","v":""},{"$f":"IF(Classification!F1=\"\",\"\",IF(mode_22=\"3 bandes\",VLOOKUP(Classification!F1,Classification!$A$3:$AC$599,23,FALSE),VLOOKUP(Classification!F1,Classification!$A$3:$AC$599,13,FALSE)))","v":""},{"$f":"IF(K22=\"\",\"\",IF(AND(RIGHT($J$11,6)=\"andes)\",LEFT($J$11,12)=\"triathlon d1\"),VLOOKUP(K22,Bandes_3_D1,2,FALSE),IF(AND(RIGHT($J$11,6)=\"andes)\",LEFT($J$11,12)=\"triathlon d2\"),VLOOKUP(K22,Bandes_3_D2,2,FALSE),VLOOKUP(K22,cadre,2,FALSE))))","v":""},null,{"$f":"IF(F22=\"\",\"\",F22)","v":""},{"$f":"IF(OR(M22=\"\",N22=\"\"),\"\",M22/N22)","v":""},null,{"$f":"IF(OR(L22=\"\",M22=\"\",D22=\"\",E22=\"\"),\"\",IF((M22/L22)>(E22/D22),2,IF((M22/L22)=(E22/D22),1,0)))","v":""},null,null,null,null,null,null,null,"R3","NON",null,"R3","NON",null,"R2","NON",null,"MAS",300]
[null,{"$f":"IF(Classification!E1=\"\",\"\",VLOOKUP(Classification!E1,Classification!$A$3:$AC$599,6,FALSE))","v":""},{"$f":"IF($X$2=0,\"\",IF(OR($X$2=1,$X$2=3),\"3 BANDES\",\"CADRES\"))","v":""},null,null,null,null,null,null,{"$f":"IF(Classification!F1=\"\",\"\",VLOOKUP(Classification!F1,Classification!$A$3:$AC$599,6,FALSE))","v":""},{"$f":"IF($X$2=0,\"\",IF(OR($X$2=1,$X$2=3),\"3 BANDES\",\"CADRES\"))","v":""},null,null,null,null,null,null,null,null,null,null,null,null,null,"R4","NON",null,"MAS",165,null,"R3","NON"]
[null,"POURCENTAGE DE POINTS REALISES",null,{"$f":"IF(OR(D18=\"\",D20=\"\",D22=\"\"),\"\",((E18/D18+E20/D20+E22/D22))/3)","v":""},null,null,null,null,{"$f":"SUM(I18:I23)","v":0},"POURCENTAGE DE POINTS REALISES",null,{"$f":"IF(OR(L18=\"\",L20=\"\",L22=\"\"),\"\",((M18/L18+M20/L20+M22/L22))/3)","v":""},null,null,null,null,{"$f":"SUM(Q18:Q23)","v":0},null,null,null,null,null,null,null,"R5","NON",null,null,null,null,"MAS",50]
[null,null,null,null,null,null,null,null,null,null,null,null,null,null,null,null,null,null,null,null,null,null,null,null,"MAS",500]
[null,null,"<====Capitaine",null,null,null,null,null,null,null,"<====Capitaine"]
[null,null,"<====Signature du capitaine",null,null,null,null,null,null,null,"<====Signature du capitaine"]
[]
[null,{"$f":"IF(AND(B15=\"\",J15=\"\"),\"\",IF(OR(I24>Q24,I24=Q24),B15,J15))","v":""},null,null,null,null,{"$f":"IF(I24=Q24,\"EGAL\",\"BAT\")","v":"EGAL"},null,null,null,{"$f":"IF(AND(B15=\"\",J15=\"\"),\"\",IF(OR(I24>Q24,I24=Q24),J15,B15))","v":""}]
[]
[null,{"$f":"IF(B29=B15,I24,IF(B29=J15,Q24,\"\"))","v":0},null,null,null,null,null,null,null,null,{"$f":"IF(K29=B15,I24,IF(K29=J15,Q24,\"\"))","v":0}]
[]
[null,"OBSERVATION :"]

{"sheet":"Adresses","index":1,"n_rows":35,"n_cols":10,"rows_kept":35,"cut":false,"hidden":false,"merged":[]}
[]
["N°Club","Ville","Nom Club","Adresse 1","Adresse 2","CP","VILLE2","Tel","Fax","Mel"]
[13101,"ARRAS","BILLARD CLUB ARRAGEOIS","Rue Paul  Claudel ","Résidence Saint Pol",62000,"ARRAS","03 21 23 33 96","03 21 23 33 96","arras.billardclub@wanadoo.fr"]
[13102,"AVION","BILLARD CLUB AVIONNAIS","GRPT Joliot Curie","Avenue Salingue",62210,"AVION",321430945,321420952,"bertrand.fremeaux@wanadoo.fr"]
[13103,"BILLY","BILLARD CLUB BILLYSIEN","3 Avenue de la Fosse 2",null,62420,"BILLY MONTIGNY",321201785,321492144,"billybc@9business.fr"]
[13104,"CARVIN","BILLARD CLUB CARVINOIS","Square Pont du Grès",null,62220,"CARVIN",321740644,321740644,"billard.carvin@cegetel.net"]
[13105,"LENS","AVENIR BILLARD CLUB LENSOIS","Rue Jules Ferry",null,62300,"LENS",321431862,321431862,"sebroussel62@yahoo.fr"]
[13107,"DOUAI","AMICALE BILLARD CLUB DOUAISIEN","Complexe Sportif de la Porte d'Arras","Rue d'Arras",59500,"DOUAI",327960636,327960636,"abcdouaibillard@orange.fr"]
[13109,"AUCHY","BILLARD CLUB AUCHY","Rue de Douai","Complexe Sportif",62138,"AUCHY",321267187,321267187]
[13110,"ANNOEULLIN","SPORT BILLARD CLUB ANNOEULLIN","Rue Watrelot",null,59112,"ANNOEULLIN",320866765,null,"s.b.c.a@orange.fr"]
[13117,"DIVION","BILLARD CLUB DIVIONNAIS","Rue Romain Rolland","Ecole Copernic",62710,"DIVION",321533121,321533121,"bcdivion@free.fr"]
[13123,"FOUQUIERES","BILLARD CLUB FOUQUIERES","38 rue Sainte Menehould",null,62740,"FOUQUIERES",321755759,321755759,"frederic.goetinck@hotmail.fr"]
[13124,"COURRIERES","COURRIERES SPORT BILLARD","28 rue Roger Salengro",null,62710,"COURRIERS",321200335,321200335,"courrieres@artois-billard.com"]
[13226,"WAZEMMES","BILLARD CLUB WAZEMMES","Le Retro","14 rue d'arcol",59000,"LILLE",320872110,null,"fiktoo2@yahoo.fr"]
[13231,"HOUPLINES","BILLARD CLUB HOUPLINES",null,"195 rue victor hugo",59116,"HOUPLINES",320100291,320354728]
[13236,"VILLENEUVE D'ASCQ","BILLARD Français VILLENEUVE D'ASCQ",null,"3 rue jean vilar",59650,"VILLENEUVE D'ASCQ",320055726,null,"davidvankieken@free.fr"]
[13240,"RONCHIN","BILLARD CLUB DU CANON D'OR","Salle Elizabeth dupont","rue pierre Dupont",59790,"RONCHIN",320522000,320521547,"bcco.ronchin@club-internet.fr"]
[13249,"FACHES THUMESNIL","BILLARD CLUB DE FACHES THUMESNIL",null,"173 rue carnot",59155,"FACHES THUMESNIL",320979487,null,"bcft@free.fr"]
[13250,"COUNTRY","LE COUNTRY BILLARD CLUB",null,"22 rue princesse",59000,"LILLE",320744668]
[13251,"LA CHAPELLES","BILLARD CLUB CHAPELLOIS","La plaine de détente","rue omere ollivier",59930,"LA CHAPELLES",320353812,null,"jeanluc.missiaen@wanadoo.fr"]
[13252,"ESTAIRES","BILLARD CLUB ESTAIROIS","Rue Jules Ferry","Impasse Louise de Marillac",59940,"ESTAIRES",328501349,null,"billardestairois@yahoo.fr"]
[13353,"DUNKERQUE","U.S.DUNKERQUOISE","Piscine Asseman","Place paul Asseman",59140,"DUNKERQUE",328669183,null,"usdbillard@wanadoo.fr"]
[13355,"GRAVELINES","U.S.GRAVELINOISE","SPORTICA","Place du polder",59820,"GRAVELINES",328655030,null,"gstop@free.fr"]
[13356,"OUTREAU","BILLARD CLUB OUTREAU","Salle Boër","37 rue jean jaures",62230,"OUTREAU",321803869,null,"eldave.62@orange.fr"]
[13360,"ST POL","BILLARD CLUB ST POLOIS","Centre romain roland","Avenue maurice bertaux",59430,"ST POL",328612377,null,"bc.sainpolois@free.fr"]
[13363,"CUCQ","AMICALE LAIQUE CUCQUOISE","Salle Robert Bouchez","place de l'ancienne mairie",62780,"CUCQ",321845067,null,"billard-de-cucq@wanadoo.fr"]
[13364,"CALAIS","ACADEMIE CALAISIENNE DE BILLARD","Complexe sportif calipso","rue roger martin du gard",62100,"CALAIS",321194394,null,"acbcbillardcalais@wanadoo.fr"]
[13365,"GRANDE-SYNTHE","OLYMPIQUE GRANDE-SYNTHE","Salle léo lagrange","3ter rue rigaud",59760,"GRANDE-SYNTHE",328218392,328218393,"PZERBUL@aol.com"]
[13368,"WIMILLE","BILLARD CLUB DE WIMILLE",null,"72 rue du bon secours",62126,"WIMILLE",321310276,null,"naldo1@hotmail.fr"]
[13369,"WIZERNES","WIZERNES BILLARD CLUB","Résidence marie curie","rue des écoles",62570,"WIZERNES",321392007]
[13370,"LE TOUQUET","LE TOUQUET BILLARD CLUB","Pôle tennistique","rond point des sports",62520,"LE TOUQUET",608047029,null,"letouquetbillardclub@neuf.fr"]
[13477,"VALENCIENNES"]
[13478,"DENAIN","ACADEMIE LA CARAMBOLE","Ancienne école de musique","211 rue de villars",59220,"DENAIN",327292061]
[13481,"BRUAY","BILLARD CLUB BRUAYSIEN",null,"52 rue michel brabant",59860,"Bruay sur escaut",327416004,null,"Billard-club-bruaisien@wanadoo.fr"]
[13482,"CAMBRAI","ACADEMIE DE CAMBRAI","Base de loisirs, Citadelle","La Paix de Nimégue",59400,"CAMBRAI",327783720,null,"Alanbury@free.fr"]

{"sheet":"Ecussons","index":2,"n_rows":27,"n_cols":9,"rows_kept":27,"cut":false,"hidden":false,"merged":[]}
[]
[]
[]
[]
[]
["Annoeulin","Arras","Avion","Billy","Bruay","Calais","Cambrai","Carvin","Courrières"]
[]
[]
[]
[]
[]
[]
["Cucq","Denain","Divion","Douai","Dunkerque","Estaires","Faches Thumesnil","Fouquières","Grande synthe"]
[]
[]
[]
[]
[]
[]
["Gravelines","Houplines","Le touquet","Lens","Outreau","Ronchin","St pol sur mer","Vermelle","Villeneuve d'asq"]
[]
[]
[]
[]
[]
[]
["Wizernes","FFB","59-62","LIGUE","CD59","CD62"]

{"sheet":"Classification","index":3,"n_rows":652,"n_cols":41,"rows_kept":652,"cut":false,"hidden":false,"merged":[]}
[null,null,null,null,null,null,null,null,null,null,null,null,null,null,null,null,null,null,null,null,null,null,null,null,null,null,null,null,null,null,null,null,null,null,null,"ANNOEULLIN",{"$f":"COUNTIF($B$3:$B$652,AJ1)","v":50},{"$f":"AK1+2","v":52},null,null,{"$f":"IF(visite=\"\",\"\",\"a\"&VLOOKUP(visite,$AJ$1:$AL$17,3,FALSE)-VLOOKUP(visite,$AJ$1:$AL$17,2,FALSE)+1&\":\"&\"d\"&VLOOKUP(visite,$AJ$1:$AL$17,3,FALSE))","v":""}]
["Code","NOM CLUB","NOM","Prénom","Date Nais","Licence",null,"CAT","Libre",null,null,null,"CAT","Cadre",null,"*",null,"CAT","Bande",null,null,null,"CAT","3Bandes",null,null,null,"5Quilles",null,null,null,null,null,null,null,"BRUAY",{"$f":"COUNTIF($B$3:$B$652,AJ2)","v":26},{"$f":"AK2+AL1","v":78},null,null,{"$f":"IF(visiteur=\"\",\"\",\"a\"&VLOOKUP(visiteur,$AJ$1:$AL$17,3,FALSE)-VLOOKUP(visiteur,$AJ$1:$AL$17,2,FALSE)+1&\":\"&\"d\"&VLOOKUP(visiteur,$AJ$1:$AL$17,3,FALSE))","v":""}]
[1,"ANNOEULLIN","BAROIS","PATRICK",150358,"138349-D",11,"R3",1.36,null,"*",null,null,null,null,null,null,null,null,null,null,null,null,null,null,null,null,null,null,{"$f":"IF(F3=\"\",\"\",IF(CHAR(65+MOD(LEFT(F3,6),26))=RIGHT(F3,1),\"OK\",\"ERREUR\"))","v":"OK"},null,null,null,null,null,"CAMBRAI",{"$f":"COUNTIF($B$3:$B$652,AJ3)","v":22},{"$f":"AK3+AL2","v":100}]
[2,"ANNOEULLIN","BONSIGNE","JASMIN",160145,"017279-P",0,"R4",1.82,null,"*",null,null,null,null,null,null,null,null,null,null,null,null,null,null,null,null,null,null,"OK",null,null,null,null,null,"COUNTRY",17,117]
[3,"ANNOEULLIN","BULTE","VINCENT",40196,"133053-L",7,"R5",0.99,null,"*",null,null,null,null,null,null,null,null,null,null,null,null,null,null,null,7,1.014,"R1","OK",null,null,null,null,null,"DENAIN",28,145]
[4,"ANNOEULLIN","CARPENTIER","YOHANNE",190370,"016914-O",10,"R2",3.359,null,"*",null,null,null,null,null,99,"R1",1.66,null,"*",11,"N3",0.29399999999999998,null,"*",10,0.97,"N1","OK",null,null,null,null,null,"DOUAI",55,200]
[5,"ANNOEULLIN","CAUX","FREDERIC",230762,"017026-W",10,"R3",1.41,null,"*",null,null,null,null,null,9,"R2",0.98,null,"*",2,"R1",0.33700000000000002,null,"*",10,0.88300000000000001,"N1","OK",null,null,null,null,null,"DUNKERQUE",47,247]
[6,"ANNOEULLIN","COUPEY","EDOUARD",31240,"016585-X",0,"R3",2.0499999999999998,null,"*",null,null,null,null,null,null,null,null,null,null,null,null,null,null,null,null,null,null,"OK",null,null,null,null,null,"ESTAIRES",9,256]
[7,"ANNOEULLIN","COUPIGNY","DANIEL",40347,"101147-H",2,"R4",1.35,null,"*",null,null,null,null,null,89,"R2",1.1599999999999999,null,"*",0,"R2",0.25900000000000001,null,"*",null,null,null,"OK",null,null,null,null,null,"FACHES THUMESNIL",78,334]
[8,"ANNOEULLIN","COURCOL","FRANCOIS",90774,"117712-K",4,"R1",6.25,null,"*",5,"R1",3.31,null,null,4,"R1",1.54,null,"*",5,"N3",0.48299999999999998,null,"*",null,null,null,"OK",null,null,null,null,null,"GRANDE-SYNTHE",16,350]
[9,"ANNOEULLIN","DELOFFRE","MAURICE",141134,"016586-Y",0,"R4",1.71,null,"*",null,null,null,null,null,0,"R2",1.1299999999999999,null,"*",0,"R2",0.28799999999999998,null,"*",null,null,null,"OK",null,null,null,null,null,"GRAVELINES",28,378]
[10,"ANNOEULLIN","DELSOL","CLAUDE",150245,"101150-K",9,"R2",2.74,null,"*",null,null,null,null,null,6,"R1",1.54,null,null,9,"N3",0.38,null,"*",null,null,null,"OK",null,null,null,null,null,"HOUPLINES",28,406]
[11,"ANNOEULLIN","DELSOL","PHILIPPE",261269,"101151-L",3,"N2",12,"R1","*",6,"N1",5.77,"R1",null,10,"N1",3.44,null,"*",11,"N1",0.85899999999999999,null,"*",10,1.2030000000000001,"N1","OK",null,null,null,null,null,"LA CHAPELLES",10,416]
[12,"ANNOEULLIN","DEROLEZ","JEAN-PIERRE",180650,"101152-M",0,"R5","NH",null,null,null,null,null,null,null,null,null,null,null,null,11,"R1",0.26700000000000002,null,"*",10,0.91600000000000004,"R1","OK",null,null,null,null,null,"RONCHIN",93,509]
[13,"ANNOEULLIN","D'HONDT","BERTRAND",81053,"NJ",null,null,null,null,null,null,null,null,null,null,null,null,null,null,null,null,null,null,null,null,null,null,null,{"$error":"#VALUE!"},null,null,null,null,null,"ST POL",23,532]
[14,"ANNOEULLIN","DONNEAU","PHILIPPE",271052,"138350-E",11,"R4",1,null,"*",null,null,null,null,null,null,null,null,null,null,null,null,null,null,null,null,null,null,"OK",null,null,null,null,null,"VILLENEUVE D'ASCQ",54,586]
[15,"ANNOEULLIN","FAUCOMPREZ","DIDIER",150268,"013101-X",null,null,null,null,null,null,null,null,null,null,null,null,null,null,null,null,null,null,null,null,null,null,null,"OK",null,null,null,null,null,"WAZEMMES",11,597]
[16,"ANNOEULLIN","FAUQUEMBERGUE","BERNARD",50651,"016587-Z",6,"R3",2.38,null,"*",null,null,null,null,null,90,"R3",0.83,null,"*",90,"R1",0.34399999999999997,null,"*",null,null,null,"OK"]
[17,"ANNOEULLIN","FLAMENT","JONATHAN",131086,"106480-K",0,"R3",2.08,null,"*",null,null,null,null,null,null,null,null,null,null,null,null,null,null,null,null,null,null,"OK"]
[18,"ANNOEULLIN","GEETS","PATRICE",280855,"126847-T",10,"R3",1.6990000000000001,null,"*",null,null,null,null,null,null,null,null,null,null,null,null,null,null,null,10,0.999,"N1","OK"]
[19,"ANNOEULLIN","GUILBERT","RAYMOND",30439,"016533-X",7,"R3",2.72,null,null,null,null,null,null,null,7,"R1",1.76,null,"*",7,"N3",0.38,"R1",null,null,null,null,"OK"]
[20,"ANNOEULLIN","GUILLEMANT","ALEXANDRE",280680,"016874-A",6,"N1",18.489999999999998,"R1",null,5,"N1",16.670000000000002,"R1","*",5,"N1",3.95,"R1","*",5,"N2",0.69499999999999995,"R1","*",10,1.4339999999999999,"Mas","OK"]
[21,"ANNOEULLIN","GUILLEMANT","DAVID",300177,"016875-B",2,"R1",7.39,null,"*",2,"N3",5.45,null,"*",9,"N2",2.04,null,"*",9,"N2",0.63800000000000001,null,"*",10,1.1439999999999999,"Mas","OK"]
[22,"ANNOEULLIN","GUILLEMANT","JEAN-MARC",100151,"017025-V",null,null,null,null,null,null,null,null,null,null,null,null,null,null,null,null,null,null,null,null,10,0.94,"N1","OK"]
[23,"ANNOEULLIN","JOLY","CEDRIC",230181,"101154-O",0,"R4",1.23,null,"*",null,null,null,null,null,null,null,null,null,null,null,null,null,null,null,null,null,null,"OK"]
[24,"ANNOEULLIN","KERKAERT","JEAN-MARIE",280444,"138351-F",11,"R4",0.93,null,"*",null,null,null,null,null,null,null,null,null,null,null,null,null,null,null,null,null,null,"OK"]
[25,"ANNOEULLIN","KRAUPNER","JULES",250946,"017012-I",92,"N1B",12.79,null,"*",95,"N1",7.75,null,"*",97,"N2",2.39,null,"*",0,"N1b",0.51500000000000001,null,null,null,null,null,"OK"]
[26,"ANNOEULLIN","LHERMITTE","CEDRIC",160579,"016910-K",10,"R1",4.9800000000000004,null,"*",6,"R1",4.1399999999999997,null,"*",9,"N2",1.81,null,"*",11,"N3",0.43,null,"*",10,1.0009999999999999,"N1","OK"]
[27,"ANNOEULLIN","LOEWEISTEN","STEPHANIE",120685,"106481-L",0,"R5",0.72,null,"*",null,null,null,null,null,null,null,null,null,null,null,null,null,null,null,null,null,null,"OK"]
[28,"ANNOEULLIN","LOGEZ","ROBERT",111139,"017339-X",2,"R4",1.46,null,"*",null,null,null,null,null,null,null,null,null,null,null,null,null,null,null,null,null,null,"OK"]
[29,"ANNOEULLIN","MAILLE","BERNARD",150759,"016763-T",10,"R2",2.383,null,"*",null,null,null,null,null,6,"R3",0.91,null,null,9,"N3",0.39400000000000002,null,"*",10,1.014,"N1","OK"]
[30,"ANNOEULLIN","MARTEL","JEAN-PIERRE",50446,"123799-N",7,"R5",1.03,null,"*",null,null,null,null,null,9,"R2",0.75,null,"*",null,null,null,null,null,10,0.78100000000000003,"R1","OK"]
[31,"ANNOEULLIN","MARTIN","RUDY",110686,"106482-M",2,"R2",3,null,"*",null,null,null,null,null,null,null,null,null,null,null,null,null,null,null,null,null,null,"OK"]
[32,"ANNOEULLIN","MESTDAG","OLIVIER",290165,"017214-C",5,"R3",1.35,null,null,null,null,null,null,null,null,null,null,null,null,5,"NC",null,null,null,null,null,null,"OK"]
[33,"ANNOEULLIN","MORANT","CINDY",100284,"121362-U",9,"R4",0.57999999999999996,null,"*",null,null,null,null,null,null,null,null,null,null,null,null,null,null,null,7,1.341,"R1","OK"]
[34,"ANNOEULLIN","MORANT","KEVIN",120990,"129056-S",9,"R4",0.8,null,"*",null,null,null,null,null,null,null,null,null,null,null,null,null,null,null,7,0.77,"R1","OK"]
[35,"ANNOEULLIN","MOYAERT","FREDERIC",241080,"101157-R",1,"R4",1.57,null,"*",null,null,null,null,null,null,null,null,null,null,null,null,null,null,null,null,null,null,"OK"]
[36,"ANNOEULLIN","MUYL","STEPHAN",100575,"016840-S",4,"R1",5.87,null,"*",null,null,null,null,null,3,"R1",2.4,null,"*",5,"N3",0.46899999999999997,"R1","*",null,null,null,"OK"]
[37,"ANNOEULLIN","PARSY","JEAN-MARIE",140147,"138352-G",null,null,null,null,null,null,null,null,null,null,null,null,null,null,null,null,null,null,null,null,null,null,null,"OK"]
[38,"ANNOEULLIN","PEREZ","FRANCIS",201132,"016590-C",7,"R5",0.73,null,"*",null,null,null,null,null,90,"R3",0.77,null,"*",90,"R2",0.223,null,"*",null,null,null,"OK"]
[39,"ANNOEULLIN","PREVOST","JEAN-CLAUDE",70439,"016591-D",1,"R5","NH",null,null,null,null,null,null,null,null,null,null,null,null,null,null,null,null,null,null,null,null,"OK"]
[40,"ANNOEULLIN","RACARY","THIBAUT",260385,"141510-S",10,"R1",4.2699999999999996,null,"*",null,null,null,null,null,null,null,null,null,null,null,null,null,null,null,10,0.96,"N1","OK"]
[41,"ANNOEULLIN","SAUVAGE","JEAN-CLAUDE",70536,"121363-V",10,"R3",1.2949999999999999,null,"*",null,null,null,null,null,null,null,null,null,null,null,null,null,null,null,null,null,null,"OK"]
[42,"ANNOEULLIN","SCIMIA","LUIGI",120150,"141511-T",null,null,null,null,null,null,null,null,null,null,null,null,null,null,null,null,null,null,null,null,null,null,null,"OK"]
[43,"ANNOEULLIN","TOURBIER","ANDRE",130549,"016839-R",0,"R5","NH",null,null,null,null,null,null,null,null,null,null,null,null,null,null,null,null,null,null,null,null,"OK"]
[44,"ANNOEULLIN","VANDAELE","DANIEL",311240,"102991-F",null,null,null,null,null,null,null,null,null,null,null,null,null,null,null,null,null,null,null,null,null,null,null,"OK"]
[45,"ANNOEULLIN","VANSTEENKISTE","JACQUES",220744,"016593-F",11,"R4",1.04,null,"*",null,null,null,null,null,2,"R3",0.78,null,"*",null,null,null,null,null,5,0.74099999999999999,"R1","OK"]
[46,"ANNOEULLIN","VASSAL","ANDRE",null,null,9,"R4",0.54,null,"*",null,null,null,null,null,null,null,null,null,null,null,null,null,null,null,null,null,null,""]
[47,"ANNOEULLIN","VERBEKEN","GERARD",131253,"141512-U",null,null,null,null,null,null,null,null,null,null,null,null,null,null,null,null,null,null,null,null,null,null,null,"OK"]
[48,"ANNOEULLIN","VINCENT","GERARD",120748,"141513-V",null,null,null,null,null,null,null,null,null,null,null,null,null,null,null,null,null,null,null,null,null,null,null,"OK"]
[49,"ANNOEULLIN","WESTEEL","BRUNO",160955,"016610-W",93,"N1",26.04,null,"*",93,"N1",9.14,null,"*",96,"N1",2.67,null,"*",96,"N1B",0.44500000000000001,null,null,10,0.99099999999999999,"N1","OK"]
[50,"ANNOEULLIN","ZEUDE","ALAIN",240358,"141514-W",11,"R4",1,null,"*",null,null,null,null,null,null,null,null,null,null,null,null,null,null,null,null,null,null,"OK"]
[51,"BRUAY","BERNAGOZZI","BERNARD",120627,"016718-A",3,"R5",0.94,null,"*",null,null,null,null,null,3,"R3",0.56999999999999995,null,"*",1,"R2",0.17799999999999999,null,"*",null,null,null,"OK"]
[52,"BRUAY","BERNUS","FLORENT",70897,"139724-A",10,"R4",0.91400000000000003,null,"*",null,null,null,null,null,10,"R2",0.56999999999999995,null,"*",null,null,null,null,null,null,null,null,"OK"]
[53,"BRUAY","BERNUS","HERVE",51090,"133101-H",7,"R5",0.71,null,"*",null,null,null,null,null,null,null,null,null,null,null,null,null,null,null,null,null,null,"OK"]
[54,"BRUAY","BUONDELMONTE","ANTONIO",40649,"016719-B",11,"R3",1.72,null,"*",null,null,null,null,null,10,"R1",1.05,null,"*",10,"R1",0.34699999999999998,null,"*",0,0.48799999999999999,null,"OK"]
[55,"BRUAY","BUONDELMONTE","NAZARIO",110442,"017134-A",10,"R3",2.2050000000000001,null,"*",null,null,null,null,null,10,"R1",1.22,null,"*",0,"R2",0.29599999999999999,null,null,7,1.093,"N1","OK"]
[56,"BRUAY","CASTANON","GENARO",120853,"101217-Z",6,"R4",0.96,null,"*",null,null,null,null,null,6,"R3",0.81,null,"*",null,null,null,null,null,null,null,null,"OK"]
[57,"BRUAY","CYTHERE","GERARD",210353,"127681-V",10,"R2",2.34,null,"*",null,null,null,null,null,9,"R1",1.1399999999999999,null,"*",9,"R1",0.36599999999999999,null,"*",null,null,null,"OK"]
[58,"BRUAY","DELORY","GASTON",290136,"016796-A",4,"R3",1.96,null,"*",null,null,null,null,null,5,"R2",1.01,null,"*",9,"R1",0.32,null,"*",null,null,null,"OK"]
[59,"BRUAY","GOSTIAU","JORIS",180790,"131427-X",10,"R3",2.0099999999999998,null,"*",null,null,null,null,null,7,"R3",1.1100000000000001,null,"*",7,"R1",0.30299999999999999,null,null,null,null,null,"OK"]
[60,"BRUAY","HENNEUSE","PATRICK",30856,"016721-D",7,"R2",3.08,null,"*",null,null,null,null,null,6,"N2",2.5,null,"*",9,"N2",0.61199999999999999,null,"*",10,1,"N1","OK"]
[61,"BRUAY","KOLODZIEJCZYK","TADELYSZ",190441,"138369-X",9,"R4",1.01,null,"*",null,null,null,null,null,null,null,null,null,null,null,null,null,null,null,null,null,null,"OK"]
[62,"BRUAY","LEFEBVRE","JEAN-PIERRE",121151,"017246-I",2,"R5",1.1399999999999999,null,"*",null,null,null,null,null,9,"R2",0.59,null,"*",null,null,null,null,null,null,null,null,"OK"]
[63,"BRUAY","LEROY","MARCEL",60642,"016798-C",6,"R3",2.15,null,"*",null,null,null,null,null,7,"R3",1.1100000000000001,null,"*",7,"R1",0.27600000000000002,null,null,null,null,null,"OK"]
[64,"BRUAY","MANCINI","HENRI",100950,"016717-Z",3,"R2",2.21,null,"*",null,null,null,null,null,3,"R2",1.35,null,"*",7,"N3",0.38600000000000001,null,null,5,1.05,"Nat","OK"]
[65,"BRUAY","MARCINIAK","MICHEL",160952,"017267-D",6,"R1",5.93,null,"*",6,"N3",3.81,null,null,5,"N2",3.33,null,"*",7,"N2",0.379,null,null,null,null,null,{"$f":"IF(F67=\"\",\"\",IF(CHAR(65+MOD(LEFT(F67,6),26))=RIGHT(F67,1),\"OK\",\"ERREUR\"))","v":"OK"}]
[66,"BRUAY","MAUPIN","PATRICK",211163,"101216-Y",9,"R1",4.42,null,"*",9,"R1",3.47,null,"*",10,"R1",1.7,null,"*",null,null,null,null,null,10,1.028,"N1","OK"]
[67,"BRUAY","PORTIER","ALEXANDRE",31200,"139644-Y",11,"R4",0.9,null,"*",null,null,null,null,null,11,"R2",0.38,null,"*",10,"R2",9.4E-2,null,"*",null,null,null,"OK"]
[68,"BRUAY","PORTIER","CHRISTOPHE",21093,"139645-Z",11,"R3",2.19,null,"*",null,null,null,null,null,11,"R1",1,null,"*",11,"R1",0.34300000000000003,null,"*",null,null,null,"OK"]
[69,"BRUAY","PORTIER","MARCEL",120158,"143080-C",11,"R4",0.69,null,"*",null,null,null,null,null,null,null,null,null,null,null,null,null,null,null,null,null,null,"OK"]
[70,"BRUAY","RITROVATO","ROMUALD",241189,"131412-I",7,"R2",3.27,null,"*",null,null,null,null,null,9,"R2",0.91,null,"*",7,"R1",0.313,null,"*",7,0.91300000000000003,"Rég","OK"]
[71,"BRUAY","ROUGE","JACQUES",270224,"111685-P",9,"R2",2.82,null,"*",9,"R1",2.46,null,"*",null,null,null,null,null,null,null,null,null,null,null,null,null,"OK"]
[72,"BRUAY","SAINT MAXENT","JEROME",161181,"017409-P",6,"N3",8.23,null,"*",6,"N3",6.59,null,"*",6,"N1",4.5199999999999996,null,"*",6,"N1",0.80200000000000005,"R1","*",7,1.0449999999999999,"Rég","OK"]
[73,"BRUAY","SIZAIRE","RAYMOND",131135,"118273-Z",6,"R4",1.28,null,"*",null,null,null,null,null,6,"R3",0.77,null,"*",null,null,null,null,null,null,null,null,"OK"]
[74,"BRUAY","TISON","FABIEN",31173,"121380-M",7,"R4",1.42,null,"*",null,null,null,null,null,6,"R3",0.96,null,"*",7,"R1",0.33900000000000002,null,"*",null,null,null,"OK"]
[75,"BRUAY","TURPIN","LAURENT",91173,"127680-U",11,"R3",1.22,null,"*",null,null,null,null,null,11,"R1",1.29,null,"*",11,"R1",0.29099999999999998,null,"*",10,1.0549999999999999,"N1","OK"]
[76,"BRUAY","WISNIEWSKI","DONALD",220242,"016725-H",9,"R2",2.93,null,"*",null,null,null,null,null,7,"R1",1.1100000000000001,null,null,0,"R1",0.33700000000000002,null,"*",0,0.86199999999999999,null,"OK"]
[77,"CAMBRAI","BEZIN","ROBERT",170832,"016728-K",2,"R5",1.1200000000000001,null,"*",null,null,null,null,null,1,"R3",0.74,null,"*",98,"R2",0.19900000000000001,null,"*",null,null,null,"OK"]
[78,"CAMBRAI","BOCQUET","GREGOIRE",141292,"141322-M",10,"R4",0.73,null,"*",null,null,null,null,null,null,null,null,null,null,null,null,null,null,null,null,null,null,"OK"]
[79,"CAMBRAI","BRION","JEAN-PIERRE",231045,"016731-N",6,"R4",1.6,null,"*",null,null,null,null,null,9,"R2",0.98,null,"*",9,"R2",0.214,null,"*",null,null,null,"OK"]
[80,"CAMBRAI","BURY","ALAIN",270752,"016732-O",92,"N1",22.64,"R1","*",91,"N1",11.4,"R1","*",92,"N1",3.98,"R1","*",11,"N1",0.64100000000000001,null,null,null,null,null,"OK"]
[81,"CAMBRAI","DECLERCK","BRUNO",241064,"113190-M",10,"R3",1.85,null,"*",null,null,null,null,null,9,"R1",1.39,null,"*",10,"N3",0.42799999999999999,null,"*",null,null,null,"OK"]
[82,"CAMBRAI","DELFOLIE","GERALD",230883,"017454-I",9,"R3",1.23,null,"*",null,null,null,null,null,9,"R2",0.69,null,"*",6,"R2",0.23300000000000001,null,"*",null,null,null,"OK"]
[83,"CAMBRAI","DESCHAMPS","BERTRAND",290173,"109172-Y",9,"R3",1.69,null,"*",null,null,null,null,null,9,"R1",1.02,null,"*",9,"R1",0.27,null,"*",null,null,null,"OK"]
[84,"CAMBRAI","DHENIN","GERARD",90450,"016734-Q",4,"R3",1.59,null,null,null,null,null,null,null,4,"R1",1.2,null,null,4,"R1",0.39100000000000001,null,"*",null,null,null,"OK"]
[85,"CAMBRAI","DRIGUET","ARNAUD",90872,"016891-R",9,"N2",6.45,null,"*",6,"N3",5.33,null,"*",9,"N2",1.98,null,"*",10,"N2",0.56000000000000005,null,"*",null,null,null,"OK"]
[86,"CAMBRAI","DUHEN","FLORIAN",210392,"121381-N",10,"R2",3.69,null,"*",null,null,null,null,null,10,"R1",1.49,null,"*",9,"N3",0.45800000000000002,null,"*",null,null,null,"OK"]
[87,"CAMBRAI","DUMEZ","PAUL",140531,"017247-J",9,"R3",1.42,null,"*",null,null,null,null,null,7,"R3",0.83,null,"*",2,"R2",0.222,null,"*",null,null,null,"OK"]
[88,"CAMBRAI","ISKIW","PAUL",291090,"133102-I",9,"R4",0.5,null,"*",null,null,null,null,null,null,null,null,null,null,null,null,null,null,null,null,null,null,"OK"]
[89,"CAMBRAI","MARQUANT","JEROME",81172,"106108-C",9,"R4",1.08,null,"*",null,null,null,null,null,6,"R3",0.78,null,"*",9,"R1",0.29699999999999999,null,"*",null,null,null,"OK"]
[90,"CAMBRAI","MARTIN","DANIEL",130447,"141323-N",10,"R3",1.3,null,"*",null,null,null,null,null,10,"R2",0.77,null,"*",null,null,null,null,null,null,null,null,"OK"]
[91,"CAMBRAI","MARTIN","EZECHIEL",51492,"125509-H",10,"R4",0.97599999999999998,null,"*",null,null,null,null,null,10,"R2",0.51,null,"*",null,null,null,null,null,null,null,null,"OK"]
[92,"CAMBRAI","MARTIN","NATHANEL",290690,"125510-I",6,"R4",0.68,null,null,null,null,null,null,null,null,null,null,null,null,null,null,null,null,null,null,null,null,"OK"]
[93,"CAMBRAI","MASSIN","PIERRE",281031,"016706-O",0,"R4",1.89,null,"*",null,null,null,null,null,98,"R3",1.0900000000000001,null,"*",0,"R1",0.34399999999999997,null,"*",null,null,null,"OK"]
[94,"CAMBRAI","NOWAKOWSKI","ALEXANDRE",230394,"136020-O",11,"N2",9.64,null,"*",11,"N3",5.97,null,"*",10,"N2",1.86,null,"*",11,"N3",0.40100000000000002,null,"*",null,null,null,"OK"]
[95,"CAMBRAI","PAMART","ALEXIE",null,"136021-P",9,"R4",0.97,null,"*",null,null,null,null,null,null,null,null,null,null,null,null,null,null,null,null,null,null,"OK"]
[96,"CAMBRAI","PIERSON","GUILHEM",240694,"127689-D",7,"R5",0.8,null,"*",null,null,null,null,null,7,"R3",0.32,null,"*",7,"R2",0.13900000000000001,null,"*",7,0.70799999999999996,"Rég","OK"]
[97,"CAMBRAI","ROUSSEAU","BERNARD",60962,"129055-R",9,"R4",1.1499999999999999,null,"*",null,null,null,null,null,9,"R2",0.69,null,"*",10,"R1",0.24399999999999999,null,null,7,1.2769999999999999,"Nat","OK"]
[98,"CAMBRAI","WAXIN","JEAN JACQUES",210547,"122387-F",10,"R4",1.004,null,"*",null,null,null,null,null,10,"R2",0.65,null,"*",9,"R2",0.19800000000000001,null,"*",null,null,null,"OK"]
[99,"COUNTRY","BERNARDEAU","JEAN-MICHEL",221038,"109140-S",null,null,null,null,"*",null,null,null,null,null,null,null,null,null,null,1,"R1",0.38200000000000001,null,"*",null,null,null,"OK"]
[100,"COUNTRY","CORNU","CHRISTOPHE",40370,"114122-I",1,"R5",0.76,null,"*",null,null,null,null,null,null,null,null,null,null,null,null,null,null,null,null,null,null,"OK"]
[101,"COUNTRY","DEVOS","CEDRIC",220974,"118410-G",2,"R5",1.1299999999999999,null,"*",null,null,null,null,null,null,null,null,null,null,2,"R2",0.20899999999999999,null,"*",null,null,null,"OK"]
[102,"COUNTRY","DUVAL","DENIS",121073,"102963-D",99,"R5","NC",null,null,null,null,null,null,null,null,null,null,null,null,null,null,null,null,null,null,null,null,"OK"]
[103,"COUNTRY","FLORENT","RODRIGUE",280673,"114125-L",1,"R4",1.32,null,"*",null,null,null,null,null,null,null,null,null,null,null,null,null,null,null,null,null,null,"OK"]
[104,"COUNTRY","FONTAINE","NICOLAS",10165,"114121-H",1,"R5",0.73,null,"*",null,null,null,null,null,null,null,null,null,null,null,null,null,null,null,null,null,null,"OK"]
[105,"COUNTRY","GORNY","STEPHANE",200573,"114120-G",1,"R4",1.32,null,"*",null,null,null,null,null,null,null,null,null,null,null,null,null,null,null,null,null,null,"OK"]
[106,"COUNTRY","HACQUART","ANTOINE",190673,"106110-E",0,"R4",1.5,null,"*",null,null,null,null,null,null,null,null,null,null,null,null,null,null,null,null,null,null,"OK"]
[107,"COUNTRY","HASBROUCQ","HERVE",150971,"017364-W",99,"R4",1.51,null,"*",null,null,null,null,null,null,null,null,null,null,99,"R2",0.29599999999999999,null,"*",null,null,null,"OK"]
[108,"COUNTRY","MADALENO","FERNAND",280148,"017367-Z",0,"R4",1.25,null,"*",null,null,null,null,null,null,null,null,null,null,null,null,null,null,null,null,null,null,"OK"]
[109,"COUNTRY","POTTE","BERNARD",280352,"017424-E",0,"R3",2.67,null,"*",null,null,null,null,null,3,"R2",1.37,null,"*",3,"R1",0.39700000000000002,null,"*",null,null,null,"OK"]
[110,"COUNTRY","SION","STEPHANE",300672,"109141-T",1,"R1",7.01,null,"*",94,"N2",4.8899999999999997,null,"*",94,"N2",1.87,null,"*",92,"R1",0.44400000000000001,null,"*",null,null,null,"OK"]
[111,"COUNTRY","THELLIER","BERNARD",30947,"109120-Y",0,"R5",1.1299999999999999,null,"*",null,null,null,null,null,null,null,null,null,null,null,null,null,null,null,null,null,null,"OK"]
[112,"COUNTRY","VANBECELAERE","DAVID",300773,"114123-J",1,"R4",1.27,null,"*",null,null,null,null,null,null,null,null,null,null,2,"R1",0.33400000000000002,null,"*",null,null,null,"OK"]
[113,"COUNTRY","VANHECKE","CONSTANT",210227,"017366-Y",0,"R3",2.27,null,"*",null,null,null,null,null,99,"R2",1.48,null,"*",97,"R1",0.22,null,"*",null,null,null,"OK"]
[114,"COUNTRY","VIANE","ROGER",280352,"122383-B",3,"R3",2.57,null,"*",null,null,null,null,null,null,null,null,null,null,null,null,null,null,null,null,null,null,"OK"]
[115,"COUNTRY","VOLLAERTS","THIERRY",130261,"016880-G",1,"R1",6.23,null,"*",1,"R1",3.96,null,"*",null,"R1","NC",null,null,1,"N3",0.50600000000000001,null,"*",null,null,null,"OK"]
[116,"DENAIN","BARNO","CASANDRE",120893,"143080-C",11,"R4",0.56000000000000005,null,"*",null,null,null,null,null,null,null,null,null,null,null,null,null,null,null,null,null,null,"OK"]
[117,"DENAIN","BOULANGER","STEVE",250987,"123808-W",9,"R3",1.69,null,"*",null,null,null,null,null,9,"R2",0.8,null,"*",9,"R1",0.29699999999999999,null,"*",7,1.113,"R1","OK"]
[118,"DENAIN","COLLIEZ","JACQUES",140434,"016894-U",11,"R3",1.79,null,"*",null,null,null,null,null,10,"R1",1.1299999999999999,null,"*",9,"N3",0.40100000000000002,null,"*",null,null,null,"OK"]
[119,"DENAIN","COPPIN","OLIVIER",280778,"136025-T",11,"R4",0.7,null,"*",null,null,null,null,null,10,"R2",0.53,null,"*",9,"R2",0.13700000000000001,null,"*",null,null,null,"OK"]
[120,"DENAIN","DEBRUILLE","ANTHONY",221288,"123789-D",6,"R4",1.71,null,"*",null,null,null,null,null,6,"R3",0.69,null,"*",6,"R1",0.4,null,"*",5,0.88900000000000001,"Nat","OK"]
[121,"DENAIN","DELANNOY","ALEXANDRE",240189,"123810-Y",5,"R3",2.41,null,"*",null,null,null,null,null,5,"R1",1.63,null,"*",5,"R1",0.35699999999999998,null,"*",null,null,null,"OK"]
[122,"DENAIN","DRAPIER","FRANCOIS",240796,"136026-U",9,"R4",0.65,null,"*",null,null,null,null,null,10,"R2",0.31,null,"*",null,null,null,null,null,null,null,null,"OK"]
[123,"DENAIN","DRUART","ANDRE",80331,"017133-Z",10,"R4",0.83599999999999997,null,"*",null,null,null,null,null,9,"R2",0.56999999999999995,null,"*",4,"R2",0.157,null,null,null,null,null,"OK"]
[124,"DENAIN","DUFOUR","PATRICK",140462,"127685-Z",9,"R4",0.81,null,"*",null,null,null,null,null,6,"R3",0.62,null,"*",7,"R2",0.20300000000000001,null,"*",7,0.997,"Nat","OK"]
[125,"DENAIN","ESCHENBRENNER","DONOVAN",121189,"129335-L",9,"N2",6,null,"*",10,"N3",5.63,null,"*",10,"N2",1.84,null,"*",null,null,null,null,null,null,null,null,"OK"]
[126,"DENAIN","ESPALIEU","JEAN-FRANCOIS",110856,"016708-Q",11,"R2",2.39,null,"*",null,null,null,null,null,11,"R1",1.67,null,"*",11,"N2",0.54200000000000004,null,"*",5,1.391,null,"OK"]
[127,"DENAIN","FLEURANT","ALEXANDRE",200999,"141329-T",11,"R4",0.9,null,"*",null,null,null,null,null,null,null,null,null,null,10,"R2",0.14399999999999999,null,"*",null,null,null,"OK"]
[128,"DENAIN","FLEURANT","RICHARD",250564,"016709-R",11,"R3",1.58,null,"*",null,null,null,null,null,99,"R1",1.88,null,"*",11,"N3",0.32600000000000001,null,null,10,0.93500000000000005,"R1","OK"]
[129,"DENAIN","FOURNIER","YVES",270755,"127684-Y",5,"R5",0.5,null,"*",null,null,null,null,null,5,"R3",0.28000000000000003,null,"*",null,null,null,null,null,null,null,null,{"$f":"IF(F131=\"\",\"\",IF(CHAR(65+MOD(LEFT(F131,6),26))=RIGHT(F131,1),\"OK\",\"ERREUR\"))","v":"OK"}]
[130,"DENAIN","GHALEM","MEDHI",300691,"136024-S",9,"R4",0.43,null,"*",null,null,null,null,null,null,null,null,null,null,null,null,null,null,null,null,null,null,"OK"]
[131,"DENAIN","GRUEZ","FRANCIS",250649,"123811-Z",5,"R5",0.97,null,"*",null,null,null,null,null,5,"R3",0.56999999999999995,null,"*",5,"R2",8.6999999999999994E-2,null,"*",null,null,null,"OK"]
[132,"DENAIN","HILAIRE","JIMMY",40893,"137050-E",11,"R2",3.58,null,"*",null,null,null,null,null,9,"R2",0.53,null,"*",11,"N3",0.502,null,"*",null,null,null,"OK"]
[133,"DENAIN","HOCHART","JACK",120899,"138371-Z",11,"R4",0.69,null,"*",null,null,null,null,null,11,"R2",0.45,null,"*",10,"R2",0.152,null,"*",null,null,null,"OK"]
[134,"DENAIN","HOCHART","JAMES",260962,"127686-A",11,"R4",1,null,"*",null,null,null,null,null,11,"R2",0.49,null,"*",9,"R2",0.185,null,"*",10,0.70099999999999996,"R1","OK"]
[135,"DENAIN","HOCHART","JEFFERSON",150594,"123809-X",11,"R3",1.68,null,"*",null,null,null,null,null,7,"R3",0.72,null,"*",10,"R1",0.30199999999999999,null,"*",7,0.91200000000000003,"Rég","OK"]
[136,"DENAIN","HOCHART","JOSHUA",null,null,null,null,null,null,null,null,null,null,null,null,null,null,null,null,null,null,null,null,null,null,10,0.53300000000000003,"R1",""]
[137,"DENAIN","HORNAIN","DENIS",210366,"016710-S",9,"N2",6.12,null,"*",10,"N3",3.16,null,null,9,"N2",2.19,null,"*",11,"N2",0.52400000000000002,null,"*",10,1.01,"N1","OK"]
[138,"DENAIN","JOURNET","FABRICE",200966,"121378-K",9,"R4",0.5,null,"*",null,null,null,null,null,10,"R2",0.33,null,"*",9,"R2",7.6999999999999999E-2,null,"*",null,null,null,"OK"]
[139,"DENAIN","LANGLET","THIERRY",150263,"016712-U",0,"R2",4.3499999999999996,null,"*",null,null,null,null,null,1,"R3",0.83,null,"*",99,"N3",0.47,null,"*",1,1.105,"*","OK"]
[140,"DENAIN","MARCHESSOUX","MICKAEL",130678,"128411-X",10,"R3",1.23,null,"*",null,null,null,null,null,9,"R2",0.67,null,"*",10,"R1",0.27700000000000002,null,"*",10,1.0349999999999999,"R1","OK"]
[141,"DENAIN","MARRONNIER","JEAN-LUC",60456,"129336-M",10,"R4",0.49,null,"*",null,null,null,null,null,10,"R2",0.25,null,"*",null,null,null,null,null,7,0.59299999999999997,"Rég","OK"]
[142,"DENAIN","THERY","VALENTIN",190595,"138373-B",9,"R4",0.78,null,"*",null,null,null,null,null,null,null,null,null,null,null,null,null,null,null,null,null,null,"OK"]
[143,"DENAIN","WAREZ","JULIEN",231298,"141796-S",11,"R4",0.7,null,"*",null,null,null,null,null,null,null,null,null,null,null,null,null,null,null,null,null,null,"OK"]
[144,"DOUAI","ANDRE","FRANCOIS",50465,"123792-G",10,"N2",4.5389999999999997,null,null,9,"N2",5.24,null,"*",9,"N2",2.02,null,"*",10,"N2",0.57699999999999996,null,"*",null,null,null,"OK"]
[145,"DOUAI","ARNAUD","RENE",190962,"143078-A",null,"NC",null,null,null,null,null,null,null,null,null,"NC",null,null,null,null,"NC",null,null,null,null,null,null,"OK"]
[146,"DOUAI","BALLET","ARNAUD",121270,"016833-L",97,"N2",12.23,"R1","*",97,"N1",5.42,"R1","*",2,"N2",1.84,null,null,6,"N2",0.44600000000000001,"R1",null,null,null,null,"OK"]
[147,"DOUAI","BIREMBAUX","CLEMENT",130235,"017017-N",0,"R4",1.2,null,"*",null,null,null,null,null,null,null,null,null,null,null,null,null,null,null,null,null,null,"OK"]
[148,"DOUAI","BONNAILLIE","MICHEL",20832,"EN COURS",null,"NC",null,null,null,null,null,null,null,null,null,"NC",null,null,null,null,"NC",null,null,null,null,null,null,{"$error":"#VALUE!"}]
[149,"DOUAI","BOUCHERY","GHISLAIN",110546,"016575-N",5,"R3",2.0699999999999998,null,"*",null,null,null,null,null,88,"R1",1.51,null,"*",90,"N2",0.432,"R1","*",null,null,null,"OK"]
[150,"DOUAI","BRESSAC","GUILLAUME",230985,"112118-G",11,"R1",5.96,null,"*",11,"N3",3.82,null,"*",11,"N2",1.78,null,"*",11,"N3",0.45800000000000002,",","*",null,null,null,"OK"]
[151,"DOUAI","CARLIER","ARNAUD",51283,"139805-D",9,"R3",0.49,null,"*",null,null,null,null,null,null,null,null,null,null,null,null,null,null,null,null,null,null,"OK"]
[152,"DOUAI","COQUEREL","PATRICK",161050,"121357-P",10,"R4",0.81499999999999995,null,"*",null,null,null,null,null,null,null,null,null,null,null,null,null,null,null,null,null,null,"OK"]
[153,"DOUAI","CROENNE","MICHEL",130732,"016762-S",7,"R5",0.89,null,"*",null,null,null,null,null,96,"R3",0.53,null,"*",3,"R2",0.21199999999999999,null,"*",null,null,null,"OK"]
[154,"DOUAI","DARRAS","MAX",261157,"017021-R",0,"R4",1.27,null,"*",null,null,null,null,null,99,"R3",0.95,null,"*",null,null,null,null,null,null,null,null,"OK"]
[155,"DOUAI","DEL RIZZO","STEPHANE",101169,"116594-K",2,"R5",0.89,null,"*",null,null,null,null,null,null,null,null,null,null,null,null,null,null,null,null,null,null,"OK"]
[156,"DOUAI","DELFORGE","ALAIN",90458,"101130-Q",6,"R4",1.79,null,"*",null,null,null,null,null,null,null,null,null,null,null,null,null,null,null,null,null,null,"OK"]
[157,"DOUAI","DELFORGE","JACQUES",250148,"017020-Q",10,"R3",1.871,null,"*",null,null,null,null,null,null,null,null,null,null,null,null,null,null,null,null,null,null,"OK"]
[158,"DOUAI","DELFORGE","ROGER",70324,"101131-R",10,"R4",0.89300000000000002,null,"*",null,null,null,null,null,null,null,null,null,null,null,null,null,null,null,null,null,null,"OK"]
[159,"DOUAI","DELPLANQUE","FABIEN",271167,"112734-Y",1,"N3",10.62,null,"*",1,"N3",6,null,"*",11,"N1",3.25,null,"*",7,"N1",0.70299999999999996,"R1","*",null,null,null,"OK"]
[160,"DOUAI","DEMAILLY","JEAN-CLAUDE",40845,"107611-X",10,"R3",1.8440000000000001,null,null,null,null,null,null,null,null,null,null,null,null,null,null,null,null,null,null,null,null,"OK"]
[161,"DOUAI","DESBLEUMORTIERS","ANDRE",250557,"016530-U",11,"R1",4.5599999999999996,null,"*",11,"N3",4.0599999999999996,null,"*",11,"R1",1.49,null,"*",11,"N3",0.42099999999999999,null,"*",null,null,null,"OK"]
[162,"DOUAI","DESER","JEAN-CLAUDE",31043,"101132-S",3,"R4",1.53,null,"*",null,null,null,null,null,null,null,null,null,null,null,null,null,null,null,null,null,null,"OK"]
[163,"DOUAI","DESMARETZ","LUCIEN",71024,"129310-M",7,"R3",1.81,null,null,null,null,null,null,null,null,null,null,null,null,null,null,null,null,null,null,null,null,"OK"]
[164,"DOUAI","DESSAINT","PASCAL",260469,"016747-D",11,"Mas",120.32,null,"*",11,"Mas",17.88,null,"*",11,"Mas",6.38,null,"*",11,"N1",0.76400000000000001,null,"*",null,null,null,"OK"]
[165,"DOUAI","DIETHMANN","DIDIER",180171,"017018-O",3,"R4",1.71,null,"*",null,null,null,null,null,null,null,null,null,null,98,"R1",0.34599999999999997,null,"*",null,null,null,"OK"]
[166,"DOUAI","DUMORTIER","MICHEL",191233,"016952-A",85,"N3",4.5999999999999996,null,"*",5,"R1",4.2300000000000004,null,"*",null,null,null,null,null,null,null,null,null,null,null,null,null,"OK"]
[167,"DOUAI","FLASQUE","CLAUDE",80142,"116562-E",11,"R3",1.69,null,"*",null,null,null,null,null,6,"R3",0.94,null,"*",9,"R1",0.26300000000000001,null,"*",null,null,null,"OK"]
[168,"DOUAI","FLIPPE","NICOLAS",31183,"112722-M",6,"R5",0.86,null,"*",null,null,null,null,null,null,null,null,null,null,null,null,null,null,null,null,null,null,"OK"]
[169,"DOUAI","GOSSART","JEAN-YVES",40475,"017161-B",1,"R1",7.23,null,"*",0,"R1",4.5,null,"*",1,"R1",1.83,null,"*",1,"R1",0.35799999999999998,null,"*",null,null,null,"OK"]
[170,"DOUAI","GRIFFON","DANIEL",30246,"134137-D",11,"R3",1.2450000000000001,null,"*",null,null,null,null,null,11,"R2",0.8,null,"*",11,"R1",0.3,null,"*",null,null,null,"OK"]
[171,"DOUAI","HACHE","MICHEL",290256,null,null,null,null,null,null,null,null,null,null,null,null,null,null,null,null,null,null,null,null,null,null,null,null,""]
[172,"DOUAI","KALKA","HUBERT",231186,"112723-N",1,"R5",0.61,null,"*",null,null,null,null,null,null,null,null,null,null,null,null,null,null,null,null,null,null,"OK"]
[173,"DOUAI","KOZZI","JEAN-MICHEL",100558,"123795-J",5,"R4",1.31,null,"*",null,null,null,null,null,null,null,null,null,null,null,null,null,null,null,null,null,null,"OK"]
[174,"DOUAI","LASVAUX","GUY",271048,"101133-T",10,"R3",1.629,null,"*",null,null,null,null,null,96,"R3",0.92,null,"*",96,"R1",0.33300000000000002,null,"*",null,null,null,"OK"]
[175,"DOUAI","LASVAUX","JACKY",280456,"016571-J",97,"N2",14,"R1","*",10,"N2",10.79,null,"*",5,"N2",3.64,"R1","*",99,"N3",0.49399999999999999,null,"*",null,null,null,"OK"]
[176,"DOUAI","LEGRAND","REMY",21039,"101134-U",11,"R3",1.85,null,"*",null,null,null,null,null,10,"R1",1.34,null,"*",11,"N3",0.42699999999999999,null,"*",null,null,null,"OK"]
[177,"DOUAI","LENNE","JEAN-CLAUDE",71233,"101135-V",2,"R4",1.72,null,"*",null,null,null,null,null,93,"R2",1.17,null,"*",92,"R2",0.26300000000000001,null,"*",null,null,null,"OK"]
[178,"DOUAI","LEPERCQ","DIDIER",31163,"016761-R",99,"R2",3.22,null,"*",null,null,null,null,null,99,"R3",1.06,null,"*",92,"R1",0.314,null,"*",null,null,null,"OK"]
[179,"DOUAI","LERMOYER","JEAN",231052,"121358-Q",3,"R5","NH",null,null,null,null,null,null,null,null,null,null,null,null,null,null,null,null,null,null,null,null,"OK"]
[180,"DOUAI","LOISEAU","GUILLAUME",120976,"017016-M",10,"N2",8.6940000000000008,null,"*",10,"N2",6.74,null,"*",10,"N2",1.97,null,"*",11,"N3",0.44500000000000001,null,"*",null,null,null,"OK"]
[181,"DOUAI","MAGUIRE","MAURICE",150639,"136012-G",10,"R4",0.754,null,"*",null,null,null,null,null,null,null,null,null,null,null,null,null,null,null,null,null,null,"OK"]
[182,"DOUAI","MALET","PIERRE",210747,"016572-K",0,"N2",10,"R1","*",10,"N2",5.07,null,null,10,"N2",2.06,null,"*",11,"N2",0.53800000000000003,null,"*",null,null,null,"OK"]
[183,"DOUAI","MARECHAL","MARLENE",230690,"121359-R",5,"R5",0.81,null,"*",null,null,null,null,null,null,null,null,null,null,null,null,null,null,null,null,null,null,"OK"]
[184,"DOUAI","MASIERO","ANDRE",221142,"016573-L",11,"R2",3.93,null,"*",11,"R1",3.19,null,"*",11,"R1",1.65,null,"*",11,"N3",0.40500000000000003,null,"*",null,null,null,"OK"]
[185,"DOUAI","MASIERO","LORENZO",160557,"016951-Z",10,"R2",3.3149999999999999,null,"*",10,"R1",2.4,null,"*",10,"R1",1.43,null,"*",10,"N3",0.38400000000000001,null,"*",10,1.1859999999999999,"R1","OK"]
[186,"DOUAI","MOCQ","MICHEL",130930,"121360-S",11,"R4",0.87,null,"*",null,null,null,null,null,null,null,null,null,null,null,null,null,null,null,null,null,null,"OK"]
[187,"DOUAI","MOTTON","CHRISTOPHE",250973,"EN COURS",null,"NC",null,null,null,null,null,null,null,null,null,"NC",null,null,null,null,"NC",null,null,null,null,null,null,{"$error":"#VALUE!"}]
[188,"DOUAI","NOE","MICKAEL",281272,"136013-H",11,"R3",1.33,null,"*",null,null,null,null,null,11,"R2",0.92,null,"*",11,"R1",0.33700000000000002,null,"*",null,null,null,"OK"]
[189,"DOUAI","PETIT","VINCENT",70887,"123796-K",6,"R3",1.94,null,null,null,null,null,null,null,null,null,null,null,null,null,null,null,null,null,null,null,null,"OK"]
[190,"DOUAI","PROVENZANO","ANTONIO",110562,"016872-Y",0,"R4",1.38,null,"*",null,null,null,null,null,3,"R3",0.77,null,"*",11,"N3",0.34399999999999997,null,null,null,null,null,"OK"]
[191,"DOUAI","RICHARD","JEAN",20432,"112743-H",6,"R5",0.77,null,"*",null,null,null,null,null,null,null,null,null,null,null,null,null,null,null,null,null,null,"OK"]
[192,"DOUAI","ROUSSELET","DAVID",171287,"112701-R",5,"R4",1.39,null,"*",null,null,null,null,null,null,null,null,null,null,null,null,null,null,null,null,null,null,"OK"]
[193,"DOUAI","SAVARY","JEAN",300139,"017023-T",10,"R3",1.5049999999999999,null,null,null,null,null,null,null,98,"R3",0.88,null,"*",1,"R2",0.185,null,"*",null,null,null,{"$f":"IF(F195=\"\",\"\",IF(CHAR(65+MOD(LEFT(F195,6),26))=RIGHT(F195,1),\"OK\",\"ERREUR\"))","v":"OK"}]
[194,"DOUAI","SINTIVE","MARCEL",230329,"017019-P",7,"R4",1.79,null,"*",null,null,null,null,null,1,"R3",0.63,null,"*",null,null,null,null,null,null,null,null,"OK"]
[195,"DOUAI","STIEVET","GUY",80362,"138362-Q",11,"R2",2.91,null,"*",null,null,null,null,null,10,"R1",1.1519999999999999,null,"*",11,"R1",0.31,null,"*",null,null,null,"OK"]
[196,"DOUAI","TOURNON","YVES",140538,"116595-L",11,"R4",0.87,null,"*",null,null,null,null,null,null,null,null,null,null,null,null,null,null,null,null,null,null,"OK"]
[197,"DOUAI","WANT","DAVID",241175,"114434-I",9,"R4",1.02,null,"*",null,null,null,null,null,null,null,null,null,null,null,null,null,null,null,null,null,null,"OK"]
[198,"DOUAI","ZAMYSLEWSKI","ALAIN",281249,"017022-S",11,"R1",4.37,null,"*",10,"N3",4.43,null,"*",9,"N2",2.12,null,"*",9,"N2",0.46700000000000003,null,null,null,null,null,"OK"]
[199,"DUNKERQUE","ACCOU","MAXIME",50587,"017370-C",0,"R4",1.78,null,"*",null,null,null,null,null,1,"R3",0.79,null,"*",null,null,null,null,null,null,null,null,"OK"]
[200,"DUNKERQUE","AMBROSIO","SALVATORE",20737,"017238-A",1,"R4",1.98,null,"*",null,null,null,null,null,4,"R2",1.1599999999999999,null,"*",3,"R1",0.40300000000000002,null,"*",4,1.0900000000000001,null,"OK"]
[201,"DUNKERQUE","BERTELOOT","SEBASTIEN",90386,"118406-C",2,"R5","N.C.",null,null,null,null,null,null,null,null,null,null,null,null,null,null,null,null,null,null,null,null,"OK"]
[202,"DUNKERQUE","BLOUME","RENE",110137,"016644-E",99,"R3",2.56,null,"*",null,null,null,null,null,7,"R2",0.95,null,null,7,"R1",0.36499999999999999,null,"*",null,null,null,"OK"]
[203,"DUNKERQUE","BOUCQUELET","JEAN-CLAUDE",180750,"121451-F",4,"R2",2.76,null,null,5,"R1",4.21,null,"*",5,"R1",1.75,null,"*",3,"N3",0.50700000000000001,null,"*",null,null,null,"OK"]
[204,"DUNKERQUE","BRIOIT","ROGER",301222,"138376-E",11,"R4",1.06,null,"*",null,null,null,null,null,11,"R2",0.63,null,"*",null,null,null,null,null,null,null,null,"OK"]
[205,"DUNKERQUE","CALOONE","RENE",81227,"016648-I",9,"R3",1.2,null,"*",null,null,null,null,null,7,"R3",0.95,null,"*",9,"R1",0.249,null,null,4,0.72899999999999998,"*","OK"]
[206,"DUNKERQUE","CALVO Y BERGA","FABRICE",211268,"017222-K",6,"R4",1.46,null,"*",null,null,null,null,null,0,"R2",1.22,null,"*",null,null,null,null,null,99,0.94599999999999995,"*","OK"]
[207,"DUNKERQUE","CAPPELLE","MARIE",180688,"114270-A",2,"R5",0.35,null,"*",null,null,null,null,null,null,null,null,null,null,null,null,null,null,null,null,null,null,"OK"]
[208,"DUNKERQUE","CARRU","BRUNO",10558,"016650-K",9,"R4",1.08,null,"*",null,null,null,null,null,10,"R2",0.85,null,"*",10,"N3",0.29699999999999999,null,null,10,1.0429999999999999,"R1","OK"]
[209,"DUNKERQUE","COMAS","HENRI",211054,"016780-K",11,"R2",2.65,null,"*",9,"N3",3.6,null,"*",null,null,null,null,null,null,null,null,null,null,null,null,null,"OK"]
[210,"DUNKERQUE","COMERE","ERIC",161273,"112757-V",9,"R2",2.89,null,"*",null,null,null,null,null,null,null,null,null,null,null,null,null,null,null,null,null,null,"OK"]
[211,"DUNKERQUE","COPPEY","CHRISTIAN",40153,"122392-K",null,null,null,null,null,null,null,null,null,null,null,null,null,null,null,9,"R2",0.29199999999999998,null,"*",null,null,null,"OK"]
[212,"DUNKERQUE","DEBOUDT","JEAN",81236,"017264-A",9,"R3",1.83,null,"*",null,null,null,null,null,9,"R2",0.82,null,"*",10,"N3",0.27800000000000002,null,null,10,0.94199999999999995,"R1","OK"]
[213,"DUNKERQUE","DEBUYSER","FRANCIS",151251,"107672-G",11,"R1",4.04,null,"*",null,null,null,null,null,5,"R2",1.46,null,"*",6,"N3",0.60799999999999998,null,"*",null,null,null,"OK"]
[214,"DUNKERQUE","DEBUYSER","FRANCOIS",null,"121452-G",9,"R1",4.04,null,"*",9,"R1",3.45,null,"*",null,null,null,null,null,11,"N2",0.55700000000000005,null,"*",null,null,null,"OK"]
[215,"DUNKERQUE","DECLEMY","GILLES",201150,"107673-H",1,"R3",2.5299999999999998,null,"*",null,null,null,null,null,0,"R2",1.28,null,"*",null,null,null,null,null,null,null,null,"OK"]
[216,"DUNKERQUE","DELPIERRE","ALEXANDRE",130396,"137053-H",11,"R2",2.8,null,"*",null,null,null,null,null,null,null,null,null,null,11,"R1",0.34399999999999997,null,"*",null,null,null,"OK"]
[217,"DUNKERQUE","DEMEULENAERE","ANTHONY",51287,"114258-O",2,"R5",0.77,null,"*",null,null,null,null,null,null,null,null,null,null,null,null,null,null,null,null,null,null,"OK"]
[218,"DUNKERQUE","DESBONNETS","CLEMENTINE",111292,"131440-K",10,"R4",0.67100000000000004,null,"*",null,null,null,null,null,9,"R2",0.33,null,"*",null,null,null,null,null,10,0.72399999999999998,"R1","OK"]
[219,"DUNKERQUE","DESCHODT","ANDRE",251131,"016844-W",null,null,null,null,null,null,null,null,null,null,9,"R1",1.1399999999999999,null,"*",null,null,null,null,null,null,null,null,"OK"]
[220,"DUNKERQUE","DESWELLE","JEAN-PIERRE",110145,"016654-O",11,"N2",8.94,null,"*",10,"N2",5.34,null,null,11,"N1",2.71,null,null,11,"N1",0.77100000000000002,null,"*",7,1.895,"*","OK"]
[221,"DUNKERQUE","DIABI","GILLES",null,"106347-H",11,"R2",3.34,null,"*",null,null,null,null,null,null,null,null,null,null,null,null,null,null,null,null,null,null,"OK"]
[222,"DUNKERQUE","DRUX","ARNAUD",70789,"114269-Z",2,"R5",0.61,null,"*",null,null,null,null,null,null,null,null,null,null,null,null,null,null,null,null,null,null,"OK"]
[223,"DUNKERQUE","FOURNIER","GEOFFREY",180792,"118407-D",7,"R4",0.86,null,null,null,null,null,null,null,null,null,null,null,null,null,null,null,null,null,null,null,null,"OK"]
[224,"DUNKERQUE","GREMAIN","GINO",310569,"017226-O",7,"N3",9.56,null,"*",10,"N2",8.1199999999999992,null,"*",9,"N1",2.77,null,"*",11,"N1",0.84799999999999998,null,"*",10,1.0960000000000001,"Mas","OK"]
[225,"DUNKERQUE","GUILBERT","REGIS",100438,"116593-J",11,"R3",1.5,null,"*",null,null,null,null,null,11,"R2",0.74,null,"*",null,null,null,null,null,null,null,null,"OK"]
[226,"DUNKERQUE","HALLER","JEROME",271086,"107674-I",2,"R5","N.C.",null,null,null,null,null,null,null,null,null,null,null,null,null,null,null,null,null,null,null,null,"OK"]
[227,"DUNKERQUE","HECQUET","DANIEL",null,"136113-D",11,"R4",1.1000000000000001,null,"*",null,null,null,null,null,null,null,null,null,null,null,null,null,null,null,null,null,null,"OK"]
[228,"DUNKERQUE","HUBERT","CLEMENT",190890,"128080-E",7,"R5",0.69,null,"*",null,null,null,null,null,7,"R3",0.42,null,"*",null,null,null,null,null,null,null,null,"OK"]
[229,"DUNKERQUE","HULOT","SOPHIE",60683,"133130-K",9,"R4",0.73,null,"*",null,null,null,null,null,9,"R2",0.4,null,"*",9,"R2",0.14000000000000001,null,"*",10,0.82,"R1","OK"]
[230,"DUNKERQUE","KAYA","TUGRUL",100482,"130654-E",null,null,null,null,null,null,null,null,null,null,null,null,null,null,null,9,"N3",0.38800000000000001,null,"*",null,null,null,"OK"]
[231,"DUNKERQUE","LAGATIE","CLEMENCE",220592,"127869-B",10,"R4",0.82099999999999995,null,"*",null,null,null,null,null,null,null,null,null,null,null,null,null,null,"*",null,null,null,"OK"]
[232,"DUNKERQUE","LEFEBVRE","JONATHAN",null,null,null,null,null,null,null,null,null,null,null,null,null,null,null,null,null,7,"R1",0.49199999999999999,null,null,10,0.96699999999999997,"R1",""]
[233,"DUNKERQUE","LEFEBVRE","VINCENT",80268,"103007-V",11,"N2",10.16,null,"*",11,"N2",6.12,null,"*",11,"N2",2.0299999999999998,null,"*",null,null,null,null,"*",null,null,null,"OK"]
[234,"DUNKERQUE","MARECHAL","FRANCIS",270145,"016842-U",9,"R3",1.62,null,"*",null,null,null,null,null,null,null,null,null,null,5,"R2",0.251,null,null,null,null,null,"OK"]
[235,"DUNKERQUE","MASTALERZ","PASCAL",40759,"103011-Z",10,"R2",3.1760000000000002,null,"*",10,"R1",3.37,null,"*",9,"R1",1.1399999999999999,null,"*",9,"N3",0.42899999999999999,null,"*",null,null,null,"OK"]
[236,"DUNKERQUE","NORBERT","GEORGES",null,"128883-B",11,"R3",1.33,null,"*",null,null,null,null,null,null,null,null,null,null,null,null,null,null,null,null,null,null,"OK"]
[237,"DUNKERQUE","PARANT","CAMILLE",80495,"136925-J",11,"R1",4.76,null,"*",11,4.9800000000000004,3.78,null,"*",10,"R1",1.41,null,"*",10,"N3",0.51500000000000001,null,"*",10,0.94199999999999995,"R1","OK"]
[238,"DUNKERQUE","POULEYN","ANDRE",230255,"016665-Z",11,"R2",3.26,null,"*",10,"R1",2.99,null,"*",11,"R1",1.36,null,"*",11,"R1",0.33100000000000002,null,"*",10,1.1240000000000001,"R1","OK"]
[239,"DUNKERQUE","RAMET","CONSTANT",20125,"016668-C",99,"R4",1.04,null,"*",null,null,null,null,null,2,"R3",1.02,null,"*",3,"R2",0.19900000000000001,null,"*",10,1.07,"R1","OK"]
[240,"DUNKERQUE","ROBAEY","FLORIAN",140988,"114263-T",2,"R5",0.66,null,"*",null,null,null,null,null,null,null,null,null,null,null,null,null,null,"*",null,null,null,"OK"]
[241,"DUNKERQUE","SEINGIER","JEAN-CLAUDE",191240,"016671-F",10,"R2",2.4409999999999998,null,"*",9,"R1",3.19,null,"*",11,"R1",1.25,null,"*",11,"N3",0.45100000000000001,null,null,null,null,null,"OK"]
[242,"DUNKERQUE","SINNAEVE","MAURICE",260641,"017241-D",1,"R2",3.12,null,"*",null,null,null,null,null,1,"R3",1.06,null,"*",1,"R2",0.25800000000000001,null,"*",10,0.96199999999999997,"N1","OK"]
[243,"DUNKERQUE","SKORDILIS","CHRISTOS",60362,"016782-M",null,null,null,null,null,null,null,null,null,null,11,"R1",1.07,null,"*",11,"N3",0.40799999999999997,null,"*",null,null,null,"OK"]
[244,"DUNKERQUE","TOUROUL","PAUL",280934,"016672-G",92,"R4",1.4,null,"*",null,null,null,null,null,85,"R3",1.08,null,"*",6,"R2",0.23100000000000001,null,"*",10,0.89,"N1","OK"]
[245,"DUNKERQUE","YPREEUW","VINCENT",10585,"103032-U",6,"R1",3.99,null,null,null,null,null,null,null,6,"R1",1.41,null,null,6,"N3",0.48699999999999999,null,"*",null,null,null,"OK"]
[246,"ESTAIRES","CARLIER","YVES-ANDRE",null,"141359-X",11,"R4",1.03,null,"*",null,null,null,null,null,null,null,null,null,null,null,null,null,null,null,null,null,null,"OK"]
[247,"ESTAIRES","CUNY","OLIVIER",null,"141360-Y",10,"R3",1.6459999999999999,null,"*",null,null,null,null,null,null,null,null,null,null,null,null,null,null,"*",6,"0.902","*","OK"]
[248,"ESTAIRES","DJELOUAH","GEOFFREY",60584,"016921-V",11,"R3",2.27,null,"*",null,null,null,null,null,0,"R3",0.97,null,"*",null,null,null,null,null,null,null,null,"OK"]
[249,"ESTAIRES","HANNEDOUCHE","BERNARD",null,"141361-Z",11,"R3",2.1,null,"*",null,null,null,null,null,11,"R1",1.04,null,"*",null,null,null,null,null,null,null,null,"OK"]
[250,"ESTAIRES","LANDTSHEERE","FRANCIS",null,"143592-U",null,null,null,null,null,null,null,null,null,null,null,null,null,null,null,null,null,null,null,null,null,null,null,"OK"]
[251,"ESTAIRES","MAHIEU","MARC",null,"143593-V",null,null,null,null,null,null,null,null,null,null,null,null,null,null,null,null,null,null,null,null,null,null,null,"OK"]
[252,"ESTAIRES","MOURIKS","FRANCINE",null,"141362-A",11,"R4",0.66,null,"*",null,null,null,null,null,null,null,null,null,null,null,null,null,null,null,null,null,null,"OK"]
[253,"ESTAIRES","PIENNE","SAMUEL",null,"141364-C",10,"R4",0.83399999999999996,null,"*",null,null,null,null,null,null,null,null,null,null,null,null,null,null,null,null,null,null,"OK"]
[254,"ESTAIRES","WAEGEMACKER","ALAIN",null,"141365-D",11,"R2",3.93,null,"*",null,null,null,null,null,null,null,null,null,null,null,null,null,null,null,null,null,null,"OK"]
[255,"FACHES THUMESNIL","ALLEPAERTS","PIERRE",250171,"017253-P",1,"R5",0.87,null,"*",null,null,null,null,null,null,null,null,null,null,null,null,null,null,null,null,null,null,"OK"]
[256,"FACHES THUMESNIL","BASTENIER","JEAN",221169,"017360-S",11,"R2",3.12,null,"*",9,"R1",3.41,null,"*",10,"R1",1.67,null,"*",10,"R1",0.317,null,null,null,null,null,"OK"]
[257,"FACHES THUMESNIL","BASTENIER","MEHDI",240593,"119358-S",9,"R2",2.58,null,"*",null,null,null,null,null,9,"R1",1.06,null,"*",9,"N3",0.36699999999999999,null,null,10,1.081,"N1",{"$f":"IF(F259=\"\",\"\",IF(CHAR(65+MOD(LEFT(F259,6),26))=RIGHT(F259,1),\"OK\",\"ERREUR\"))","v":"OK"}]
[258,"FACHES THUMESNIL","BATAILLE","LAETITIA",60779,"110599-V",5,"R4",1.33,null,"*",null,null,null,null,null,5,"R3",0.64,null,"*",null,null,null,null,"*",null,null,null,"OK"]
[259,"FACHES THUMESNIL","BATAILLE","MICHEL",21054,"017115-H",7,"R2",2.66,null,null,null,null,null,null,null,5,"R1",1.41,null,null,7,"N3",0.441,null,null,null,null,null,"OK"]
[260,"FACHES THUMESNIL","BATAILLE","MICKAEL",200487,"109132-K",5,"R3",2.09,null,"*",null,null,null,null,null,5,"R2",1.18,null,"*",null,null,null,null,null,4,0.82499999999999996,null,"OK"]
[261,"FACHES THUMESNIL","BEGNE","FRANCOIS-XAVIER",270857,"017324-I",2,"R2",2.61,null,"*",null,null,null,null,null,2,"R1",1.22,null,"*",2,"R1",0.439,null,null,null,null,null,"OK"]
[262,"FACHES THUMESNIL","BETREMIEUX","ALBERT",290626,"017047-R",10,"R3",1.921,null,null,null,null,null,null,null,10,"R1",1.1000000000000001,null,"*",10,"R1",0.34399999999999997,null,"*",null,null,null,"OK"]
[263,"FACHES THUMESNIL","BLIN","JEAN",90727,"016627-N",10,"R3",1.2330000000000001,null,"*",null,null,null,null,null,null,null,null,null,null,null,null,null,null,"*",null,null,null,"OK"]
[264,"FACHES THUMESNIL","BONTINCK","DIDIER",310151,"104526-G",11,"R3",1.93,null,"*",null,null,null,null,null,11,"R1",1.08,null,"*",11,"R1",0.35799999999999998,null,null,null,null,null,"OK"]
[265,"FACHES THUMESNIL","BOULET","SERGE",300473,"130198-Q",11,"R3",2.12,null,"*",null,null,null,null,null,10,"R1",1.04,null,"*",11,"N3",0.39300000000000002,null,"*",null,null,null,"OK"]
[266,"FACHES THUMESNIL","CAPPELLE","BERNARD",251041,"109143-V",10,"R3",1.659,null,"*",null,null,null,null,null,7,"R2",0.81,null,null,null,null,null,null,"*",10,1.19,"R1","OK"]
[267,"FACHES THUMESNIL","CASIER","JEAN",141232,"017117-J",99,"R2",3.52,null,"*",null,null,null,null,null,98,"R1",1.86,null,"*",7,"R1",0.38400000000000001,null,null,null,null,null,"OK"]
[268,"FACHES THUMESNIL","CHEMIN","JEAN-MICHEL",241158,"121436-Q",3,"N3",9.7799999999999994,null,"*",null,"N1",4.25,"R1","*",4,"N3",1.62,null,null,4,"N3",0.32800000000000001,null,"*",null,null,null,"OK"]
[269,"FACHES THUMESNIL","CLYNCKE","CELINE",50392,"133076-I",null,null,null,null,null,null,null,null,null,null,null,null,null,null,null,null,null,null,"R1",null,null,null,null,"OK"]
[270,"FACHES THUMESNIL","CLYNCKE","JEAN-JACQUES",21051,"017038-I",4,"R3",2.2000000000000002,null,"*",null,null,null,null,null,9,"R1",1.1299999999999999,null,"*",7,"N3",0.42599999999999999,null,null,7,0.69399999999999995,"*","OK"]
[271,"FACHES THUMESNIL","DAMBRUNE","CLAUDE",260550,"133077-J",11,"R3",1.96,null,"*",null,null,null,null,null,10,"R2",0.96,null,"*",null,null,null,null,null,10,0.89100000000000001,"N1","OK"]
[272,"FACHES THUMESNIL","DANGREAUX","JERÔME",131165,"016899-Z",1,"R4",1.65,null,"*",null,null,null,null,null,null,null,null,null,null,null,null,null,null,null,null,null,null,"OK"]
[273,"FACHES THUMESNIL","DECONINCK","FRANCKY",220364,"136119-J",10,"N1",18.163,null,"*",11,"N2",6.72,null,"*",null,null,null,null,null,null,null,null,null,null,null,null,null,"OK"]
[274,"FACHES THUMESNIL","DEFREVILLE","RUDY",200475,"114143-D",4,"N2",8.4,"R1",null,4,"N3",8.49,"R1","*",4,"R1",2.39,null,"*",2,"N3",0.47699999999999998,null,null,null,null,null,"OK"]
[275,"FACHES THUMESNIL","DEGRAVE","FRANCK",241063,"017119-L",11,"R3",1.71,null,"*",null,null,null,null,null,11,"R1",1.1499999999999999,null,"*",11,"R1",0.318,null,"*",null,null,null,"OK"]
[276,"FACHES THUMESNIL","DEGRAVE","JORDAN",200192,"121437-R",3,"R5",0.71,null,"*",null,null,null,null,null,null,null,null,null,null,null,null,null,null,"*",null,null,null,"OK"]
[277,"FACHES THUMESNIL","DEHERRIPON","JEAN-LUC",21152,"017041-L",3,"R4",1.32,null,"*",null,null,null,null,null,4,"R3",0.86,null,"*",4,"R1",0.32500000000000001,null,null,null,null,null,"OK"]
[278,"FACHES THUMESNIL","DELEFORGE","DANIEL",160340,"017063-H",4,"R3",2.02,null,"*",null,null,null,null,null,9,"R1",1.04,null,"*",7,"R1",0.39200000000000002,null,"*",null,null,null,"OK"]
[279,"FACHES THUMESNIL","DELEPIERRE","PATRICK",191252,"109142-U",6,"R3",2.57,null,"*",null,null,null,null,null,6,"R3",0.95,null,"*",6,"R1",0.26600000000000001,null,"*",null,null,null,"OK"]
[280,"FACHES THUMESNIL","DELVIGNE","ROMAIN",100685,"129048-K",9,"R3",1.39,null,"*",null,null,null,null,null,null,null,null,null,null,9,"R1",0.309,null,null,10,0.63900000000000001,"R1","OK"]
[281,"FACHES THUMESNIL","DELVILLE","SERGE",21134,"017060-E",5,"R2",3.63,null,"*",null,null,null,null,null,1,"R1",2.02,null,"*",11,"N2",0.56000000000000005,null,"*",null,null,null,"OK"]
[282,"FACHES THUMESNIL","DEMILLY","DOMINIQUE",71049,"017062-G",99,"R4",1.62,null,"*",null,null,null,null,null,99,"R1",2.04,null,"*",4,"R1",0.33300000000000002,null,"*",null,null,null,"OK"]
[283,"FACHES THUMESNIL","DEMILLY","JEAN-SEBASTIEN",10277,"117881-X",3,"R1",6.3,null,"*",4,"R1",4.82,null,"*",5,"N3",2.68,null,"*",4,"N3",0.51200000000000001,null,"*",10,0.74099999999999999,"R1","OK"]
[284,"FACHES THUMESNIL","DERACHE","MICHEL",150954,"016592-E",11,"R2",2.3199999999999998,null,"*",null,null,null,null,null,null,null,null,null,null,null,null,null,null,"*",5,1.387,null,"OK"]
[285,"FACHES THUMESNIL","DESCRYVE","GUY",160946,"133079-L",9,"R4",0.93,null,"*",null,null,null,null,null,null,null,null,null,null,null,null,null,null,null,null,null,null,"OK"]
[286,"FACHES THUMESNIL","DESMETTRE","BRUNO",140673,"016604-Q",10,"R1",3.726,null,null,10,"N3",4.29,null,"*",10,"N2",2.2200000000000002,null,"*",10,"N2",0.55800000000000005,null,null,null,null,null,"OK"]
[287,"FACHES THUMESNIL","DESURMONT","MARC",250956,"127691-F",11,"R3",1.71,null,"*",null,null,null,null,null,11,"R1",1,null,"*",null,null,null,null,"*",null,null,null,"OK"]
[288,"FACHES THUMESNIL","DETHOOR","THIERRY",200169,"017218-G",99,"R1",7.98,null,"*",0,"N2",5,null,"*",99,"R1",2,null,"*",99,"R1",0.36799999999999999,null,null,null,null,null,"OK"]
[289,"FACHES THUMESNIL","DEWULF","PATRICK",291260,"017122-O",4,"R3",1.8,null,null,null,null,null,null,null,4,"R3",0.9,null,"*",4,"R1",0.34499999999999997,null,"*",null,null,null,"OK"]
[290,"FACHES THUMESNIL","DORARD","STEVE",220183,"015585-L",11,"MASTERS",124.55,null,"*",5,null,16.03,"R1","*",11,"Mas",6.03,null,"*",11,"N1",0.82099999999999995,null,"*",2,1.016,null,"OK"]
[291,"FACHES THUMESNIL","DORARD","STEVE",220183,"015585-L",null,null,"47/2",null,null,10,"Masters",24.68,null,"*",null,null,null,null,null,null,null,null,null,"*",null,null,null,"OK"]
[292,"FACHES THUMESNIL","DORARD","STEVE",220183,"015585-L",null,null,"71/2",null,null,10,"Masters",23.9,null,"*",null,null,null,null,null,null,null,null,null,null,null,null,null,"OK"]
[293,"FACHES THUMESNIL","DUCONSEILLE","MICHEL",161243,"017043-N",9,"N2",7.35,null,"*",7,"R1",4.07,null,"*",9,"N2",2,null,"*",7,"N3",0.59199999999999997,null,null,null,null,null,"OK"]
[294,"FACHES THUMESNIL","FALSE","FRANCK",240974,"016907-H",11,"R2",3.22,null,"*",11,"R1",3.46,null,"*",11,"R1",1.52,null,"*",null,"R1",null,null,null,null,null,null,"OK"]
[295,"FACHES THUMESNIL","FAMCHON","HERVE",31269,"017217-F",3,"MASTERS",81.819999999999993,"N3","*",1,"Mas",38.33,"N3","*",7,"N1",3.13,"R1","*",97,"N3",0.51300000000000001,null,"*",null,null,null,"OK"]
[296,"FACHES THUMESNIL","FAMCHON","HERVE",31269,"017217-F",null,null,null,null,null,10,"Masters",8.0299999999999994,null,null,null,null,null,null,null,null,null,null,"R1","*",99,1.528,null,"OK"]
[297,"FACHES THUMESNIL","FAMCHON","HERVE",31269,"017217-F",null,null,"NC 71/2",null,null,9,null,20.02,null,"*",null,null,null,null,null,null,null,null,null,null,null,null,null,"OK"]
[298,"FACHES THUMESNIL","FIQUET","PATRICK",100862,"109119-X",11,"R2",2.81,null,"*",null,null,null,null,null,11,"R1",1.0900000000000001,null,"*",null,null,null,null,null,null,null,null,"OK"]
[299,"FACHES THUMESNIL","FREVILLE","GERARD",40951,"109133-L",1,"R2",4.55,null,"*",null,null,null,null,null,1,"R2",1.1399999999999999,null,"*",0,"R1",0.41099999999999998,null,null,null,null,null,"OK"]
[300,"FACHES THUMESNIL","FREVILLE","PASCAL",300973,"124452-Q",4,"N2",11.45,"R1","*",4,"N1",6.65,"R1","*",4,"N2",3.18,null,"*",97,"N2",0.52200000000000002,null,"*",null,null,null,"OK"]
[301,"FACHES THUMESNIL","GAUQUIE","SERGE",100547,"017116-I",11,"N2",7.28,null,null,11,"N2",6.65,null,"*",11,"N2",1.75,null,null,11,"N3",0.44900000000000001,null,"*",null,null,null,"OK"]
[302,"FACHES THUMESNIL","GOUTAL","DIDIER",150857,"017359-R",95,"R2",3.04,null,"*",null,null,null,null,null,90,"R2",1.23,null,"*",1,"R1",0.38400000000000001,null,"*",null,null,null,"OK"]
[303,"FACHES THUMESNIL","HANSKENS","GEORGES",290933,"121438-S",7,"R4",1.56,null,"*",null,null,null,null,null,7,"R3",0.92,null,"*",9,"R2",0.20899999999999999,null,"*",null,null,null,"OK"]
[304,"FACHES THUMESNIL","HAUTEKEUR","GERARD",80650,"133026-K",11,"R4",0.84,null,"*",null,null,null,null,null,null,null,null,null,null,null,null,null,null,"*",null,null,null,"OK"]
[305,"FACHES THUMESNIL","JACQUES","CELINE",190482,"021080-U",11,"R1",5.19,null,null,7,"N2",3.94,null,null,5,"R1",1.22,null,"*",11,"N3",0.46700000000000003,null,"*",null,null,null,"OK"]
[306,"FACHES THUMESNIL","LEZIS","ALPHONSE",71131,"017039-J",9,"R1",4.1900000000000004,null,"*",5,"R1",3.51,null,"*",10,"R1",1.44,null,"*",9,"N3",0.42399999999999999,null,"*",null,null,null,"OK"]
[307,"FACHES THUMESNIL","LORTHIOIR","JEAN-LUC",280554,"129054-Q",10,"R3",1.075,null,null,null,null,null,null,null,9,"R2",0.82,null,"*",11,"R1",0.308,null,"*",null,null,null,"OK"]
[308,"FACHES THUMESNIL","MENAD","RACHID",190570,"017203-R",4,"R3",2.17,null,"*",null,null,null,null,null,3,"R2",1.1299999999999999,null,"*",4,"N3",0.379,null,"*",10,0.72799999999999998,"R1","OK"]
[309,"FACHES THUMESNIL","MEURANT","MICHEL","130930","102993-H",2,"R4",1.31,null,"*",null,null,null,null,null,90,"R2",1.23,null,"*",86,"R1",0.30399999999999999,null,null,1,0.69,"*","OK"]
[310,"FACHES THUMESNIL","MILLET","MICHEL",260448,"017423-D",7,"N2",11.14,null,"*",7,"N1",5.87,"R1",null,10,"N2",2.5,null,"*",10,"N1",0.75,null,"*",null,null,null,"OK"]
[311,"FACHES THUMESNIL","MOREL","ALBERT",181030,"017074-S",10,"R3",1.359,null,null,null,null,null,null,null,6,"R3",1.02,null,"*",5,"R1",0.215,null,"*",4,0.874,null,"OK"]
[312,"FACHES THUMESNIL","MOREL","EMILE",240232,"017045-P",11,"R4",0.92,null,"*",null,null,null,null,null,4,"R3",0.52,null,"*",0,"R2",0.17199999999999999,null,null,null,null,null,"OK"]
[313,"FACHES THUMESNIL","PETIT","JOEL",171253,"016818-W",9,"R2",2.82,null,"*",null,null,null,null,null,9,"R1",1.38,null,"*",7,"N3",0.42099999999999999,null,"*",null,null,null,"OK"]
[314,"FACHES THUMESNIL","PETTINATO","GIOVANNI",141250,"016999-V",11,"R1",3.85,null,"*",11,"R1",3.22,null,"*",11,"R1",1.1200000000000001,null,"*",11,"R1",0.34499999999999997,null,"*",null,null,null,"OK"]
[315,"FACHES THUMESNIL","PLANCQ","FRANCIS",170737,"110603-Z",11,"R2",2.73,null,"*",11,"R1",2.78,null,"*",10,"R1",1.27,null,"*",null,null,null,null,null,null,null,null,"OK"]
[316,"FACHES THUMESNIL","POIRIER","OLIVIER",230961,"133080-M",10,"R3",1.206,null,"*",null,null,null,null,null,10,"R2",0.67,null,"*",11,"R1",0.312,null,null,null,null,null,"OK"]
[317,"FACHES THUMESNIL","PREVOT","BLAISE",70269,"017061-F",91,"R4",1.48,null,"*",null,null,null,null,null,null,null,null,null,null,1,"R1",0.33900000000000002,null,"*",null,null,null,"OK"]
[318,"FACHES THUMESNIL","PRUVOST","FRANCK",130770,"NJ",null,null,null,null,null,null,null,null,null,null,null,null,null,null,null,null,null,null,null,"*",null,null,null,{"$error":"#VALUE!"}]
[319,"FACHES THUMESNIL","SCHOLENS","DENIS",120484,"017357-P",0,"R5",0.52,null,"*",null,null,null,null,null,null,null,null,null,null,null,null,null,null,null,10,0.8,"R1","OK"]
[320,"FACHES THUMESNIL","SCHOLENS","LAURENT",110987,"017355-N",0,"R5",0.28000000000000003,null,"*",null,null,null,null,null,null,null,null,null,null,null,null,null,null,null,null,null,null,"OK"]
[321,"FACHES THUMESNIL","SZYBOWICZ","LAURENT",null,"017252-O",11,"N1",13.69,null,"*",11,"N2",6.72,null,"*",11,"N2",2.09,null,"*",11,"N3",0.47699999999999998,null,"*",null,null,null,{"$f":"IF(F323=\"\",\"\",IF(CHAR(65+MOD(LEFT(F323,6),26))=RIGHT(F323,1),\"OK\",\"ERREUR\"))","v":"OK"}]
[322,"FACHES THUMESNIL","SZYBOWICZ","YANNICK",240267,"017361-T",4,"R1",4.2,null,null,4,"R1",3.37,null,null,3,"R1",1.47,null,"*",95,"R1",0.32800000000000001,null,null,null,null,null,"OK"]
[323,"FACHES THUMESNIL","THERY","JEAN PIERRE",221151,"117745-R",11,"R3",1.33,null,"*",null,null,null,null,null,null,null,null,null,null,11,"R1",0.30299999999999999,null,"*",null,null,null,"OK"]
[324,"FACHES THUMESNIL","TURBANT","ANDRE",150228,"017358-Q",11,"R3",1.54,null,"*",null,null,null,null,null,null,null,null,null,null,11,"R2",0.247,null,"*",null,null,null,"OK"]
[325,"FACHES THUMESNIL","VANBAELINGHEM","PASCAL",120269,"017268-E",0,"R4",1.86,null,"*",null,null,null,null,null,0,"R3",1.03,null,"*",null,null,null,null,"*",null,null,null,"OK"]
[326,"FACHES THUMESNIL","VANDERMESCH","SEBASTIEN",10682,"124453-R",5,"R5",0.95,null,"*",null,null,null,null,null,null,null,null,null,null,null,null,null,null,null,null,null,null,"OK"]
[327,"FACHES THUMESNIL","VANGANSBECKE","GERARD",10151,"016624-K",11,"R2",2.95,null,"*",11,"N3",2.92,null,"*",10,"R1",1.69,null,"*",11,"N3",0.47399999999999998,null,null,null,null,null,"OK"]
[328,"FACHES THUMESNIL","VANLERBERGHE","NICOLAS",260371,"109138-Q",11,"R1",4.08,null,"*",10,"R1",3.41,null,"*",11,"N2",1.75,null,"*",9,"N3",0.377,null,"*",null,null,null,"OK"]
[329,"FACHES THUMESNIL","VERQUIN","KEVIN",61188,"121439-T",3,"R5",0.74,null,"*",null,null,null,null,null,null,null,null,null,null,null,null,null,null,"*",10,1.123,"N1","OK"]
[330,"FACHES THUMESNIL","VERVAEKE","PASCAL",160457,"124455-T",null,null,null,null,null,null,null,null,null,null,null,null,null,null,null,5,"R1",0.26600000000000001,null,null,null,null,null,"OK"]
[331,"FACHES THUMESNIL","WALLART","JEAN-CHARLES",241164,"017219-H",9,"R3",1.99,null,"*",null,null,null,null,null,6,"R3",1.1100000000000001,null,"*",11,"N3",0.36499999999999999,null,"*",null,null,null,"OK"]
[332,"FACHES THUMESNIL","WATTRELOS","GREGORY",80185,"110606-C",3,"R3",1.73,null,"*",null,null,null,null,null,2,"R3",0.76,null,"*",null,null,null,null,"*",10,0.97699999999999998,"N1","OK"]
[333,"GRANDE-SYNTHE","ARLUNNO","NICOLAS",180986,"118385-H",2,"R5",0.54,null,"*",null,null,null,null,null,null,null,null,null,null,null,null,null,null,null,null,null,null,"OK"]
[334,"GRANDE-SYNTHE","AU DONG","TU",null,"133129-J",11,"R2",3.64,null,"*",11,"R1",3.14,null,"*",null,null,null,null,null,null,null,null,null,null,null,null,null,"OK"]
[335,"GRANDE-SYNTHE","BLOT","DANIEL",200939,"017160-A",7,"R4",1.56,null,"*",null,null,null,null,null,11,"R2",0.85,null,"*",10,"R1",0.28799999999999998,null,"*",null,null,null,"OK"]
[336,"GRANDE-SYNTHE","DEGARDIN","BERNARD",200950,"017153-T",3,"R5",1.1599999999999999,null,"*",null,null,null,null,null,null,null,null,null,null,3,"R1",0.30099999999999999,null,"*",null,null,null,"OK"]
[337,"GRANDE-SYNTHE","FOUQUE","JEAN-MARIE",61235,"017239-B",2,"R4",1.4,null,"*",null,null,null,null,null,2,"R3",0.89,null,"*",2,"R2",0.25,null,"*",null,null,null,"OK"]
[338,"GRANDE-SYNTHE","HINGRE","PAUL",20246,"017146-M",0,"R4",1.81,null,"*",null,null,null,null,null,99,"R3",0.96,null,"*",98,"R1",0.36799999999999999,null,"*",null,null,null,"OK"]
[339,"GRANDE-SYNTHE","KERKHOF","HERVE",200159,"136114-E",11,"R1",5.2,null,"*",11,"N3",4.33,null,"*",11,"N2",2.2000000000000002,null,"*",11,"R1",0.33100000000000002,null,"*",null,null,null,"OK"]
[340,"GRANDE-SYNTHE","LEFEBVRE","JONATHAN",220286,"121405-L",3,"R4",1.32,null,"*",null,null,null,null,null,4,"R2",1.27,null,"*",null,null,null,null,null,null,null,null,"OK"]
[341,"GRANDE-SYNTHE","LUBREZ","PIERRE",30342,"017148-O",11,"R3",1.81,null,"*",null,null,null,null,null,11,"R1",1.44,null,"*",11,"R1",0.32600000000000001,null,"*",10,0.97799999999999998,"R1","OK"]
[342,"GRANDE-SYNTHE","MERVAILLE","JEAN",290932,"103012-A",11,"R3",1.64,null,"*",6,"R1",4.0599999999999996,null,"*",11,"R1",1.37,null,"*",11,"N3",0.441,null,"*",null,null,null,"OK"]
[343,"GRANDE-SYNTHE","POLLAERT","MICHEL",40745,"017397-D",6,"R4",1.58,null,"*",null,null,null,null,null,10,"R2",0.8,null,"*",11,"R1",0.17599999999999999,null,null,10,0.95599999999999996,"R1","OK"]
[344,"GRANDE-SYNTHE","RENOU","MARC",171158,"112736-A",null,null,null,null,null,null,null,null,null,null,7,"R3",0.33,null,"*",null,null,null,null,null,null,null,null,"OK"]
[345,"GRANDE-SYNTHE","TORQUE","JEAN-LUC",80755,"017149-P",1,"R5",1.07,null,"*",null,null,null,null,null,null,null,null,null,null,null,null,null,null,null,null,null,null,"OK"]
[346,"GRANDE-SYNTHE","VANUXEM","JEAN",51055,"017399-F",9,"N2",6.86,null,"*",5,"R1",4.8,null,"*",9,"R1",1.42,null,"*",6,"N3",0.54700000000000004,null,"*",null,null,null,"OK"]
[347,"GRANDE-SYNTHE","VIENNE","MICHEL",80238,"017371-D",10,"R3",1.7949999999999999,null,"*",null,null,null,null,null,11,"R1",1.08,null,"*",11,"R1",0.25800000000000001,null,"*",null,null,null,"OK"]
[348,"GRANDE-SYNTHE","VITSE","LOUIS",160247,"017048-S",9,"R1",4.5999999999999996,null,"*",9,"R1",3.29,null,"*",7,"R1",1.62,null,"*",7,"R1",0.252,null,null,null,null,null,"OK"]
[349,"GRAVELINES","BEGHIN","FREDERIC",300579,"124477-P",null,null,null,null,null,null,null,null,null,null,null,null,null,null,null,6,"N1",1.0389999999999999,null,"*",null,null,null,"OK"]
[350,"GRAVELINES","BEHAGUE","ANDRE",290429,"016678-M",6,"R3",1.88,null,null,null,null,null,null,null,6,"R1",1.63,null,"*",10,"N3",0.36499999999999999,null,"*",99,0.39100000000000001,null,"OK"]
[351,"GRAVELINES","BRAZY","KEVIN",151193,"130688-M",7,"R5",0.92,null,"*",null,null,null,null,null,null,null,null,null,null,null,null,null,null,null,null,null,null,"OK"]
[352,"GRAVELINES","BRAZY","MANUEL",111153,"124478-Q",10,"R1",3.61,null,null,9,"N3",3.67,null,"*",10,"R1",1.6,null,"*",9,"N3",0.378,null,"*",null,null,null,"OK"]
[353,"GRAVELINES","BUYLE","STANY",210360,"121406-M",null,null,null,null,null,null,null,null,null,null,null,null,null,null,null,11,"N1",0.94899999999999995,null,"*",null,null,null,"OK"]
[354,"GRAVELINES","CAZALET","FRANCIS",70753,"105244-W",null,null,null,null,null,null,null,null,null,null,11,"R1",1.35,null,"*",3,"N3",0.63,null,"*",null,null,null,"OK"]
[355,"GRAVELINES","DAVID","ISAIE",281256,"133108-O",9,"R3",1.56,null,"*",null,null,null,null,null,7,"R2",1.1599999999999999,null,"*",7,"R2",0.28299999999999997,null,"*",null,null,null,"OK"]
[356,"GRAVELINES","DEVOS","JACKIE",261244,"121408-O",null,null,null,null,null,10,"N3",4.3099999999999996,null,"*",11,"N1",2.75,null,"*",11,"N2",0.52,null,null,10,1.052,"N1","OK"]
[357,"GRAVELINES","DEWULF","DOMINIQUE",260247,"116592-I",11,"N1",10.73,null,"*",11,"N3",5.1100000000000003,null,"*",11,"N2",2.14,null,"*",11,"N3",0.48799999999999999,null,"*",null,null,null,"OK"]
[358,"GRAVELINES","DUBOIS","PIERRE",40231,"016936-K",0,"R5",1.05,null,"*",null,null,null,null,null,0,"R3",0.53,null,"*",null,null,null,null,null,null,null,null,"OK"]
[359,"GRAVELINES","ESTERMANS","BERNARD",120743,"138943-Z",11,"R2",1.57,null,"*",null,null,null,null,null,11,"R1",1.1599999999999999,null,"*",11,"N3",0.441,null,"*",10,0.92900000000000005,"R1","OK"]
[360,"GRAVELINES","FOURNIER","ANDRE",300455,"016679-N",9,"R4",0.84,null,"*",null,null,null,null,null,11,"R2",0.5,null,"*",9,"R1",0.35099999999999998,null,"*",null,null,null,"OK"]
[361,"GRAVELINES","GRISELIN","PHILIPPE",140961,"102981-V",9,"N2",8.41,null,"*",11,"N2",8.1999999999999993,null,"*",11,"N1",3.61,null,"*",11,"N2",0.64900000000000002,null,"*",null,null,null,"OK"]
[362,"GRAVELINES","HARLAY","HERVE",230781,"124479-R",11,"R3",1.34,null,"*",null,null,null,null,null,null,null,null,null,null,null,null,null,null,null,null,null,null,"OK"]
[363,"GRAVELINES","LAMBIASE","GUISEPPE",230257,"135143-V",null,null,null,null,null,null,null,null,null,null,null,null,null,null,null,null,null,null,null,null,10,1.2609999999999999,"N1","OK"]
[364,"GRAVELINES","LANGAGNE","ROLAND",20239,"017379-L",7,"R5",1.1200000000000001,null,"*",null,null,null,null,null,7,"R3",0.53,null,"*",98,"R2",0.188,null,"*",null,null,null,"OK"]
[365,"GRAVELINES","LECLERCQ","ALAIN",240359,"017049-T",7,"R3",2.74,null,"*",null,null,null,null,null,7,"R1",1.67,null,"*",11,"N3",0.497,null,"*",null,null,null,"OK"]
[366,"GRAVELINES","MANTEN","PAUL",90648,"016680-O",10,"R3",1.238,null,"*",null,null,null,null,null,9,"R2",0.88,null,"*",11,"R1",0.28100000000000003,null,"*",10,1.0840000000000001,"R1","OK"]
[367,"GRAVELINES","MILLOIS","SYLVAIN",180950,"016681-P",11,"R3",1.19,null,null,null,null,null,null,null,11,"R2",0.75,null,"*",11,"R1",0.24299999999999999,null,null,null,null,null,"OK"]
[368,"GRAVELINES","OUTTIER","MICHEL",90436,"016682-Q",4,"R4",1.22,null,"*",null,null,null,null,null,3,"R3",0.51,null,"*",null,null,null,null,null,null,null,null,"OK"]
[369,"GRAVELINES","PROUTEAU","ROMAIN",280788,"114168-C",3,"R4",1.53,null,"*",null,null,null,null,null,null,null,null,null,null,null,null,null,null,null,null,null,null,"OK"]
[370,"GRAVELINES","ROELANTS","ANDRE",160129,"016683-R",6,"R3",1.57,null,"*",null,null,null,null,null,4,"R1",1.28,null,null,5,"N3",0.47199999999999998,null,"*",99,0.78500000000000003,"*","OK"]
[371,"GRAVELINES","ROELANTS","FREDERIC",301167,"016744-A",7,"Mas",64.290000000000006,"N3","*",2,"Mas",30,"N3","*",3,"Mas",6.38,"N2","*",11,"Mas",1.097,null,"*",7,1.298,"*","OK"]
[372,"GRAVELINES","STOPIN","GILLES",290956,"016684-S",92,"N2",16.03,"R1","*",93,"N2",10.46,"R1","*",0,"N1",4.08,"R1","*",11,"N1",0.99299999999999999,null,"*",10,1.028,"N1","OK"]
[373,"GRAVELINES","VANHOVE","PHILIPPE",170956,"103875-F",4,"R4",1.3,null,"*",null,null,null,null,null,2,"R3",0.74,null,"*",3,"R2",0.27800000000000002,null,"*",4,0.91600000000000004,"*","OK"]
[374,"GRAVELINES","VANUXEM","JEROME",150283,"016993-P",2,"N2",10.54,"R1","*",2,"N3",9.6300000000000008,"R1","*",1,"N1",4.74,"R1","*",10,"N1",0.86199999999999999,null,"*",null,null,null,"OK"]
[375,"GRAVELINES","VERMERSCH","FRANCIS",70471,"016958-G",11,"N1",21.31,null,"*",7,"N1",12.66,"R1","*",11,"N1",3.11,null,"*",10,"N1",0.58399999999999996,null,null,4,1.8540000000000001,"*","OK"]
[376,"GRAVELINES","WASYLYSZYN","JEAN-PIERRE",101048,"016685-T",11,"R3",1.45,null,"*",null,null,null,null,null,11,"R2",0.89,null,"*",10,"R1",0.27200000000000002,null,"*",null,null,null,"OK"]
[377,"HOUPLINES","AUREAU","ALAIN",211254,"124445-J",9,"R3",1.6,null,"*",null,null,null,null,null,9,"R2",0.86,null,"*",4,"R2",0.23499999999999999,null,"*",null,null,null,"OK"]
[378,"HOUPLINES","BERTELOOT","PHILIPPE",120766,"017058-C",11,"R3",1.95,null,"*",null,null,null,null,null,11,"R1",1.21,null,"*",6,"R1",0.41399999999999998,null,"*",null,null,null,"OK"]
[379,"HOUPLINES","BOUQUET","LAURENT",180371,"114148-I",5,"R3",3.15,null,"*",9,"R1",2.59,null,"*",5,"R1",1.65,null,"*",5,"R1",0.39800000000000002,null,"*",null,null,null,"OK"]
[380,"HOUPLINES","DECLERCQ","BERNARD",171161,"133072-E",11,"R3",1.3,null,"*",null,null,null,null,null,10,"R2",0.93,null,null,10,"R2",0.24299999999999999,null,"*",null,null,null,"OK"]
[381,"HOUPLINES","DEL MEDICO","JEAN",50544,"016772-C",3,"R2",4.21,null,"*",null,null,null,null,null,3,"R1",1.92,null,"*",3,"N3",0.48599999999999999,null,"*",null,null,null,"OK"]
[382,"HOUPLINES","DELVALLE","FRANCIS",261255,"017101-T",7,"R2",4.62,null,"*",7,"R1",3.69,null,"*",5,"R1",2.2200000000000002,null,"*",0,"N3",0.51600000000000001,null,"*",null,null,null,"OK"]
[383,"HOUPLINES","DOZIER","FRANCIS",131237,"129047-J",11,"R4",1.08,null,"*",null,null,null,null,null,11,"R2",0.62,null,"*",null,null,null,null,null,null,null,null,"OK"]
[384,"HOUPLINES","DRUELLE","DAVID",120775,"141518-A",10,"R4",1.1639999999999999,null,"*",null,null,null,null,null,null,null,null,null,null,null,null,null,null,null,null,null,null,"OK"]
[385,"HOUPLINES","DUFOUR","ERIC",160468,"016854-G",11,"R2",3.84,null,"*",10,"N3",5.0199999999999996,null,"*",9,"R1",1.64,null,"*",10,"N3",0.46500000000000002,null,"*",null,null,null,{"$f":"IF(F387=\"\",\"\",IF(CHAR(65+MOD(LEFT(F387,6),26))=RIGHT(F387,1),\"OK\",\"ERREUR\"))","v":"OK"}]
[386,"HOUPLINES","GRIMBEL","MAURICE",30831,"118412-I",2,"R3",2.0299999999999998,null,"*",null,null,null,null,null,null,null,null,null,null,null,null,null,null,null,null,null,null,"OK"]
[387,"HOUPLINES","GUELLUY","JACQUES",90238,"133073-F",7,"R5",0.65,null,"*",null,null,null,null,null,null,null,null,null,null,null,null,null,null,null,null,null,null,"OK"]
[388,"HOUPLINES","LEFEBVRE","SERGE",110735,"124444-I",5,"R4",1.58,null,"*",null,null,null,null,null,null,null,null,null,null,null,null,null,null,null,null,null,null,"OK"]
[389,"HOUPLINES","LINARES","ROBERTO",190562,"121443-X",9,"R3",1.94,null,"*",null,null,null,null,null,null,null,null,null,null,null,null,null,null,null,null,null,null,"OK"]
[390,"HOUPLINES","LIPPINOIS","BERNARD",250549,"017034-E",2,"R4",1.46,null,"*",null,null,null,null,null,0,"R3",0.88,null,"*",2,"R1",0.309,null,"*",null,null,null,"OK"]
[391,"HOUPLINES","LIPPINOIS","JEAN",100850,"017100-S",3,"R5",1.06,null,"*",null,null,null,null,null,null,null,null,null,null,0,"R1",0.30599999999999999,null,"*",null,null,null,"OK"]
[392,"HOUPLINES","MASO","STEPHANE",240864,"016606-S",10,"R4",1.026,null,"*",null,null,null,null,null,0,"R3",0.22,null,"*",9,"R1",0.25,null,"*",null,null,null,"OK"]
[393,"HOUPLINES","PILATE","BERNARD",null,"136017-L",10,"R3",1.724,null,"*",null,null,null,null,null,null,null,null,null,null,null,null,null,null,null,null,null,null,"OK"]
[394,"HOUPLINES","QUESQUE","JOEL",null,"136018-M",null,null,null,null,null,null,null,null,null,null,null,null,null,null,null,9,"R1",0.27,null,"*",null,null,null,"OK"]
[395,"HOUPLINES","QUETEL","HERVE",150673,"017031-B",11,"R3",1.44,null,"*",10,"R1",1.84,null,"*",11,"R1",0.89,null,null,11,"R1",0.32100000000000001,null,"*",null,null,null,"OK"]
[396,"HOUPLINES","RAMOS","JOSE",300149,"016607-T",11,"N2",6.12,null,"*",9,"N2",6.96,null,"*",10,"N2",2.56,null,"*",7,"N3",0.50800000000000001,"R1","*",null,null,null,"OK"]
[397,"HOUPLINES","THIEULLET","STEPHANE",91167,"121434-O",11,"R4",1.17,null,"*",null,null,null,null,null,10,"R1",1.04,null,"*",11,"R1",0.25600000000000001,null,"*",null,null,null,"OK"]
[398,"HOUPLINES","TURBIEZ","PASCAL",180754,"125590-K",9,"R4",1.08,null,"*",null,null,null,null,null,9,"R2",0.51,null,"*",null,null,null,null,null,null,null,null,"OK"]
[399,"HOUPLINES","VANDENDRIESSCHE","FREDERIC",210169,"136019-N",11,"R3",1.1399999999999999,null,"*",null,null,null,null,null,null,null,null,null,null,null,null,null,null,null,null,null,null,"OK"]
[400,"HOUPLINES","VANHOUTTE","LAURENT",130568,"124446-K",9,"R4",0.76,null,"*",null,null,null,null,null,null,null,null,null,null,null,null,null,null,null,null,null,null,"OK"]
[401,"HOUPLINES","VANKELST","PHILIPPE",50655,"121435-P",10,"R4",0.81299999999999994,null,"*",null,null,null,null,null,null,null,null,null,null,null,null,null,null,null,null,null,null,"OK"]
[402,"HOUPLINES","VANTHOURNOUT","PASCAL",60856,"016608-U",11,"R3",2.04,null,"*",null,null,null,null,null,11,"R1",1.46,null,"*",10,"N3",0.36599999999999999,null,"*",null,null,null,"OK"]
[403,"HOUPLINES","WACQUET","PAUL",121229,"016857-J",11,"R3",1.6,null,"*",null,null,null,null,null,11,"R1",1.0900000000000001,null,"*",10,"N3",0.40600000000000003,null,"*",null,null,null,"OK"]
[404,"HOUPLINES","WILLEN","LOIC",80292,"124427-R",9,"R3",1.69,null,"*",null,null,null,null,null,9,"R1",1.02,null,"*",7,"R1",0.32500000000000001,null,"*",null,null,null,"OK"]
[405,"LA CHAPELLES","BOONE","RAPHAEL",80333,"016991-N",10,"R4",1.018,null,"*",null,null,null,null,null,5,"R3",0.79,null,"*",7,"R2",0.217,null,"*",null,null,null,"OK"]
[406,"LA CHAPELLES","DEHACHE","DIDIER",40749,"125504-C",10,"R3",1.2090000000000001,null,"*",null,null,null,null,null,null,null,null,null,null,null,null,null,null,null,null,null,null,"OK"]
[407,"LA CHAPELLES","DEMEULNAERE","JEAN-CLAUDE",301043,"127675-P",10,"R4",0.79900000000000004,null,"*",null,null,null,null,null,null,null,null,null,null,null,null,null,null,null,null,null,null,"OK"]
[408,"LA CHAPELLES","DEMISELLE","PHILIPPE",10245,"133099-F",10,"R4",0.7,null,"*",null,null,null,null,null,null,null,null,null,null,null,null,null,null,null,null,null,null,"OK"]
[409,"LA CHAPELLES","HAZELAERE","FRANCIS",30153,"133095-B",9,"R4",0.99,null,"*",null,null,null,null,null,null,null,null,null,null,null,null,null,null,null,null,null,null,"OK"]
[410,"LA CHAPELLES","LEFEBVRE","JEAN-LOUIS",101050,"127695-J",7,"R4",1.44,null,null,null,null,null,null,null,null,null,null,null,null,7,"R2",0.22700000000000001,null,"*",null,null,null,"OK"]
[411,"LA CHAPELLES","LEPLUS","ALAIN",260174,"119348-I",10,"R3",2.0579999999999998,null,"*",null,null,null,null,null,null,null,null,null,null,null,null,null,null,null,null,null,null,"OK"]
[412,"LA CHAPELLES","MISSIAEN","JEAN-LUC",260852,"016616-C",10,"N2",7.9340000000000002,null,"*",10,"N3",5.12,null,"*",10,"N2",2.0699999999999998,null,"*",10,"N3",0.49299999999999999,null,"*",10,1,"R1","OK"]
[413,"LA CHAPELLES","ROLAIN","SERGE",null,"133275-Z",10,"R4",0.93799999999999994,null,"*",null,null,null,null,null,null,null,null,null,null,null,null,null,null,null,null,null,null,"OK"]
[414,"LA CHAPELLES","VANDIONANT","MICHEL",211150,"133021-F",7,"R4",0.72,null,"*",null,null,null,null,null,null,null,null,null,null,9,"R2",0.17100000000000001,null,"*",10,0.75800000000000001,"R1","OK"]
[415,"RONCHIN","ALLORGE","ROGER",240334,"017071-P",5,"R4",1.45,null,"*",null,null,null,null,null,2,"R3",0.86,null,"*",3,"R2",0.187,null,"*",null,null,null,"OK"]
[416,"RONCHIN","BARBIER","ROGER",81034,"114977-F",6,"R4",1.1100000000000001,null,null,null,null,null,null,null,6,"R3",0.79,null,"*",null,null,null,null,null,null,null,null,"OK"]
[417,"RONCHIN","BEAUVOIS","DOMINIQUE",81255,"016626-M",5,"R1",6.46,null,"*",5,"R1",2.97,null,"*",2,"R1",1.49,null,null,6,"N3",0.48899999999999999,null,"*",null,null,null,"OK"]
[418,"RONCHIN","BELLENS","AURORE",290492,"114155-P",11,"R2",3.08,null,"*",null,null,null,null,null,11,"R1",1.49,null,"*",11,"R2",0.188,null,"*",null,null,null,"OK"]
[419,"RONCHIN","BELLENS","FABRICE",60570,"016955-D",11,"R2",2.9,null,"*",null,null,null,null,null,11,"R1",1.54,null,"*",5,"N3",0.42199999999999999,null,null,null,null,null,"OK"]
[420,"RONCHIN","BELLENS","LAURENCE",120470,"121445-Z",9,"R4",0.37,null,"*",null,null,null,null,null,null,null,null,null,null,null,null,null,null,null,null,null,null,"OK"]
[421,"RONCHIN","BERRIER","JEAN-PIERRE",210756,"129051-N",6,"N2",16.43,"R1","*",10,"N2",10.09,null,"*",11,"N1",2.67,null,"*",10,"N3",0.497,null,"*",null,null,null,"OK"]
[422,"RONCHIN","BESNIER","FREDERIC",190379,"121446-A",4,"R3",2.09,null,"*",null,null,null,null,null,null,null,null,null,null,null,null,null,null,null,null,null,null,"OK"]
[423,"RONCHIN","BOCQUET","DAVID",120470,"114435-J",3,"R2",1.78,null,"*",null,null,null,null,null,null,null,null,null,null,null,null,null,null,null,null,null,null,"OK"]
[424,"RONCHIN","BRUNNEVALLE","JEAN-PIERRE",null,null,null,null,null,null,null,null,null,null,null,null,null,null,null,null,null,11,"R1",0.27100000000000002,null,"*",null,null,null,""]
[425,"RONCHIN","CARON","ANTHONY",null,"133085-R",11,"R2",2.75,null,"*",null,null,null,null,null,null,null,null,null,null,11,"N3",0.47,null,"*",null,null,null,"OK"]
[426,"RONCHIN","CARON","DORIANE",null,"133279-D",9,"R2",0.28999999999999998,null,"*",null,null,null,null,null,null,null,null,null,null,null,null,null,null,null,null,null,null,"OK"]
[427,"RONCHIN","CHARVOZ","LUDOVIC",null,"141340-E",11,"R4",1.08,null,"*",null,null,null,null,null,null,null,null,null,null,null,null,null,null,null,null,null,null,"OK"]
[428,"RONCHIN","CIECKA","FLORENT",140881,"021030-W",0,"N3",12.59,null,"*",0,"N1",12.65,"R1","*",0,"N1",3.89,"R1","*",0,"N3",0.54100000000000004,null,"*",null,null,null,"OK"]
[429,"RONCHIN","COLBEAUX","JEAN-NIELS",140378,"102984-Y",1,"R3",2.97,null,"*",null,null,null,null,null,null,null,null,null,null,null,null,null,null,null,null,null,null,"OK"]
[430,"RONCHIN","COTTON","ALAIN",100249,"017433-N",5,"R2",3.77,null,"*",null,null,null,null,null,null,null,null,null,null,null,null,null,null,null,null,null,null,"OK"]
[431,"RONCHIN","DA SILVA","JOSEPH",100427,"017211-Z",6,"R5",0.83,null,"*",null,null,null,null,null,6,"R3",0.53,null,"*",null,null,null,null,null,null,null,null,"OK"]
[432,"RONCHIN","DA SILVA","MICHEL",150254,"102975-P",11,"R3",1.91,null,"*",null,null,null,null,null,9,"R1",1.06,null,"*",11,"N3",0.36699999999999999,null,"*",null,null,null,"OK"]
[433,"RONCHIN","DAUWER","JEAN-PIERRE",131251,"017003-Z",0,"R4",1.71,null,"*",null,null,null,null,null,null,null,null,null,null,97,"R2",0.22,null,"*",null,null,null,"OK"]
[434,"RONCHIN","DAVID","PASCAL",30957,"017210-Y",98,"N2",4.8499999999999996,null,"*",95,"N2",5.22,null,"*",98,"R1",2.21,null,"*",5,"N2",0.61099999999999999,"R1","*",null,null,null,"OK"]
[435,"RONCHIN","DELEMER","BERNARD",50866,"017346-E",0,"R5",0.52,null,"*",null,null,null,null,null,null,null,null,null,null,null,null,null,null,null,null,null,null,"OK"]
[436,"RONCHIN","DELGRANGE","MICHEL",240753,"124458-W",11,"R3",2.09,null,"*",null,null,null,null,null,null,null,null,null,null,null,null,null,null,null,null,null,null,"OK"]
[437,"RONCHIN","DELGRANGE","RENE",210528,"016629-P",11,"R4",0.9,null,"*",null,null,null,null,null,9,"R2",0.59,null,"*",99,"R2",0.23599999999999999,null,"*",0,0.54400000000000004,"*","OK"]
[438,"RONCHIN","DELOOSE","KEVIN",311088,"121716-K",6,"R1",5.66,null,"*",null,null,null,null,null,6,"R1",1.1599999999999999,null,null,null,null,null,null,null,null,null,null,"OK"]
[439,"RONCHIN","DELPIERRE","DAVID",260176,"114162-W",3,"R5",0.65,null,"*",null,null,null,null,null,null,null,null,null,null,null,null,null,null,null,null,null,null,"OK"]
[440,"RONCHIN","DEMUYNCK","DANIEL",80445,"104529-J",11,"R4",1.1100000000000001,null,"*",null,null,null,null,null,null,null,null,null,null,1,"R2",0.16900000000000001,null,"*",null,null,null,"OK"]
[441,"RONCHIN","DEROUCK","JULIEN",null,"141342-G",10,"R4",0.45,null,"*",null,null,null,null,null,null,null,null,null,null,null,null,null,null,null,null,null,null,"OK"]
[442,"RONCHIN","DERVEAUX","PAUL",210140,"127693-H",7,"R4",1.27,null,"*",null,null,null,null,null,9,"R2",0.61,null,"*",9,"R2",0.17100000000000001,null,"*",null,null,null,"OK"]
[443,"RONCHIN","DESMETTRE","BERNARD",120748,"119345-F",6,"R3",2,null,"*",null,null,null,null,null,null,null,null,null,null,null,null,null,null,null,null,null,null,"OK"]
[444,"RONCHIN","DJOUBRI","BRAHIM  1  ",31258,"016566-E",0,"MASTERS",112.5,"N3","*",1,"Masters",34.229999999999997,"N3","*",10,"Mas",6.96,"N2","*",10,"N1",0.72399999999999998,null,"*",null,null,null,"OK"]
[445,"RONCHIN","DJOUBRI","BRAHIM  2",31258,"016566-E",null,"Cad","47/2",null,"*",10,"Masters",54.5,null,"*",null,null,null,null,null,null,null,null,null,null,null,null,null,"OK"]
[446,"RONCHIN","DJOUBRI","BRAHIM  3",31258,"016566-E",null,"Cad","71/2",null,"*",11,"Masters",24.82,null,"*",null,null,null,null,null,null,null,null,null,null,null,null,null,"OK"]
[447,"RONCHIN","DUFLOS","YVON",181024,"016631-R",92,"R3",2.62,null,"*",null,null,null,null,null,1,"R2",1.46,null,"*",1,"R1",0.40500000000000003,null,"*",null,null,null,"OK"]
[448,"RONCHIN","DURIN","RENE",160742,"016930-E",7,"R5",0.99,null,"*",null,null,null,null,null,null,null,null,null,null,null,null,null,null,null,null,null,null,"OK"]
[449,"RONCHIN","FLORENT","BERNARD",221247,"016852-E",11,"R2",3.34,null,"*",11,"R1",2.89,null,"*",6,"R2",1.76,null,"*",null,null,null,null,null,null,null,null,{"$f":"IF(F451=\"\",\"\",IF(CHAR(65+MOD(LEFT(F451,6),26))=RIGHT(F451,1),\"OK\",\"ERREUR\"))","v":"OK"}]
[450,"RONCHIN","FLORENT","JEAN-FRANCOIS 1",71177,"016853-F",10,"MASTERS",100.71,null,"*",11,"R1",2.89,null,"*",11,"Masters",7.11,null,"*",10,"N1",0.92400000000000004,null,"*",null,null,null,"OK"]
[451,"RONCHIN","FLORENT","JEAN-FRANCOIS 2",71177,"016853-F",null,"CADRE","47/2",null,"*",10,"Mas",42.61,null,"*",null,null,null,null,null,null,null,null,null,null,null,null,null,"OK"]
[452,"RONCHIN","FLORENT","JEAN-FRANCOIS 3",71177,"016853-F",null,"CADRE","71/2",null,"*",11,"Mas",26.38,null,"*",null,null,3.66,null,null,null,null,null,null,null,null,null,null,"OK"]
[453,"RONCHIN","FLORENT","JEAN-FRANCOIS 4",71177,"016853-F",null,"CADRE","47/1",null,null,10,"Mas",19.22,null,"*",null,null,null,null,null,null,null,null,null,null,null,null,null,"OK"]
[454,"RONCHIN","FLORENT","JULIEN",190587,"017114-G",10,"N1",27.331,null,"*",10,"N1",15.34,null,"*",11,"N1",3.51,null,"*",10,"N2",0.55100000000000005,null,"*",null,null,null,"OK"]
[455,"RONCHIN","FLORENT","MICHEL",70635,"016929-D",2,"R5",0.94,null,"*",null,null,null,null,null,0,"R3",0.56999999999999995,null,"*",null,null,null,null,null,null,null,null,"OK"]
[456,"RONCHIN","FLORENTIN","MARTINE",230566,"017139-F",11,"R2",2.36,null,"*",null,null,null,null,null,11,"R2",0.83,null,"*",null,null,null,null,null,null,null,null,"OK"]
[457,"RONCHIN","FOURNIER","GEORGES",290729,"016932-G",7,"R5",0.83,null,"*",null,null,null,null,null,null,null,null,null,null,null,null,null,null,null,null,null,null,"OK"]
[458,"RONCHIN","GALERNE","JEROME  1",51174,"017113-F",98,"Mas",28.47,"N3","*",1,"Mas",37.35,"N3","*",2,"Mas",6.64,"N2","*",96,"N1",0.63900000000000001,"R1","*",null,null,null,"OK"]
[459,"RONCHIN","GALERNE","JEROME  2",51174,"017113-F",null,"Cad","47/1",null,"*",1,"Mas",16.36,"R1","*",null,null,null,null,null,null,null,null,null,null,null,null,null,"OK"]
[460,"RONCHIN","GALERNE","JEROME  3",51174,"017113-F",null,"Cad","71/2",null,"*",1,"Mas",15.19,"R1","*",null,null,null,null,null,null,null,null,null,null,null,null,null,"OK"]
[461,"RONCHIN","GEVAS","JACQUES",60640,"121441-V",10,"R3",1.339,null,"*",null,null,null,null,null,null,null,null,null,null,null,null,null,null,null,null,null,null,"OK"]
[462,"RONCHIN","GODEFROIDT","MICHEL",220346,"016859-L",11,"R3",1.7,null,"*",null,null,null,null,null,11,"R1",1.18,null,"*",11,"R1",0.34399999999999997,null,"*",10,1.046,"R1","OK"]
[463,"RONCHIN","GUIRAUD","JEAN-PIERRE",71060,"016956-E",3,"R1",7.92,null,"*",98,"N2",6.51,null,"*",5,"R1",1.54,null,"*",10,"N3",0.45900000000000002,null,"*",null,null,null,"OK"]
[464,"RONCHIN","HAMON","BRICE",70677,"010736-Y",5,"R1",7.52,null,"*",5,"N3",6.18,null,"*",4,"R1",2.19,null,"*",4,"N3",0.43099999999999999,null,null,null,null,null,"OK"]
[465,"RONCHIN","HAUSTRAETE","JACQUES",110926,"017347-F",0,"R3",2.64,null,"*",null,null,null,null,null,null,null,null,null,null,null,null,null,null,null,null,null,null,"OK"]
[466,"RONCHIN","LAOUR","JEREMY",120784,"106344-E",10,"N2",10.875999999999999,null,"*",10,"N2",12.27,null,"*",10,"N2",1.96,null,"*",10,"N3",0.45800000000000002,null,"*",null,null,null,"OK"]
[467,"RONCHIN","LEBLANC","ALEXANDRE",150576,"017138-E",0,"N2",8.44,null,"*",1,"N2",6.67,null,"*",99,"R1",2.31,null,"*",97,"R1",0.35,null,"*",null,null,null,"OK"]
[468,"RONCHIN","LEFRANC","CHRISTIAN",null,null,11,"R2",2.66,null,"*",null,null,null,null,null,null,null,null,null,null,null,null,null,null,null,null,null,null,""]
[469,"RONCHIN","LESAGE","THIERRY",280778,"017106-Y",9,"R4",0.97,null,"*",null,null,null,null,null,9,"R2",0.65,null,"*",8,"R1",0.25,null,"*",null,null,null,"OK"]
[470,"RONCHIN","LEVEQUE","DANIEL",300958,"016777-H",11,"N2",9.5299999999999994,null,"*",11,"N2",6.24,null,"*",11,"N2",2.38,null,"*",11,"N3",0.42299999999999999,null,"*",null,null,null,"OK"]
[471,"RONCHIN","LEVIVIER","JEAN-CLAUDE",60446,"017549-Z",null,null,null,null,null,7,"N2",8.77,null,"*",7,"N2",3.05,null,"*",null,null,null,null,null,null,null,null,"OK"]
[472,"RONCHIN","LUBAC-MARTINEZ","SAMUEL",130881,"013620-W",4,"N2",17.14,null,"*",4,"N2",5.0599999999999996,null,"*",4,"N2",3.47,null,"*",3,"N2",0.54500000000000004,"R1","*",null,null,null,"OK"]
[473,"RONCHIN","MAC FARLANE","JACQUES",120353,"016635-V",10,"R2",2.9940000000000002,null,"*",null,null,null,null,null,11,"R1",1.32,null,"*",9,"N3",0.45900000000000002,null,"*",null,null,null,"OK"]
[474,"RONCHIN","MASQUELIER","LUDOVIC",null,"141345-J",11,"R3",1.36,null,"*",null,null,null,null,null,null,null,null,null,null,null,null,null,null,null,null,null,null,"OK"]
[475,"RONCHIN","MASSE","MARC  1",130565,"016636-W",96,"Mas",122.65,"N3","*",98,"Mas",51.78,"N3","*",99,"Mas",5.32,"N2","*",99,"Mas",1.1060000000000001,"N3","*",null,null,null,"OK"]
[476,"RONCHIN","MASSE","MARC  2",130565,"016636-W",null,"Cad","47/1",null,"*",98,"Mas",33.159999999999997,"R1","*",null,null,null,null,null,null,null,null,null,null,null,null,null,"OK"]
[477,"RONCHIN","MASSE","MARC  3",130565,"016636-W",null,"Cad","71/2",null,"*",98,"Mas",24.51,"R1","*",null,null,null,null,null,null,null,null,null,null,null,null,null,"OK"]
[478,"RONCHIN","MASSE","MARC (père)",280535,"016637-X",3,"R3",2.5099999999999998,null,"*",null,null,null,null,null,5,"R1",1.43,null,"*",7,"N3",0.47699999999999998,null,"*",null,null,null,"OK"]
[479,"RONCHIN","MEERSSEMAN","CLAUDE",310351,"017079-X",11,"R1",4.8600000000000003,null,"*",11,"N3",4.22,null,"*",11,"R1",1.67,null,"*",11,"N3",0.44400000000000001,null,"*",null,null,null,"OK"]
[480,"RONCHIN","MESEGUER","JEAN-LUC",210452,"118558-Y",3,"R2",3.59,null,"*",null,null,null,null,null,null,null,null,null,null,3,"R1",0.34200000000000003,null,"*",null,null,null,"OK"]
[481,"RONCHIN","MOULINS","JEAN-LOUIS",140958,"124443-H",11,"R3",1.71,null,"*",null,null,null,null,null,11,"R1",1.1399999999999999,null,"*",null,null,null,null,null,null,null,null,"OK"]
[482,"RONCHIN","PARESYS","PIERRE",151057,"017105-X",5,"R3",2.37,null,"*",null,null,null,null,null,null,null,null,null,null,5,"R1",0.434,null,"*",null,null,null,"OK"]
[483,"RONCHIN","PICOT","LUC",90572,"109152-E",11,"R1",5.61,null,"*",9,"N3",3.88,null,"*",null,null,null,null,null,null,null,null,null,null,null,null,null,"OK"]
[484,"RONCHIN","PICOT","MARC",200150,"016639-Z",11,"N2",6.11,null,"*",9,"N3",4.8099999999999996,null,"*",11,"N2",1.7,null,null,9,"N3",0.39900000000000002,null,"*",null,null,null,"OK"]
[485,"RONCHIN","PICOT","MARYSE",20951,"016821-Z",10,"R4",0.57399999999999995,null,"*",null,null,null,null,null,null,null,null,null,null,null,null,null,null,null,null,null,null,"OK"]
[486,"RONCHIN","PODESZWA","GHISLAIN",null,"141348-M",11,"R4",1.1499999999999999,null,"*",null,null,null,null,null,null,null,null,null,null,null,null,null,null,null,null,null,null,"OK"]
[487,"RONCHIN","POLARD","GILLES",210363,"017351-J",11,"N2",6.9,null,"*",11,"N3",4.96,null,"*",11,"R1",1.46,null,"*",11,"N3",0.48399999999999999,null,"*",null,null,null,"OK"]
[488,"RONCHIN","PONCHANT","GREGORY",270375,"016749-F",11,"N1",17.829999999999998,null,"*",11,"N2",7.83,null,"*",11,"N1",2.56,null,null,10,"N2",0.58699999999999997,null,"*",10,0.755,"R1","OK"]
[489,"RONCHIN","PREVOTS","JACQUES",251035,"102990-E",6,"R5",1.01,null,"*",null,null,null,null,null,null,null,null,null,null,null,null,null,null,null,null,null,null,"OK"]
[490,"RONCHIN","QUENELLE","ACHILLE",160137,"105370-S",10,"R4",0.54600000000000004,null,"*",null,null,null,null,null,null,null,null,null,null,null,null,null,null,null,null,null,null,"OK"]
[491,"RONCHIN","QUERLEU","CLAUDE",131131,"017002-Y",5,"R5",1.03,null,"*",null,null,null,null,null,null,null,null,null,null,null,null,null,null,null,null,null,null,"OK"]
[492,"RONCHIN","QUIRET","LAURENT",90166,"109153-F",0,"R5",0.98,null,"*",null,null,null,null,null,null,null,null,null,null,null,null,null,null,null,null,null,null,"OK"]
[493,"RONCHIN","RAMERY","ANDRE",180628,"017439-T",5,"R4",1.02,null,null,null,null,null,null,null,null,null,null,null,null,null,null,null,null,null,null,null,null,"OK"]
[494,"RONCHIN","RESENDE","SERGE",290136,"110596-S",2,"R5",0.94,null,"*",null,null,null,null,null,null,null,null,null,null,null,null,null,null,null,null,null,null,"OK"]
[495,"RONCHIN","REYNAERT","PIERRE",260571,"017109-B",9,"N2",6.21,null,"*",10,"N3",4.8600000000000003,null,"*",11,"N1",2.61,null,"*",11,"N2",0.64,null,"*",null,null,null,"OK"]
[496,"RONCHIN","RINGOT","PIERRE-JACQUES ",80838,"016883-J",1,"R3",2.59,null,"*",null,null,null,null,null,1,"R3",0.73,null,"*",null,null,null,null,null,null,null,null,"OK"]
[497,"RONCHIN","ROUZE","DANIEL",10161,"017336-U",11,"R3",1.61,null,"*",null,null,null,null,null,11,"R1",1.0900000000000001,null,"*",null,null,null,null,null,null,null,null,"OK"]
[498,"RONCHIN","SEIDEL","AURELIEN",50386,"110604-A",5,"R4",1.42,null,"*",null,null,null,null,null,null,null,null,null,null,null,null,null,null,null,null,null,null,"OK"]
[499,"RONCHIN","SOARES","JOACHIM",10552,"016609-V",2,"R1",6.43,null,"*",2,"R1",2.76,null,"*",1,"R1",1.23,null,"*",88,"R1",0.19,null,"*",null,null,null,"OK"]
[500,"RONCHIN","STOCKER","DANIEL",150241,"017348-G",11,"R2",2.94,null,"*",11,"R1",2.5299999999999998,null,"*",10,"R1",1.25,null,"*",11,"R1",0.33700000000000002,null,"*",2,0.88100000000000001,"*","OK"]
[501,"RONCHIN","TAFFIN","EMMANUEL",200870,"114159-T",11,"N2",4.2300000000000004,null,null,11,"N3",4.21,null,"*",11,"R1",1.37,null,"*",10,"N3",0.437,null,"*",null,null,null,"OK"]
[502,"RONCHIN","TAVERGNE","RENE",141144,"110548-W",10,"N2",8.0530000000000008,null,"*",10,"N3",4.42,null,"*",10,"R1",1.29,null,"*",null,null,null,null,null,null,null,null,"OK"]
[503,"RONCHIN","TESSON","DOMINIQUE",90360,"016957-F",4,"R3",2.5499999999999998,null,"*",null,null,null,null,null,99,"R3",1.1100000000000001,null,"*",4,"R1",0.318,null,"*",null,null,null,"OK"]
[504,"RONCHIN","TREFEL","LAURENT",110375,"127671-L",null,null,null,null,null,null,null,null,null,null,null,null,null,null,null,5,"R2",0.23799999999999999,null,"*",null,null,null,"OK"]
[505,"RONCHIN","TRICAT","BERNARD",61045,"124457-V",7,"R4",1.78,null,"*",null,null,null,null,null,5,"R2",1.22,null,"*",null,null,null,null,null,null,null,null,"OK"]
[506,"RONCHIN","VILLIERS","BERNARD",null,"014334-I",null,null,null,null,null,10,"Masters",30.31,null,"*",11,"MASTERS",8.2799999999999994,null,null,10,"N1",0.94499999999999995,null,"*",null,null,null,"OK"]
[507,"RONCHIN","VILLIERS","BERNARD",null,"014334-I",null,"CADRE","71/2",null,null,11,"Masters",20.309999999999999,null,"*",null,null,null,null,null,null,null,null,null,null,null,null,null,"OK"]
[508,"ST POL","BATAILLE","MICHEL",300838,"016643-D",11,"R3",1.35,null,"*",null,null,null,null,null,9,"R2",0.96,null,"*",91,"R2",0.23599999999999999,null,"*",null,null,null,"OK"]
[509,"ST POL","BENOIT","GERMAIN",151026,"016699-H",null,null,null,null,"*",null,null,null,null,null,2,"R3",0.84,null,"*",null,null,null,null,null,null,null,null,"OK"]
[510,"ST POL","BERNAL","FRANCIS",30939,"017389-V",4,"R4",1.46,null,"*",null,null,null,null,null,null,null,null,null,null,null,null,null,null,null,null,null,null,"OK"]
[511,"ST POL","BOUCHART","CHRISTOPHE",180266,"016693-B",9,"R2",2.76,null,"*",null,null,null,null,null,11,"R1",1.3,null,"*",9,"N3",0.377,null,"*",null,null,null,"OK"]
[512,"ST POL","BRUNEEL","YVES",80133,"016787-R",2,"R3",2,null,"*",null,null,null,null,null,2,"R3",1,null,"*",1,"R1",0.33300000000000002,null,"*",null,null,null,"OK"]
[513,"ST POL","DEMAZIERES","DAVID",170374,"016939-N",7,"R1",5.14,null,"*",9,"N3",3.77,null,"*",9,"N2",2.14,null,"*",null,null,null,null,null,10,1.4410000000000001,"R1",{"$f":"IF(F515=\"\",\"\",IF(CHAR(65+MOD(LEFT(F515,6),26))=RIGHT(F515,1),\"OK\",\"ERREUR\"))","v":"OK"}]
[514,"ST POL","FRADET","DAVID",291168,"133127-H",9,"N2",6.06,null,"*",null,null,null,null,null,9,"R1",1.62,null,"*",10,"N2",0.47799999999999998,null,null,null,null,null,"OK"]
[515,"ST POL","FRADET","NOEL",40938,"016695-D",11,"R2",2.67,null,"*",11,"R1",2.08,null,"*",11,"R1",1,null,"*",10,"R1",0.255,null,"*",10,0.91700000000000004,"R1","OK"]
[516,"ST POL","HERREBRECHT","THIERRY",270974,"017224-M",0,"N3",9.1300000000000008,null,"*",1,"R1",4.5599999999999996,null,"*",1,"N2",2.78,null,"*",9,"N2",0.47299999999999998,null,null,10,1.147,"N1","OK"]
[517,"ST POL","HUYGHE","CLAUDE",null,"138374-C",11,"R2",3.25,null,"*",null,null,null,null,null,11,"R1",1.17,null,"*",null,null,null,null,null,null,null,null,"OK"]
[518,"ST POL","LEMÂTRE","ALEXIE",null,"133123-D",10,"R3",1.431,null,"*",null,null,null,null,null,null,null,null,null,null,null,null,null,null,null,null,null,null,"OK"]
[519,"ST POL","LEMÂTRE","ANDRE",120360,"121399-F",11,"R3",1.64,null,"*",null,null,null,null,null,null,null,null,null,null,10,"N3",0.36,null,"*",null,null,null,"OK"]
[520,"ST POL","LEMÂTRE","GREGORY",180385,"121400-G",9,"R2",2.38,null,"*",null,null,null,null,null,9,"R1",1.47,null,"*",9,"N3",0.498,null,"*",null,null,null,"OK"]
[521,"ST POL","LEMÂTRE","JEREMY",180888,"127735-X",10,"R2",2.343,null,"*",null,null,null,null,null,10,"R1",1.25,null,"*",10,"N3",0.43,null,"*",10,1.0580000000000001,"N1","OK"]
[522,"ST POL","LONGUEMARRE","MARCEL",220834,"017065-J",5,"R2",3.2,null,"*",null,null,null,null,null,0,"R1",1.5,null,"*",5,"N3",0.45100000000000001,null,"*",null,null,null,"OK"]
[523,"ST POL","RAMON","ROBERT",141219,"016847-Z",11,"R3",1.22,null,"*",null,null,null,null,null,11,"R2",0.93,null,"*",11,"R1",0.24099999999999999,null,"*",null,null,null,"OK"]
[524,"ST POL","REGNIER","PATRICK",251271,"016865-R",11,"N2",8.4499999999999993,null,"*",11,"N3",5.64,null,"*",11,"N2",2.4300000000000002,null,"*",null,null,null,null,null,null,null,null,"OK"]
[525,"ST POL","SAINT MAXENT","STEPHANE",null,"127733-V",11,"R4",0.9,null,"*",null,null,null,null,null,null,null,null,null,null,10,"R2",0.14000000000000001,null,"*",10,0.63400000000000001,"R1","OK"]
[526,"ST POL","SPILLEMACKER","TONY",240780,"017232-U",1,"R4",1.47,null,"*",null,null,null,null,null,1,"R3",0.64,null,"*",1,"R2",0.25600000000000001,null,"*",null,null,null,"OK"]
[527,"ST POL","VEREECQUE","BERNARD",220656,"116590-G",11,"R4",0.94,null,"*",null,null,null,null,null,null,null,null,null,null,10,"R2",0.16700000000000001,null,"*",10,0.80400000000000005,"R1","OK"]
[528,"ST POL","VEREECQUE","LUDOVIC",210180,"017231-T",10,"R2",3.0139999999999998,null,"*",10,"R1",2.4700000000000002,null,"*",10,"R1",1.63,null,"*",9,"N3",0.34699999999999998,null,null,10,0.97599999999999998,"N1","OK"]
[529,"ST POL","WADOUX","JEAN-FRANCOIS",110340,"016793-X",11,"R3",1.42,null,"*",null,null,null,null,null,11,"R2",0.72,null,"*",null,null,null,null,null,null,null,null,"OK"]
[530,"ST POL","WEISBECKER","JEAN-CLAUDE",250141,"107683-R",11,"R4",0.94,null,"*",null,null,null,null,null,11,"R2",0.75,null,"*",null,null,null,null,null,null,null,null,"OK"]
[531,"VILLENEUVE D'ASCQ","AVET","PIERRE",240754,"016814-S",3,"R1",7.2,null,"*",1,"N3",6.09,null,"*",99,"N3",2.5099999999999998,null,"*",2,"N3",0.46,"R1","*",null,null,null,"OK"]
[532,"VILLENEUVE D'ASCQ","BENINCA","JEAN-PIERRE",10241,"121725-T",11,"R3",1.06,null,null,null,null,null,null,null,11,"R2",0.64,null,"*",11,"R2",0.22900000000000001,null,"*",null,null,null,"OK"]
[533,"VILLENEUVE D'ASCQ","BOUILLET","ANTOINE",140281,"105367-P",10,"R2",2.4159999999999999,null,"*",null,null,null,null,null,10,"R1",1.26,null,"*",11,"N3",0.41599999999999998,null,"*",7,1.1220000000000001,null,"OK"]
[534,"VILLENEUVE D'ASCQ","BOUILLET","GREGORY",120674,"016926-A",99,"R2",3.19,null,"*",null,null,null,null,null,0,"R3",1.1000000000000001,null,"*",0,"R1",0.34,null,"*",99,1.1719999999999999,null,"OK"]
[535,"VILLENEUVE D'ASCQ","BOUILLET","PIERRE",200749,"016927-B",10,"R4",0.8,null,null,null,null,null,null,null,5,"R3",0.61,null,"*",null,null,null,null,null,null,null,null,"OK"]
[536,"VILLENEUVE D'ASCQ","BOURGOIS","JEAN",291289,"125497-V",5,"R1",5.76,null,"*",null,null,null,null,null,5,"R1",1.64,null,"*",5,"R2",0.27600000000000002,null,"*",null,null,null,"OK"]
[537,"VILLENEUVE D'ASCQ","BOURSIER","JEAN-PIERRE",11142,"016827-F",3,"R2",4.0599999999999996,null,"*",null,null,null,null,null,0,"R2",1.33,null,"*",86,"R2",0.29699999999999999,null,"*",null,null,null,"OK"]
[538,"VILLENEUVE D'ASCQ","BOUTON","MAURICE",270337,"016815-T",0,"R3",2.62,null,"*",null,null,null,null,null,98,"R3",0.67,null,"*",97,"R2",0.23699999999999999,null,"*",null,null,null,"OK"]
[539,"VILLENEUVE D'ASCQ","BOUVIER","GUY",90142,"017328-M",3,"R3",2.1800000000000002,null,"*",null,null,null,null,null,99,"R2",1.1299999999999999,null,"*",97,"R2",0.19600000000000001,null,"*",1,0.48199999999999998,null,"OK"]
[540,"VILLENEUVE D'ASCQ","BRUYERE","MICHEL",120354,"114150-K",1,"R4",1.5,null,"*",null,null,null,null,null,10,"R1",0.86,null,null,11,"N3",0.38800000000000001,null,"*",10,0.99199999999999999,"R1","OK"]
[541,"VILLENEUVE D'ASCQ","CHAIB","HASSENE",100983,"128079-D",9,"R2",2.93,null,"*",null,null,null,null,null,9,"R1",1.22,null,"*",9,"N3",0.41899999999999998,null,"*",7,0.94199999999999995,null,"OK"]
[542,"VILLENEUVE D'ASCQ","CRAEYE","JEAN-CLAUDE",240846,"121361-T",7,"R3",2.04,null,"*",null,null,null,null,null,7,"R2",1.17,null,"*",null,null,null,null,null,null,null,null,"OK"]
[543,"VILLENEUVE D'ASCQ","D'ANGELO","ALBERTO",null,"138705-V",11,"R3",1.67,null,"*",null,null,null,null,null,11,"R1",1.05,null,"*",11,"R2",0.23599999999999999,null,"*",null,null,null,"OK"]
[544,"VILLENEUVE D'ASCQ","DASSONVILLE","GERARD",190642,"127678-S",11,"R4",0.7,null,"*",null,null,null,null,null,null,null,null,null,null,null,null,null,null,null,null,null,null,"OK"]
[545,"VILLENEUVE D'ASCQ","DEGREEF","PATRICE",210270,"124447-L",10,"R2",2.194,null,null,null,null,null,null,null,10,"R1",1.04,null,"*",10,"N3",0.36199999999999999,null,"*",null,null,null,"OK"]
[546,"VILLENEUVE D'ASCQ","DELIGNE","REMY",90480,"017001-X",0,"R3",2.67,null,"*",null,null,null,null,null,0,"R3",1.0900000000000001,null,"*",0,"R1",0.32,null,"*",null,null,null,"OK"]
[547,"VILLENEUVE D'ASCQ","DELION","PATRICK",160149,"016612-Y",11,"R2",2.25,null,"*",11,"R1",2.25,null,"*",99,"R3",0.95,null,"*",11,"R1",0.32700000000000001,null,"*",1,0.71499999999999997,null,"OK"]
[548,"VILLENEUVE D'ASCQ","DELRUE","ANDRE",310758,"105710-U",11,"R3",1.49,null,"*",null,null,null,null,null,10,"R2",0.62,null,"*",11,"R1",0.28599999999999998,null,"*",10,1.2070000000000001,"N1","OK"]
[549,"VILLENEUVE D'ASCQ","DEPREZ","JEAN",260735,"017420-A",11,"R3",1.72,null,"*",11,"R1",1.75,null,"*",11,"R2",1.84,null,"*",11,"R2",0.21,null,"*",null,null,null,"OK"]
[550,"VILLENEUVE D'ASCQ","DESBONNET","KEVIN",240289,"124448-M",7,"R2",2.93,null,"*",7,"R1",4.3,null,"*",7,"R1",1.39,null,null,6,"R1",0.41699999999999998,null,"*",null,null,null,"OK"]
[551,"VILLENEUVE D'ASCQ","DESTAERKE","JEAN",261234,"134161-B",11,"R3",1.57,null,"*",null,null,null,null,null,11,"R2",0.89,null,null,11,"R2",0.224,null,"*",null,null,null,"OK"]
[552,"VILLENEUVE D'ASCQ","DHALLEINE","JONATHAN",300579,"017418-Y",10,"R1",4.2229999999999999,null,"*",10,"R1",3.11,null,"*",5,"R1",1.3,null,"*",null,null,null,null,null,null,null,null,"OK"]
[553,"VILLENEUVE D'ASCQ","DUCROCQ","SANDRINE",80580,"016992-O",3,"R3",2.34,null,"*",null,null,null,null,null,null,null,null,null,null,null,null,null,null,null,null,null,null,"OK"]
[554,"VILLENEUVE D'ASCQ","FOULON","MICHEL",251146,"016614-A",7,"N2",3.79,"R1",null,97,"N1",7.4,"R1","*",11,"N2",2.13,null,"*",10,"N1",0.54100000000000004,null,"*",2,1.1539999999999999,null,"OK"]
[555,"VILLENEUVE D'ASCQ","GAEREMYNCK","CLAUDE","170457","017000-W",11,"R3",1.8,null,"*",null,null,null,null,null,11,"R1",1.1200000000000001,null,"*",11,"N3",0.40300000000000002,null,"*",null,null,null,"OK"]
[556,"VILLENEUVE D'ASCQ","GENNIN","JEAN-ROBERT",40680,"133074-G",10,"R4",0.80600000000000005,null,"*",null,null,null,null,null,10,"R2",0.42,null,null,10,"R2",0.19800000000000001,null,"*",7,1.3879999999999999,null,"OK"]
[557,"VILLENEUVE D'ASCQ","GODEFROIDT","FREDERIC",90375,"102969-J",1,"R1",7.67,null,"*",1,"R1",4.26,null,"*",1,"R1",2.44,null,"*",1,"N1",0.73499999999999999,"R1","*",null,null,null,"OK"]
[558,"VILLENEUVE D'ASCQ","GROLLET","FABIEN",61280,"110544-S",11,"N2",7.22,null,"*",10,"N3",4.96,null,"*",11,"N2",1.97,null,"*",11,"N3",0.52,null,"*",10,1.044,"N1","OK"]
[559,"VILLENEUVE D'ASCQ","HODEBERT","FLORENT",40581,"110545-T",4,"R1",5.5,null,"*",null,null,null,null,null,null,null,null,null,null,null,null,null,null,null,null,null,null,"OK"]
[560,"VILLENEUVE D'ASCQ","HUYGHE","DAVID",201077,"016928-C",0,"R3",2.74,null,"*",null,null,null,null,null,null,null,null,null,null,null,null,null,null,null,null,null,null,"OK"]
[561,"VILLENEUVE D'ASCQ","HUYGHE","JEAN-CLAUDE",210654,"016633-T",11,"N1",16.899999999999999,null,"*",11,"N2",9.34,null,"*",11,"N1",2.97,null,"*",10,"N2",0.60499999999999998,null,"*",null,null,null,"OK"]
[562,"VILLENEUVE D'ASCQ","HUYGHE","JEAN-PAUL",51056,"016615-B",9,"R1",4.05,null,"*",9,"R1",3.27,null,"*",9,"R1",1.4,null,"*",0,"R1",0.34499999999999997,null,"*",null,null,null,"OK"]
[563,"VILLENEUVE D'ASCQ","LAPORTE","JEAN FRANCOIS",71062,"016953-B",93,"R2",3.59,null,"*",null,null,null,null,null,10,"N2",1.81,null,"*",11,"N2",0.56499999999999995,null,"*",null,null,null,"OK"]
[564,"VILLENEUVE D'ASCQ","LE GOHEBEL","JACQUES",190961,"127679-T",11,"R3",1.45,null,"*",null,null,null,null,null,11,"R2",0.73,null,"*",11,"R1",0.251,null,"*",null,null,null,"OK"]
[565,"VILLENEUVE D'ASCQ","LECLERCQ","DIDIER",90956,"119357-R",4,"R4",1.38,null,"*",null,null,null,null,null,null,null,null,null,null,null,null,null,null,null,null,null,null,"OK"]
[566,"VILLENEUVE D'ASCQ","LECOCQ","NICOLAS",90180,"017035-F",0,"R1",6.05,null,"*",97,"R1",3.34,null,"*",null,"R1","NC",null,null,98,"N3",0.51700000000000002,null,"*",1,1.1240000000000001,null,"OK"]
[567,"VILLENEUVE D'ASCQ","LECROART","SERGE",30654,"016925-Z",11,"R3",1.35,null,"*",null,null,null,null,null,11,"R2",0.75,null,"*",null,null,null,null,null,10,0.81699999999999995,"N1","OK"]
[568,"VILLENEUVE D'ASCQ","LOSFELD","RENE",311233,"102972-M",11,"R3",1.37,null,"*",null,null,null,null,null,null,null,null,null,null,null,null,null,null,null,null,null,null,"OK"]
[569,"VILLENEUVE D'ASCQ","MAGNIEZ","ROLAND",30640,"119354-O",6,"R3",2.2799999999999998,null,"*",null,null,null,null,null,null,null,null,null,null,null,null,null,null,null,null,null,null,"OK"]
[570,"VILLENEUVE D'ASCQ","MORTIER","CLAUDE",230225,"016617-D",2,"R3",2.6,null,"*",null,null,null,null,null,97,"R1",1.3,null,"*",96,"R2",0.26900000000000002,null,"*",null,null,null,"OK"]
[571,"VILLENEUVE D'ASCQ","MORTREUX","PATRICK",301260,"016816-U",11,"R2",3.4,null,"*",11,"R1",3.26,null,"*",0,"R1",1.83,null,"*",11,"N3",0.42599999999999999,null,"*",1,1.661,null,"OK"]
[572,"VILLENEUVE D'ASCQ","NOVICK","ROBERT",100735,"017102-U",10,"R4",0.73899999999999999,null,"*",null,null,null,null,null,6,"R3",0.66,null,"*",0,"R2",0.21,null,"*",null,null,null,"OK"]
[573,"VILLENEUVE D'ASCQ","POLARD","SERGE",100356,"102977-R",11,"R3",1.44,null,"*",null,null,null,null,null,10,"R2",0.7,null,"*",6,"R2",0.114,null,"*",10,0.77500000000000002,"R1","OK"]
[574,"VILLENEUVE D'ASCQ","QUILLOT","ARNAUD",60789,"125496-U",4,"R5",1.06,null,"*",null,null,null,null,null,null,null,null,null,null,null,null,null,null,null,null,null,null,"OK"]
[575,"VILLENEUVE D'ASCQ","RENAUX","DAMIEN",60587,"124449-N",9,"R1",5.27,null,"*",9,"N3",4.07,null,"*",9,"R1",1.74,null,"*",9,"N3",0.41899999999999998,null,"*",7,0.63400000000000001,null,"OK"]
[576,"VILLENEUVE D'ASCQ","RENAUX","KEVIN",200884,"124450-O",4,"R5",0.63,null,"*",null,null,null,null,null,null,null,null,null,null,null,null,null,null,null,null,null,null,"OK"]
[577,"VILLENEUVE D'ASCQ","ROSEAU","DOMINIQUE",null,"143924-O",11,"R4",0.84,null,"*",null,null,null,null,null,null,null,null,null,null,null,null,null,null,null,null,null,null,{"$f":"IF(F579=\"\",\"\",IF(CHAR(65+MOD(LEFT(F579,6),26))=RIGHT(F579,1),\"OK\",\"ERREUR\"))","v":"OK"}]
[578,"VILLENEUVE D'ASCQ","TRUQUET","DAVID",241172,"102966-G",9,"R2",2.88,null,"*",null,null,null,null,null,2,"R1",2.0499999999999998,null,"*",3,"N3",0.53300000000000003,null,"*",10,1.2210000000000001,"N1","OK"]
[579,"VILLENEUVE D'ASCQ","VANDENBOSSCHE","ALBERT",51231,"016751-H",10,"R3",1.736,null,"*",null,null,null,null,null,10,"R1",0.75,null,null,null,null,null,null,null,null,null,null,"OK"]
[580,"VILLENEUVE D'ASCQ","VANDEWEGHE","FREDERIC",111162,"109137-P",10,"N2",8.1349999999999998,null,"*",10,"N3",5.36,null,"*",10,"N2",2.5299999999999998,null,"*",10,"N3",0.51400000000000001,null,"*",4,0.92100000000000004,null,"OK"]
[581,"VILLENEUVE D'ASCQ","VANKIEKEN","DAVID",150175,"016881-H",11,"N1",17.96,null,"*",11,"N2",8.73,null,"*",11,"N1",2.52,null,null,9,"N2",0.59499999999999997,null,"*",7,1.02,null,"OK"]
[582,"VILLENEUVE D'ASCQ","VERFAILLE","DANIEL",210644,"124451-P",10,"R3",1.226,null,"*",null,null,null,null,null,null,null,null,null,null,null,null,null,null,null,null,null,null,"OK"]
[583,"VILLENEUVE D'ASCQ","VERGRIETE","MICHEL",181127,"016618-E",11,"R3",1.43,null,"*",null,null,null,null,null,11,"R2",0.83,null,"*",98,"R2",0.16500000000000001,null,"*",null,null,null,"OK"]
[584,"VILLENEUVE D'ASCQ","VERMEERSCH","DANIEL",90554,"114160-U",5,"R5",0.87,null,"*",null,null,null,null,null,null,null,null,null,null,null,null,null,null,null,null,null,null,"OK"]
[585,"WAZEMMES","ADJABI","TOUFFIK",190957,"133082-O",7,"R5",0.8,null,"*",null,null,null,null,null,null,null,null,null,null,null,null,null,null,null,null,null,null,"OK"]
[586,"WAZEMMES","ADJABI","ZINDIN",51163,"133027-L",10,"R3",1.2490000000000001,null,"*",null,null,null,null,null,null,null,null,null,null,null,null,null,null,null,null,null,null,"OK"]
[587,"WAZEMMES","AMARI","DHAMANE",140565,"133083-P",10,"R4",0.81599999999999995,null,"*",null,null,null,null,null,null,null,null,null,null,null,null,null,null,null,null,null,null,"OK"]
[588,"WAZEMMES","CARLIER","FLORENT",130977,"133084-Q",7,"R5",0.93,null,"*",null,null,null,null,null,null,null,null,null,null,null,null,null,null,null,null,null,null,"OK"]
[589,"WAZEMMES","DELEU","DANIEL",101260,"017199-N",3,"R5",1.17,null,"*",null,null,null,null,null,null,null,null,null,null,null,null,null,null,null,null,null,null,"OK"]
[590,"WAZEMMES","DELMOTE","CYRIL",null,"136901-L",10,"R4",0.68540000000000001,null,"*",null,null,null,null,null,null,null,null,null,null,null,null,null,null,null,null,null,null,"OK"]
[591,"WAZEMMES","DUMEZ","PHILIPPE",170743,"016988-K",2,"R4",1.35,null,"*",null,null,null,null,null,null,null,null,null,null,null,null,null,null,null,null,null,null,"OK"]
[592,"WAZEMMES","DUSSAUX","CLAIRE",null,"136900-K",10,"R4",1,null,"*",null,null,null,null,null,null,null,null,null,null,null,null,null,null,null,null,null,null,"OK"]
[593,"WAZEMMES","GUDYKA","LOUIS-XAVIER",140868,"133153-H",7,"R5",1.1499999999999999,null,"*",null,null,null,null,null,null,null,null,null,null,null,null,null,null,null,null,null,null,"OK"]
[595,"WAZEMMES","LEPROVOST","ANDRE",70254,"016877-D",10,"R4",0.83899999999999997,null,"*",null,null,null,null,null,96,"R3",0.87,null,"*",null,null,null,null,null,null,null,null,"OK"]
[596,"WAZEMMES","TERMOTE","ANDRE",80732,"017096-O",3,"R4",1.82,null,"*",null,null,null,null,null,null,null,null,null,null,null,null,null,null,null,null,null,null,"OK"]
[597,null,null,null,null,null,null,null,null,null,null,null,null,null,null,null,null,null,null,null,null,null,null,null,null,null,null,null,null,""]
[598,null,null,null,null,null,null,null,null,null,null,null,null,null,null,null,null,null,null,null,null,null,null,null,null,null,null,null,null,""]
[599,null,null,null,null,null,null,null,null,null,null,null,null,null,null,null,null,null,null,null,null,null,null,null,null,null,null,null,null,""]
[600,null,null,null,null,null,null,null,null,null,null,null,null,null,null,null,null,null,null,null,null,null,null,null,null,null,null,null,null,""]
[601,null,null,null,null,null,null,null,null,null,null,null,null,null,null,null,null,null,null,null,null,null,null,null,null,null,null,null,null,""]
[602,null,null,null,null,null,null,null,null,null,null,null,null,null,null,null,null,null,null,null,null,null,null,null,null,null,null,null,null,""]
[603,null,null,null,null,null,null,null,null,null,null,null,null,null,null,null,null,null,null,null,null,null,null,null,null,null,null,null,null,""]
[604,null,null,null,null,null,null,null,null,null,null,null,null,null,null,null,null,null,null,null,null,null,null,null,null,null,null,null,null,""]
[605,null,null,null,null,null,null,null,null,null,null,null,null,null,null,null,null,null,null,null,null,null,null,null,null,null,null,null,null,""]
[606,null,null,null,null,null,null,null,null,null,null,null,null,null,null,null,null,null,null,null,null,null,null,null,null,null,null,null,null,""]
[607,null,null,null,null,null,null,null,null,null,null,null,null,null,null,null,null,null,null,null,null,null,null,null,null,null,null,null,null,""]
[608,null,null,null,null,null,null,null,null,null,null,null,null,null,null,null,null,null,null,null,null,null,null,null,null,null,null,null,null,""]
[609,null,null,null,null,null,null,null,null,null,null,null,null,null,null,null,null,null,null,null,null,null,null,null,null,null,null,null,null,""]
[610,null,null,null,null,null,null,null,null,null,null,null,null,null,null,null,null,null,null,null,null,null,null,null,null,null,null,null,null,""]
[611,null,null,null,null,null,null,null,null,null,null,null,null,null,null,null,null,null,null,null,null,null,null,null,null,null,null,null,null,""]
[612,null,null,null,null,null,null,null,null,null,null,null,null,null,null,null,null,null,null,null,null,null,null,null,null,null,null,null,null,""]
[613,null,null,null,null,null,null,null,null,null,null,null,null,null,null,null,null,null,null,null,null,null,null,null,null,null,null,null,null,""]
[614,null,null,null,null,null,null,null,null,null,null,null,null,null,null,null,null,null,null,null,null,null,null,null,null,null,null,null,null,""]
[615,null,null,null,null,null,null,null,null,null,null,null,null,null,null,null,null,null,null,null,null,null,null,null,null,null,null,null,null,""]
[616,null,null,null,null,null,null,null,null,null,null,null,null,null,null,null,null,null,null,null,null,null,null,null,null,null,null,null,null,""]
[617,null,null,null,null,null,null,null,null,null,null,null,null,null,null,null,null,null,null,null,null,null,null,null,null,null,null,null,null,""]
[618,null,null,null,null,null,null,null,null,null,null,null,null,null,null,null,null,null,null,null,null,null,null,null,null,null,null,null,null,""]
[619,null,null,null,null,null,null,null,null,null,null,null,null,null,null,null,null,null,null,null,null,null,null,null,null,null,null,null,null,""]
[620,null,null,null,null,null,null,null,null,null,null,null,null,null,null,null,null,null,null,null,null,null,null,null,null,null,null,null,null,""]
[621,null,null,null,null,null,null,null,null,null,null,null,null,null,null,null,null,null,null,null,null,null,null,null,null,null,null,null,null,""]
[622,null,null,null,null,null,null,null,null,null,null,null,null,null,null,null,null,null,null,null,null,null,null,null,null,null,null,null,null,""]
[623,null,null,null,null,null,null,null,null,null,null,null,null,null,null,null,null,null,null,null,null,null,null,null,null,null,null,null,null,""]
[624,null,null,null,null,null,null,null,null,null,null,null,null,null,null,null,null,null,null,null,null,null,null,null,null,null,null,null,null,""]
[625,null,null,null,null,null,null,null,null,null,null,null,null,null,null,null,null,null,null,null,null,null,null,null,null,null,null,null,null,""]
[626,null,null,null,null,null,null,null,null,null,null,null,null,null,null,null,null,null,null,null,null,null,null,null,null,null,null,null,null,""]
[627,null,null,null,null,null,null,null,null,null,null,null,null,null,null,null,null,null,null,null,null,null,null,null,null,null,null,null,null,""]
[628,null,null,null,null,null,null,null,null,null,null,null,null,null,null,null,null,null,null,null,null,null,null,null,null,null,null,null,null,""]
[629,null,null,null,null,null,null,null,null,null,null,null,null,null,null,null,null,null,null,null,null,null,null,null,null,null,null,null,null,""]
[630,null,null,null,null,null,null,null,null,null,null,null,null,null,null,null,null,null,null,null,null,null,null,null,null,null,null,null,null,""]
[631,null,null,null,null,null,null,null,null,null,null,null,null,null,null,null,null,null,null,null,null,null,null,null,null,null,null,null,null,""]
[632,null,null,null,null,null,null,null,null,null,null,null,null,null,null,null,null,null,null,null,null,null,null,null,null,null,null,null,null,""]
[633,null,null,null,null,null,null,null,null,null,null,null,null,null,null,null,null,null,null,null,null,null,null,null,null,null,null,null,null,""]
[634,null,null,null,null,null,null,null,null,null,null,null,null,null,null,null,null,null,null,null,null,null,null,null,null,null,null,null,null,""]
[635,null,null,null,null,null,null,null,null,null,null,null,null,null,null,null,null,null,null,null,null,null,null,null,null,null,null,null,null,""]
[636,null,null,null,null,null,null,null,null,null,null,null,null,null,null,null,null,null,null,null,null,null,null,null,null,null,null,null,null,""]
[637,null,null,null,null,null,null,null,null,null,null,null,null,null,null,null,null,null,null,null,null,null,null,null,null,null,null,null,null,""]
[638,null,null,null,null,null,null,null,null,null,null,null,null,null,null,null,null,null,null,null,null,null,null,null,null,null,null,null,null,""]
[639,null,null,null,null,null,null,null,null,null,null,null,null,null,null,null,null,null,null,null,null,null,null,null,null,null,null,null,null,""]
[640,null,null,null,null,null,null,null,null,null,null,null,null,null,null,null,null,null,null,null,null,null,null,null,null,null,null,null,null,""]
[641,null,null,null,null,null,null,null,null,null,null,null,null,null,null,null,null,null,null,null,null,null,null,null,null,null,null,null,null,""]
[642,null,null,null,null,null,null,null,null,null,null,null,null,null,null,null,null,null,null,null,null,null,null,null,null,null,null,null,null,{"$f":"IF(F643=\"\",\"\",IF(CHAR(65+MOD(LEFT(F643,6),26))=RIGHT(F643,1),\"OK\",\"ERREUR\"))","v":""}]
[643,null,null,null,null,null,null,null,null,null,null,null,null,null,null,null,null,null,null,null,null,null,null,null,null,null,null,null,null,""]
[644,null,null,null,null,null,null,null,null,null,null,null,null,null,null,null,null,null,null,null,null,null,null,null,null,null,null,null,null,""]
[645,null,null,null,null,null,null,null,null,null,null,null,null,null,null,null,null,null,null,null,null,null,null,null,null,null,null,null,null,""]
[646,null,null,null,null,null,null,null,null,null,null,null,null,null,null,null,null,null,null,null,null,null,null,null,null,null,null,null,null,""]
[647,null,null,null,null,null,null,null,null,null,null,null,null,null,null,null,null,null,null,null,null,null,null,null,null,null,null,null,null,""]
[648,null,null,null,null,null,null,null,null,null,null,null,null,null,null,null,null,null,null,null,null,null,null,null,null,null,null,null,null,""]
[649,null,null,null,null,null,null,null,null,null,null,null,null,null,null,null,null,null,null,null,null,null,null,null,null,null,null,null,null,""]
[650,null,null,null,null,null,null,null,null,null,null,null,null,null,null,null,null,null,null,null,null,null,null,null,null,null,null,null,null,""]
[null,null,null,null,null,null,null,null,null,null,null,null,null,null,null,null,null,null,null,null,null,null,null,null,null,null,null,null,null,""]