{"text_format":"1","workbook":"xlsx","n_sheets":4,"sheets":["Finale à 5 Joueurs","Finale à 4 Joueurs","Catégories","Clubs"],"not_rendered":{"charts":0,"images":1,"macros":1,"external_links":0,"defined_names":4,"comments":0,"pivot_tables":0},"unopened":[],"bounds":{"document_bytes":16777216,"sheet_cells":100000,"rows_first":2000,"rows_last":500,"rows_between":2000,"halvings":0,"cell_chars":16384,"cell_head_chars":4096},"cells_cut":0,"cells_raw":0,"read":"whole","date_system":"1900"}

{"sheet":"Finale à 5 Joueurs","index":0,"n_rows":40,"n_cols":16,"rows_kept":40,"cut":false,"hidden":false,"merged":[[1,0,5,0],[6,0,10,0],[11,0,15,0],[16,0,20,0],[21,0,25,0],[0,11,4,13],[36,12,39,15],[27,12,34,15],[16,1,17,1],[19,1,20,1],[21,1,22,1],[24,1,25,1],[0,4,0,5],[1,1,2,1],[4,1,5,1],[6,1,7,1],[9,1,10,1],[11,1,12,1],[14,1,15,1]]}
["Tour","Billard",null,"Joueurs","Match",null,"Car.","Rep.","Moy.","Série",null,"FINALE de LIGUE des HAUTS de FRANCE"]
[1,1,{"$f":"L23","v":2},{"$f":"M23","v":0},{"$f":"IF(G2>G3,\"G\",IF(G2<G3,\"P\",\"N\"))","v":"N"},{"$f":"IF(E2=\"G\",2,IF(E2=\"N\",1,IF(E2=\"P\",0,\"\")))","v":1},null,null,{"$f":"IF(H2>0,G2/H2,\"\")","v":""}]
[null,null,{"$f":"L26","v":5},{"$f":"M26","v":0},{"$f":"IF(G2<G3,\"G\",IF(G2>G3,\"P\",\"N\"))","v":"N"},{"$f":"IF(E3=\"G\",2,IF(E3=\"N\",1,IF(E3=\"P\",0,\"\")))","v":1},null,{"$f":"H2","v":0},{"$f":"IF(H3>0,G3/H3,\"\")","v":""}]
[null,null,{"$f":"L22","v":1},{"$f":"M22","v":0},"Exempt",null,null,null,""]
[null,2,{"$f":"L24","v":3},{"$f":"M24","v":0},{"$f":"IF(G5>G6,\"G\",IF(G5<G6,\"P\",\"N\"))","v":"N"},1,null,null,""]
[null,null,{"$f":"L25","v":4},{"$f":"M25","v":0},{"$f":"IF(G5<G6,\"G\",IF(G5>G6,\"P\",\"N\"))","v":"N"},1,null,{"$f":"H5","v":0},""]
[2,2,{"$f":"L22","v":1},{"$f":"M22","v":0},{"$f":"IF(G7>G8,\"G\",IF(G7<G8,\"P\",\"N\"))","v":"N"},1,null,null,{"$f":"IF(H7>0,G7/H7,\"\")","v":""},null,null,"Date"]
[null,null,{"$f":"L26","v":5},{"$f":"M26","v":0},{"$f":"IF(G7<G8,\"G\",IF(G7>G8,\"P\",\"N\"))","v":"N"},1,null,{"$f":"H7","v":0},{"$f":"IF(H8>0,G8/H8,\"\")","v":""},null,null,"Club"]
[null,null,{"$f":"L25","v":4},{"$f":"M25","v":0},"Exempt",null,null,null,"",null,null,"Nom",{"$f":"IFERROR(VLOOKUP(M8,L_Clubs,2,FALSE),\"\")","v":""}]
[null,1,{"$f":"L23","v":2},{"$f":"M23","v":0},{"$f":"IF(G10>G11,\"G\",IF(G10<G11,\"P\",\"N\"))","v":"N"},1,null,null,"",null,null,"Ville",{"$f":"IFERROR(VLOOKUP(M8,L_Clubs,3,FALSE),\"\")","v":""}]
[null,null,{"$f":"L24","v":3},{"$f":"M24","v":0},{"$f":"IF(G10<G11,\"G\",IF(G10>G11,\"P\",\"N\"))","v":"N"},1,null,{"$f":"H10","v":0},""]
[3,1,{"$f":"L22","v":1},{"$f":"M22","v":0},{"$f":"IF(G12>G13,\"G\",IF(G12<G13,\"P\",\"N\"))","v":"N"},1,null,null,{"$f":"IF(H12>0,G12/H12,\"\")","v":""},null,null,"Catégorie"]
[null,null,{"$f":"L25","v":4},{"$f":"M25","v":0},{"$f":"IF(G12<G13,\"G\",IF(G12>G13,\"P\",\"N\"))","v":"N"},1,null,{"$f":"H12","v":0},{"$f":"IF(H13>0,G13/H13,\"\")","v":""},null,null,"Moyenne",{"$f":"IFERROR(VLOOKUP(M12,L_Categories,2,FALSE),\"\")","v":""},null,"Conversion au"]
[null,null,{"$f":"L23","v":2},{"$f":"M23","v":0},"Exempt",null,null,null,"",null,null,"Distance",{"$f":"IFERROR(VLOOKUP(M12,L_Categories,3,FALSE),\"\")","v":""},null,"format","du billard"]
[null,2,{"$f":"L24","v":3},{"$f":"M24","v":0},{"$f":"IF(G15>G16,\"G\",IF(G15<G16,\"P\",\"N\"))","v":"N"},1,null,null,"",null,null,"Limitation",{"$f":"IFERROR(VLOOKUP(M12,L_Categories,4,FALSE),\"\")","v":""},null,"Min","Max"]
[null,null,{"$f":"L26","v":5},{"$f":"M26","v":0},{"$f":"IF(G15<G16,\"G\",IF(G15>G16,\"P\",\"N\"))","v":"N"},1,null,{"$f":"H15","v":0},"",null,null,"Billard",{"$f":"IFERROR(VLOOKUP(M12,L_Categories,5,FALSE),\"\")","v":""},null,{"$f":"IFERROR(IF(N16<>2.6,VLOOKUP(M12,L_Categories,6,FALSE),VLOOKUP(M12,L_Categories,6,FALSE)/VLOOKUP(M12,L_Categories,8,FALSE)),\"\")","v":""},{"$f":"IFERROR(IF(N16<>2.6,VLOOKUP(M12,L_Categories,7,FALSE),VLOOKUP(M12,L_Categories,7,FALSE)/VLOOKUP(M12,L_Categories,8,FALSE)),\"\")","v":""}]
[4,1,{"$f":"L22","v":1},{"$f":"M22","v":0},{"$f":"IF(G17>G18,\"G\",IF(G17<G18,\"P\",\"N\"))","v":"N"},1,null,null,{"$f":"IF(H17>0,G17/H17,\"\")","v":""}]
[null,null,{"$f":"L24","v":3},{"$f":"M24","v":0},{"$f":"IF(G17<G18,\"G\",IF(G17>G18,\"P\",\"N\"))","v":"N"},1,null,{"$f":"H17","v":0},{"$f":"IF(H18>0,G18/H18,\"\")","v":""}]
[null,null,{"$f":"L26","v":5},{"$f":"M26","v":0},"Exempt",null,null,null,""]
[null,2,{"$f":"L23","v":2},{"$f":"M23","v":0},{"$f":"IF(G20>G21,\"G\",IF(G20<G21,\"P\",\"N\"))","v":"N"},1,null,null,""]
[null,null,{"$f":"L25","v":4},{"$f":"M25","v":0},{"$f":"IF(G20<G21,\"G\",IF(G20>G21,\"P\",\"N\"))","v":"N"},1,null,{"$f":"H20","v":0},"",null,null,"Qualifiés","NOM Prénom","Club","Moy.","Licence"]
[5,2,{"$f":"L22","v":1},0,{"$f":"IF(G22>G23,\"G\",IF(G22<G23,\"P\",\"N\"))","v":"N"},1,null,null,{"$f":"IF(H22>0,G22/H22,\"\")","v":""},null,null,1]
[null,null,2,0,{"$f":"IF(G22<G23,\"G\",IF(G22>G23,\"P\",\"N\"))","v":"N"},1,null,{"$f":"H22","v":0},{"$f":"IF(H23>0,G23/H23,\"\")","v":""},null,null,2]
[null,null,3,0,"Exempt",null,null,null,"",null,null,3]
[null,1,4,0,{"$f":"IF(G25>G26,\"G\",IF(G25<G26,\"P\",\"N\"))","v":"N"},1,null,null,"",null,null,4]
[null,null,5,0,{"$f":"IF(G25<G26,\"G\",IF(G25>G26,\"P\",\"N\"))","v":"N"},1,null,{"$f":"H25","v":0},"",null,null,5]
[]
["Totaux",null,null,null,null,"Pts","Car.","Rep","MG","Série","MP",null,"Les champions de Ligue des catégories Nationales représentent la Ligue des Hauts de France, lors du Championnat de France de la catégorie. En cas d'indisponibilité, la place sera proposé au joueur suivant du classement.\nLe joueur doit s’inscrire sur le site de la fédération :\nhttp://m.ffbillard.com//calendrier.html?filtre_discipline=carambole&filtre_inscription=1\nA la demande du chargé de gestion sportive de la FFB, il faut que les seconds des finales ligues s'inscrivent sur le site fédéral pour pouvoir être retenu comme remplaçant en cas de places vacantes."]
[{"$f":"P22","v":0},null,null,{"$f":"M22","v":0},null,{"$f":"F7+F12+F17+F22","v":4},{"$f":"G7+G12+G17+G22","v":0},{"$f":"H7+H12+H17+H22","v":0},{"$f":"IF(H29>0,G29/H29,\"\")","v":""},{"$f":"MAX(J7,J12,J17,J22)","v":0},{"$f":"MAX(I7,I12,I17,I22)","v":0}]
[{"$f":"P23","v":0},null,null,{"$f":"M23","v":0},null,{"$f":"F2+F10+F20+F23","v":4},{"$f":"G2+G10+G20+G23","v":0},{"$f":"H2+H10+H20+H23","v":0},"",{"$f":"MAX(J2,J10,J20,J23)","v":0},{"$f":"MAX(I2,I10,I20,I23)","v":0}]
[{"$f":"P24","v":0},null,null,{"$f":"M24","v":0},null,{"$f":"F5+F11+F15+F18","v":4},{"$f":"G5+G11+G15+G18","v":0},{"$f":"H5+H11+H15+H18","v":0},"",{"$f":"MAX(J5,J11,J15,J18)","v":0},{"$f":"MAX(I5,I11,I15,I18)","v":0}]
[{"$f":"P25","v":0},null,null,{"$f":"M25","v":0},null,{"$f":"F6+F13+F21+F25","v":4},{"$f":"G6+G13+G21+G25","v":0},{"$f":"H6+H13+H21+H25","v":0},"",{"$f":"MAX(J6,J13,J21,J25)","v":0},{"$f":"MAX(I6,I13,I21,I25)","v":0}]
[{"$f":"P26","v":0},null,null,{"$f":"M26","v":0},null,{"$f":"F3+F8+F16+F26","v":4},{"$f":"G3+G8+G16+G26","v":0},{"$f":"H3+H8+H16+H26","v":0},"",{"$f":"MAX(J3,J8,J16,J26)","v":0},{"$f":"MAX(I3,I8,I16,I26)","v":0}]
[]
["Classement général",null,null,null,null,"Pts","Car.","Rep","MG","Série","MP"]
[0,null,1,0,null,4,0,0,"",0,0]
[0,null,2,0,null,4,0,0,"",0,0,null,"Les champions de Ligue : Libre R1 et R2, Bande R1, 3 Bandes R1\nreprésente la Ligue des Hauts de France, pour la Coupe des Provinces.\nIl doivent confirmer leur présence pour cette compétition.\nEn cas d'indisponibilité, le joueur suivant du classement sera sollicité."]
[0,null,3,0,null,4,0,0,"",0,0]
[0,null,4,0,null,4,0,0,"",0,0]
[0,null,5,0,null,4,0,0,"",0,0]

{"sheet":"Finale à 4 Joueurs","index":1,"n_rows":34,"n_cols":20,"rows_kept":34,"cut":false,"hidden":false,"merged":[[24,13,31,16],[33,13,36,16],[9,1,10,1],[11,1,12,1],[0,4,0,5],[0,12,4,14],[1,1,2,1],[3,1,4,1],[5,1,6,1],[7,1,8,1]]}
["Tour","Billard",null,"Joueurs","Match",null,"Car.","Rep.","Moy.","Série","G/P",null,"FINALE de LIGUE des HAUTS de FRANCE",null,null,null,null,"T1","T2","T3"]
[1,1,{"$f":"M21","v":2},{"$f":"INDIRECT(\"N\"&C2+19)","v":0},{"$f":"IF(G2>G3,\"G\",IF(G2<G3,\"P\",\"N\"))","v":"N"},{"$f":"IF(E2=\"G\",2,IF(E2=\"N\",1,IF(E2=\"P\",0,\"\")))","v":1},null,null,{"$f":"IF(H2>0,G2/H2,\"\")","v":""},null,{"$f":"IF(F2=2,C2,IF(F2=0,C3,IF(F2=1,IF(J2>J3,C2,C3),\"\")))","v":3}]
[null,null,{"$f":"M22","v":3},{"$f":"INDIRECT(\"N\"&C3+19)","v":0},{"$f":"IF(G2<G3,\"G\",IF(G2>G3,\"P\",\"N\"))","v":"N"},{"$f":"IF(E3=\"G\",2,IF(E3=\"N\",1,IF(E3=\"P\",0,\"\")))","v":1},null,{"$f":"H2","v":0},{"$f":"IF(H3>0,G3/H3,\"\")","v":""},null,{"$f":"IF(K2=C3,C2,C3)","v":2}]
[null,2,{"$f":"M20","v":1},{"$f":"INDIRECT(\"N\"&C4+19)","v":0},{"$f":"IF(G4>G5,\"G\",IF(G4<G5,\"P\",\"N\"))","v":"N"},1,null,null,"",null,{"$f":"IF(F4=2,C4,IF(F4=0,C5,IF(F4=1,IF(J4>J5,C4,C5),\"\")))","v":4}]
[null,null,{"$f":"M23","v":4},{"$f":"INDIRECT(\"N\"&C5+19)","v":0},{"$f":"IF(G4<G5,\"G\",IF(G4>G5,\"P\",\"N\"))","v":"N"},1,null,{"$f":"H4","v":0},"",null,{"$f":"IF(K4=C5,C4,C5)","v":1}]
[2,2,{"$f":"K3","v":2},{"$f":"INDIRECT(\"N\"&K3+19)","v":0},{"$f":"IF(G6>G7,\"G\",IF(G6<G7,\"P\",\"N\"))","v":"N"},1,null,null,{"$f":"IF(H6>0,G6/H6,\"\")","v":""}]
[null,null,{"$f":"K5","v":1},{"$f":"INDIRECT(\"N\"&K5+19)","v":0},{"$f":"IF(G6<G7,\"G\",IF(G6>G7,\"P\",\"N\"))","v":"N"},1,null,{"$f":"H6","v":0},{"$f":"IF(H7>0,G7/H7,\"\")","v":""},null,null,null,"Date"]
[null,1,{"$f":"K2","v":3},{"$f":"INDIRECT(\"N\"&K2+19)","v":0},{"$f":"IF(G8>G9,\"G\",IF(G8<G9,\"P\",\"N\"))","v":"N"},1,null,null,"",null,null,null,"Club"]
[null,null,{"$f":"K4","v":4},{"$f":"INDIRECT(\"N\"&K4+19)","v":0},{"$f":"IF(G8<G9,\"G\",IF(G8>G9,\"P\",\"N\"))","v":"N"},1,null,{"$f":"H8","v":0},"",null,null,null,"Nom",{"$f":"IFERROR(VLOOKUP(N8,L_Clubs,2,FALSE),\"\")","v":""}]
[3,1,{"$f":"IF(K5=4,IF(K3=3,2,3),IF(K2=2,3,2))","v":2},{"$f":"INDIRECT(\"N\"&C10+19)","v":0},{"$f":"IF(G10>G11,\"G\",IF(G10<G11,\"P\",\"N\"))","v":"N"},1,null,null,{"$f":"IF(H10>0,G10/H10,\"\")","v":""},null,null,null,"Ville",{"$f":"IFERROR(VLOOKUP(N8,L_Clubs,3,FALSE),\"\")","v":""}]
[null,null,4,{"$f":"INDIRECT(\"N\"&C11+19)","v":0},{"$f":"IF(G10<G11,\"G\",IF(G10>G11,\"P\",\"N\"))","v":"N"},1,null,{"$f":"H10","v":0},{"$f":"IF(H11>0,G11/H11,\"\")","v":""}]
[null,2,1,{"$f":"INDIRECT(\"N\"&C12+19)","v":0},{"$f":"IF(G12>G13,\"G\",IF(G12<G13,\"P\",\"N\"))","v":"N"},1,null,null,"",null,null,null,"Catégorie"]
[null,null,{"$f":"IF(C10=2,3,2)","v":3},{"$f":"INDIRECT(\"N\"&C13+19)","v":0},{"$f":"IF(G12<G13,\"G\",IF(G12>G13,\"P\",\"N\"))","v":"N"},1,null,{"$f":"H12","v":0},"",null,null,null,"Moyenne",{"$f":"IFERROR(VLOOKUP(N12,L_Categories,2,FALSE),\"\")","v":""},null,"Conversion au"]
[null,null,null,null,null,null,null,null,null,null,null,null,"Distance",{"$f":"IFERROR(VLOOKUP(N12,L_Categories,3,FALSE),\"\")","v":""},null,"format","du billard"]
[null,null,null,null,null,null,null,null,null,null,null,null,"Limitation",{"$f":"IFERROR(VLOOKUP(N12,L_Categories,4,FALSE),\"\")","v":""},null,"Min","Max"]
[null,null,null,null,null,null,null,null,null,null,null,null,"Billard",{"$f":"IFERROR(VLOOKUP(N12,L_Categories,5,FALSE),\"\")","v":""},null,{"$f":"IFERROR(IF(O16<>2.6,VLOOKUP(N12,L_Categories,6,FALSE),VLOOKUP(N12,L_Categories,6,FALSE)/VLOOKUP(N12,L_Categories,8,FALSE)),\"\")","v":""},{"$f":"IFERROR(IF(O16<>2.6,VLOOKUP(N12,L_Categories,7,FALSE),VLOOKUP(N12,L_Categories,7,FALSE)/VLOOKUP(N12,L_Categories,8,FALSE)),\"\")","v":""}]
["Totaux",null,null,null,null,"Pts","Car.","Rep","MG","Série","MP"]
[{"$f":"Q20","v":0},null,null,{"$f":"N20","v":0},null,{"$f":"SUM(INDIRECT(\"F\"&$R20),INDIRECT(\"F\"&$S20),INDIRECT(\"F\"&$T20))","v":3},{"$f":"SUM(INDIRECT(\"G\"&$R20),INDIRECT(\"G\"&$S20),INDIRECT(\"G\"&$T20))","v":0},{"$f":"SUM(INDIRECT(\"H\"&$R20),INDIRECT(\"H\"&$S20),INDIRECT(\"H\"&$T20))","v":0},{"$f":"IF(H18>0,G18/H18,\"\")","v":""},{"$f":"MAX(INDIRECT(\"J\"&$R20),INDIRECT(\"J\"&$S20),INDIRECT(\"J\"&$T20))","v":0},{"$f":"MAX(INDIRECT(\"I\"&$R20),INDIRECT(\"I\"&$S20),INDIRECT(\"I\"&$T20))","v":0}]
[{"$f":"Q21","v":0},null,null,{"$f":"N21","v":0},null,{"$f":"SUM(INDIRECT(\"F\"&$R21),INDIRECT(\"F\"&$S21),INDIRECT(\"F\"&$T21))","v":3},{"$f":"SUM(INDIRECT(\"G\"&$R21),INDIRECT(\"G\"&$S21),INDIRECT(\"G\"&$T21))","v":0},{"$f":"SUM(INDIRECT(\"H\"&$R21),INDIRECT(\"H\"&$S21),INDIRECT(\"H\"&$T21))","v":0},{"$f":"IF(H19>0,G19/H19,\"\")","v":""},{"$f":"MAX(INDIRECT(\"J\"&$R21),INDIRECT(\"J\"&$S21),INDIRECT(\"J\"&$T21))","v":0},{"$f":"MAX(INDIRECT(\"I\"&$R21),INDIRECT(\"I\"&$S21),INDIRECT(\"I\"&$T21))","v":0},null,"Qualifiés","NOM Prénom","Club","Moy.","Licence"]
[0,null,null,{"$f":"N22","v":0},null,{"$f":"SUM(INDIRECT(\"F\"&$R22),INDIRECT(\"F\"&$S22),INDIRECT(\"F\"&$T22))","v":3},{"$f":"SUM(INDIRECT(\"G\"&$R22),INDIRECT(\"G\"&$S22),INDIRECT(\"G\"&$T22))","v":0},{"$f":"SUM(INDIRECT(\"H\"&$R22),INDIRECT(\"H\"&$S22),INDIRECT(\"H\"&$T22))","v":0},{"$f":"IF(H20>0,G20/H20,\"\")","v":""},{"$f":"MAX(INDIRECT(\"J\"&$R22),INDIRECT(\"J\"&$S22),INDIRECT(\"J\"&$T22))","v":0},{"$f":"MAX(INDIRECT(\"I\"&$R22),INDIRECT(\"I\"&$S22),INDIRECT(\"I\"&$T22))","v":0},null,1,null,null,null,null,4,{"$f":"IF(C6=M20,6,IF(C7=M20,7,IF(C8=M20,8,9)))","v":7},{"$f":"IF(C10=M20,10,IF(C11=M20,11,IF(C12=M20,12,13)))","v":12}]
[0,null,null,{"$f":"N23","v":0},null,{"$f":"SUM(INDIRECT(\"F\"&$R23),INDIRECT(\"F\"&$S23),INDIRECT(\"F\"&$T23))","v":3},{"$f":"SUM(INDIRECT(\"G\"&$R23),INDIRECT(\"G\"&$S23),INDIRECT(\"G\"&$T23))","v":0},{"$f":"SUM(INDIRECT(\"H\"&$R23),INDIRECT(\"H\"&$S23),INDIRECT(\"H\"&$T23))","v":0},{"$f":"IF(H21>0,G21/H21,\"\")","v":""},{"$f":"MAX(INDIRECT(\"J\"&$R23),INDIRECT(\"J\"&$S23),INDIRECT(\"J\"&$T23))","v":0},{"$f":"MAX(INDIRECT(\"I\"&$R23),INDIRECT(\"I\"&$S23),INDIRECT(\"I\"&$T23))","v":0},null,2,null,null,null,null,2,{"$f":"IF(C6=M21,6,IF(C7=M21,7,IF(C8=M21,8,9)))","v":6},{"$f":"IF(C10=M21,10,IF(C11=M21,11,IF(C12=M21,12,13)))","v":10}]
[null,null,null,null,null,null,null,null,null,null,null,null,3,null,null,null,null,3,{"$f":"IF(C6=M22,6,IF(C7=M22,7,IF(C8=M22,8,9)))","v":8},{"$f":"IF(C10=M22,10,IF(C11=M22,11,IF(C12=M22,12,13)))","v":13}]
[null,null,null,null,null,null,null,null,null,null,null,null,4,null,null,null,null,5,{"$f":"IF(C6=M23,6,IF(C7=M23,7,IF(C8=M23,8,9)))","v":9},{"$f":"IF(C10=M23,10,IF(C11=M23,11,IF(C12=M23,12,13)))","v":11}]
[]
["Classement général",null,null,null,null,"Pts","Car.","Rep","MG","Série","MP",null,null,"Les champions de Ligue des catégories Nationales représentent la Ligue des Hauts de France, lors du Championnat de France de la catégorie. En cas d'indisponibilité, la place sera proposé au joueur suivant du classement.\nLe joueur doit s’inscrire sur le site de la fédération :\nhttp://m.ffbillard.com//calendrier.html?filtre_discipline=carambole&filtre_inscription=1\nA la demande du chargé de gestion sportive de la FFB, il faut que les seconds des finales ligues s'inscrivent sur le site fédéral pour pouvoir être retenu comme remplaçant en cas de places vacantes."]
[0,null,1,0,null,3,0,0,"",0,0]
[0,null,2,0,null,3,0,0,"",0,0]
[0,null,3,0,null,3,0,0,"",0,0]
[0,null,4,0,null,3,0,0,"",0,0]
[]
[]
[]
[]
[null,null,null,null,null,null,null,null,null,null,null,null,null,"Les champions de Ligue : Libre R1 et R2, Bande R1, 3 Bandes R1\nreprésente la Ligue des Hauts de France, pour la Coupe des Provinces.\nIl doivent confirmer leur présence pour cette compétition.\nEn cas d'indisponibilité, le joueur suivant du classement sera sollicité."]

{"sheet":"Catégories","index":2,"n_rows":20,"n_cols":11,"rows_kept":20,"cut":false,"hidden":false,"merged":[]}
["Catégories","Moyennes","Distances","Limitation reprises","Format","Min","Max","Conv. 2,60",null,null,"Format Billard"]
["LIBRE   Nationale 1","10  à  29,99","300 pts GC","NON","Gd Format",10,29.99,1,null,null,3.1]
["LIBRE   Nationale 3","6  à  12,49","200 pts GC","NON","1/2 Format",6,12.49,1,null,null,2.8]
["LIBRE   Régionale 1","4  à  5,99","150 pts","NON","1/2 Format",4,5.99,0.8,null,null,2.6]
["LIBRE   Régionale 2","2,30  à  3,99","100 pts","NON","1/2 Format",2.2999999999999998,3.99,0.8]
["LIBRE   Régionale 3","1,20  à  2,29","70 pts","NON","1/2 Format",1.2,2.29,0.8]
["LIBRE   Régionale 4","0  à  1,19","50 pts","NON","1/2 Format",0,1.19,0.8]
["CADRE   Nationale 1","10  à  19,99","200 pts","NON","Gd Format",10,1.99,1]
["CADRE   Nationale 2","5  à 9,99","120 pts","NON","Gd Format",5,9.99,1]
["CADRE   Nationale 3","3,50  à  6,24","120 pts","NON","1/2 Format",3.5,6.24,0.9]
["CADRE   Régionale ","0  à  3,49","80 pts","NON","1/2 Format",0,3.49,0.9]
["1  BANDE   Nationale  1","2,30  à  4,99","100 pts","NON","Gd Format",2.2999999999999998,4.99,1]
["1  BANDE   Nationale  3","1,75  à  2,57","80 pts","NON","1/2 Format",1.75,2.57,0.8]
["1  BANDE   Régionale 1","1,00  à  1,74","60 pts","NON","1/2 Format",1,1.74,0.8]
["1  BANDE   Régionale 2","0  à  0,99","40 pts","NON","1/2 Format",0,0.99,0.8]
["3  BANDES   Nationale  1","0,600 à 0,949","35 pts","NON","Gd Format",0.6,0.94899999999999995,1]
["3  BANDES   Nationale  2","0,450  à  0,599","30 pts","NON","Gd Format",0.45,0.59899999999999998,1]
["3  BANDES   Nationale  3","0,360  à  0,522","25 pts    ","60 Rep.","1/2 Format",0.36,0.52200000000000002,0.91]
["3  BANDES   Régionale 1","0,250  à  0,359","20 pts    ","60 Rep.","1/2 Format",0.25,0.35899999999999999,0.91]
["3  BANDES   Régionale 2","0  à  0,249","15 pts    ","60 Rep.","1/2 Format",0,0.249,0.91]

{"sheet":"Clubs","index":3,"n_rows":55,"n_cols":3,"rows_kept":55,"cut":false,"hidden":false,"merged":[]}
["Numero","Nom","Ville"]
[13102,"BILLARD CLUB AVION","AVION"]
[13103,"BILLARD CLUB BILLY MONTIGNY","BILLY MONTIGNY"]
[13104,"BILLARD CLUB CARVIN","CARVIN"]
[13107,"AMICALE BILLARD CLUB DOUAI","DOUAI"]
[13108,"LE POOL PERENCHINOIS","PERENCHIES"]
[13110,"SPORT BILLARD CLUB ANNOEULLINOIS","ANNOEULLIN"]
[13117,"BILLARD CLUB DIVIONNAIS","DIVION"]
[13124,"COURRIERES SPORT BILLARD","COURRIERES"]
[13231,"BILLARD CLUB HOUPLINES","HOUPLINES"]
[13236,"BILLARD FRANCAIS VILLENEUVE D ASCQ","VILLENEUVE D ASCQ"]
[13240,"B.C. DU CANON D OR","RONCHIN"]
[13251,"BILLARD CLUB CHAPELLOIS","LA CHAPELLE D ARMENTIERES"]
[13252,"BILLARD CLUB ESTAIROIS","ESTAIRES"]
[13353,"U.S DUNKERQUOISE","DUNKERQUE"]
[13355,"U.S GRAVELINOISE","GRAVELINES"]
[13356,"BILLARD CLUB OUTREAU","OUTREAU"]
[13363,"BILLARD CLUB DE CUCQ","CUCQ"]
[13364,"ACADEMIE CALAISIENNE DE BILLARD","CALAIS"]
[13365,"OLYMPIQUE GRANDE-SYNTHE","GRANDE SYNTHE"]
[13368,"BILLARD CLUB DE WIMILLE","WIMILLE"]
[13369,"WIZERNES BILLARD CLUB","WIZERNES"]
[13370,"LE TOUQUET BILLARD CLUB","LE TOUQUET PARIS PLAGE"]
[13478,"ACADEMIE LA CARAMBOLE","DENAIN"]
[13481,"BILLARD CLUB BRUAYSIEN","BRUAY SUR ESCAUT"]
[13602,"LE POOL FLAMAND","HAZEBROUCK"]
[13612,"BILLARD CLUB ARRAS","ARRAS"]
[13618,"PASSION BILLARD CAMBRAI","CAMBRAI"]
[17001,"CHAUNY BON ACCUEIL","CHAUNY"]
[17003,"CHAUNY ACADEMIE DE BILLARD","CHAUNY"]
[17006,"BILLARD CLUB LAON","LAON"]
[17007,"BILLARD CLUB NOYON","NOYON"]
[17010,"ACADEMIE DE BILLARD SAINT QUENTIN","ST QUENTIN"]
[17011,"SOISSONS BILLARD CLUB","SOISSONS"]
[17012,"VAUDESSON BILLARD CLUB","VAUDESSON"]
[17020,"ACADEMIE DE BILLARD DE TERGNIER","TERGNIER"]
[17026,"A S BEAUVAIS","BEAUVAIS"]
[17030,"BILLARD CLUB CREPY EN VALOIS","CREPY EN VALOIS"]
[17031,"BILLARD CLUB MERUVIEN","MERU"]
[17033,"BILLARD CLUB MONTATAIRE","MONTATAIRE"]
[17035,"BILLARD CLUB SAINT JUST EN CHAUSSEE","ST JUST EN CHAUSSEE"]
[17036,"BC SENLIS","SENLIS"]
[17037,"VILLERS ST PAUL","VILLERS ST PAUL"]
[17039,"BILLARD CLUB DE GOUVIEUX","GOUVIEUX"]
[17040,"BILLARD CLUB CREVECOEUR","CREVECOEUR LE GRAND"]
[17041,"BILLARD CLUB MUNICIPAL CAMBLYSIEN","CHAMBLY"]
[17045,"BILLARD CLUB LIANCOURTOIS","LIANCOURT"]
[17051,"BILLARD CLUB RETRO ALBERTIN","ALBERT"]
[17053,"AMIENS PICARDIE BILLARD","AMIENS"]
[17059,"A.B.C. PONT DE METZ","PONT DE METZ"]
[17060,"BILLARD CLUB ROYE","ROYE"]
[17061,"BILLARD CLUB VIGNACOURT","VIGNACOURT"]
[17062,"BILLARD CLUB FRIVILLE BELLOY","FRIVILLE ESCARBOTIN"]
[17063,"BILLARD CLUB MOREUIL","MOREUIL"]
[17064,"SPORTING CLUB BILLARD ABBEVILLOIS","ABBEVILLE"]